phoenix-commits mailing list archives

Site index · List index
Message view « Date » · « Thread »
Top « Date » · « Thread »
From Apache Jenkins Server <jenk...@builds.apache.org>
Subject Build failed in Jenkins: Phoenix | 3.0 | Hadoop1 #85
Date Sun, 25 May 2014 21:42:06 GMT
See <https://builds.apache.org/job/Phoenix-3.0-hadoop1/85/>

------------------------------------------
[...truncated 326 lines...]
Running org.apache.phoenix.util.ScanUtilTest
Tests run: 20, Failures: 0, Errors: 0, Skipped: 0, Time elapsed: 0.037 sec - in org.apache.phoenix.util.ScanUtilTest
Running org.apache.phoenix.util.ByteUtilTest
Tests run: 1, Failures: 0, Errors: 0, Skipped: 0, Time elapsed: 0.14 sec - in org.apache.phoenix.util.PhoenixRuntimeTest
Running org.apache.phoenix.mapreduce.CsvToKeyValueMapperTest
Tests run: 5, Failures: 0, Errors: 0, Skipped: 0, Time elapsed: 0.201 sec - in org.apache.phoenix.util.csv.CsvUpsertExecutorTest
Running org.apache.phoenix.mapreduce.CsvBulkLoadToolTest
Tests run: 8, Failures: 0, Errors: 0, Skipped: 0, Time elapsed: 0.028 sec - in org.apache.phoenix.mapreduce.CsvBulkLoadToolTest
Running org.apache.phoenix.mapreduce.CsvBulkImportUtilTest
Tests run: 2, Failures: 0, Errors: 0, Skipped: 0, Time elapsed: 0.082 sec - in org.apache.phoenix.mapreduce.CsvBulkImportUtilTest
Tests run: 3, Failures: 0, Errors: 0, Skipped: 0, Time elapsed: 0.183 sec - in org.apache.phoenix.util.ByteUtilTest
Running org.apache.phoenix.query.HBaseFactoryProviderTest
Tests run: 3, Failures: 0, Errors: 0, Skipped: 0, Time elapsed: 0.001 sec - in org.apache.phoenix.query.HBaseFactoryProviderTest
Running org.apache.phoenix.index.IndexMaintainerTest
Running org.apache.phoenix.query.ConnectionlessUpsertTest
Tests run: 8, Failures: 0, Errors: 0, Skipped: 0, Time elapsed: 0.239 sec - in org.apache.phoenix.mapreduce.CsvToKeyValueMapperTest
Running org.apache.phoenix.arithmetic.ArithmeticOperationTest
Tests run: 5, Failures: 0, Errors: 0, Skipped: 0, Time elapsed: 0.009 sec - in org.apache.phoenix.arithmetic.ArithmeticOperationTest
Tests run: 3, Failures: 0, Errors: 0, Skipped: 0, Time elapsed: 0.144 sec - in org.apache.phoenix.query.ConnectionlessUpsertTest
Tests run: 23, Failures: 0, Errors: 0, Skipped: 0, Time elapsed: 0.705 sec - in org.apache.phoenix.index.IndexMaintainerTest
Tests run: 5, Failures: 0, Errors: 0, Skipped: 1, Time elapsed: 6.018 sec - in org.apache.phoenix.memory.MemoryManagerTest

Results :

Tests run: 724, Failures: 0, Errors: 0, Skipped: 3

[INFO] 
[INFO] --- maven-source-plugin:2.2.1:jar-no-fork (attach-sources) @ phoenix-core ---
[INFO] Building jar: <https://builds.apache.org/job/Phoenix-3.0-hadoop1/85/artifact/phoenix-core/target/phoenix-core-3.0.0-incubating-sources.jar>
[INFO] 
[INFO] --- maven-jar-plugin:2.4:test-jar (default) @ phoenix-core ---
[INFO] Building jar: <https://builds.apache.org/job/Phoenix-3.0-hadoop1/85/artifact/phoenix-core/target/phoenix-core-3.0.0-incubating-tests.jar>
[INFO] 
[INFO] --- maven-jar-plugin:2.4:jar (default-jar) @ phoenix-core ---
[INFO] Building jar: <https://builds.apache.org/job/Phoenix-3.0-hadoop1/85/artifact/phoenix-core/target/phoenix-core-3.0.0-incubating.jar>
[INFO] 
[INFO] --- maven-site-plugin:3.2:attach-descriptor (attach-descriptor) @ phoenix-core ---
[INFO] 
[INFO] --- maven-failsafe-plugin:2.17:integration-test (ClientManagedTimeTests) @ phoenix-core
---
[INFO] Failsafe report directory: <https://builds.apache.org/job/Phoenix-3.0-hadoop1/ws/phoenix-core/target/failsafe-reports>
[INFO] parallel='none', perCoreThreadCount=true, threadCount=0, useUnlimitedThreads=false,
threadCountSuites=0, threadCountClasses=0, threadCountMethods=0, parallelOptimized=true

-------------------------------------------------------
 T E S T S
-------------------------------------------------------
Running org.apache.phoenix.end2end.VariableLengthPKIT
Tests run: 49, Failures: 0, Errors: 0, Skipped: 0, Time elapsed: 43.242 sec - in org.apache.phoenix.end2end.VariableLengthPKIT
Running org.apache.phoenix.end2end.CaseStatementIT
Tests run: 136, Failures: 0, Errors: 0, Skipped: 0, Time elapsed: 100.437 sec - in org.apache.phoenix.end2end.CaseStatementIT
Running org.apache.phoenix.end2end.CompareDecimalToLongIT
Tests run: 8, Failures: 0, Errors: 0, Skipped: 0, Time elapsed: 7.727 sec - in org.apache.phoenix.end2end.CompareDecimalToLongIT
Running org.apache.phoenix.end2end.CreateTableIT
Tests run: 9, Failures: 0, Errors: 0, Skipped: 0, Time elapsed: 69.21 sec - in org.apache.phoenix.end2end.CreateTableIT
Running org.apache.phoenix.end2end.TenantSpecificTablesDDLIT
Tests run: 16, Failures: 0, Errors: 0, Skipped: 0, Time elapsed: 59.68 sec - in org.apache.phoenix.end2end.TenantSpecificTablesDDLIT
Running org.apache.phoenix.end2end.ProductMetricsIT
Tests run: 61, Failures: 0, Errors: 0, Skipped: 0, Time elapsed: 37.351 sec - in org.apache.phoenix.end2end.ProductMetricsIT
Running org.apache.phoenix.end2end.SpooledOrderByIT
Tests run: 3, Failures: 0, Errors: 0, Skipped: 1, Time elapsed: 8.681 sec - in org.apache.phoenix.end2end.SpooledOrderByIT
Running org.apache.phoenix.end2end.OrderByIT
Tests run: 3, Failures: 0, Errors: 0, Skipped: 1, Time elapsed: 10.933 sec - in org.apache.phoenix.end2end.OrderByIT
Running org.apache.phoenix.end2end.PercentileIT
Tests run: 17, Failures: 0, Errors: 0, Skipped: 0, Time elapsed: 19.816 sec - in org.apache.phoenix.end2end.PercentileIT
Running org.apache.phoenix.end2end.salted.SaltedTableIT
Tests run: 8, Failures: 0, Errors: 0, Skipped: 0, Time elapsed: 7.724 sec - in org.apache.phoenix.end2end.salted.SaltedTableIT
Running org.apache.phoenix.end2end.salted.SaltedTableVarLengthRowKeyIT
Tests run: 1, Failures: 0, Errors: 0, Skipped: 0, Time elapsed: 4.709 sec - in org.apache.phoenix.end2end.salted.SaltedTableVarLengthRowKeyIT
Running org.apache.phoenix.end2end.StddevIT
Tests run: 4, Failures: 0, Errors: 0, Skipped: 0, Time elapsed: 8.717 sec - in org.apache.phoenix.end2end.StddevIT
Running org.apache.phoenix.end2end.StatsManagerIT
Tests run: 1, Failures: 0, Errors: 0, Skipped: 0, Time elapsed: 21.954 sec - in org.apache.phoenix.end2end.StatsManagerIT
Running org.apache.phoenix.end2end.CastAndCoerceIT
Tests run: 124, Failures: 0, Errors: 0, Skipped: 0, Time elapsed: 96.97 sec - in org.apache.phoenix.end2end.CastAndCoerceIT
Running org.apache.phoenix.end2end.DistinctCountIT
Tests run: 9, Failures: 0, Errors: 0, Skipped: 0, Time elapsed: 13.952 sec - in org.apache.phoenix.end2end.DistinctCountIT
Running org.apache.phoenix.end2end.ScanQueryIT
Tests run: 168, Failures: 0, Errors: 0, Skipped: 0, Time elapsed: 126.215 sec - in org.apache.phoenix.end2end.ScanQueryIT
Running org.apache.phoenix.end2end.ReadIsolationLevelIT
Tests run: 2, Failures: 0, Errors: 0, Skipped: 0, Time elapsed: 5.337 sec - in org.apache.phoenix.end2end.ReadIsolationLevelIT
Running org.apache.phoenix.end2end.DefaultParallelIteratorsRegionSplitterIT
Tests run: 2, Failures: 0, Errors: 0, Skipped: 0, Time elapsed: 7.232 sec - in org.apache.phoenix.end2end.DefaultParallelIteratorsRegionSplitterIT
Running org.apache.phoenix.end2end.GroupByCaseIT
Tests run: 3, Failures: 0, Errors: 0, Skipped: 0, Time elapsed: 5.131 sec - in org.apache.phoenix.end2end.GroupByCaseIT
Running org.apache.phoenix.end2end.TruncateFunctionIT
Tests run: 1, Failures: 0, Errors: 0, Skipped: 0, Time elapsed: 5.312 sec - in org.apache.phoenix.end2end.TruncateFunctionIT
Running org.apache.phoenix.end2end.FunkyNamesIT
Tests run: 3, Failures: 0, Errors: 0, Skipped: 0, Time elapsed: 13.276 sec - in org.apache.phoenix.end2end.FunkyNamesIT
Running org.apache.phoenix.end2end.NativeHBaseTypesIT
Tests run: 7, Failures: 0, Errors: 0, Skipped: 0, Time elapsed: 6.163 sec - in org.apache.phoenix.end2end.NativeHBaseTypesIT
Running org.apache.phoenix.end2end.CoalesceFunctionIT
Tests run: 1, Failures: 0, Errors: 0, Skipped: 0, Time elapsed: 7.568 sec - in org.apache.phoenix.end2end.CoalesceFunctionIT
Running org.apache.phoenix.end2end.QueryIT
Tests run: 100, Failures: 0, Errors: 0, Skipped: 0, Time elapsed: 95.245 sec - in org.apache.phoenix.end2end.QueryIT
Running org.apache.phoenix.end2end.ToCharFunctionIT
Tests run: 10, Failures: 0, Errors: 0, Skipped: 0, Time elapsed: 7.224 sec - in org.apache.phoenix.end2end.ToCharFunctionIT
Running org.apache.phoenix.end2end.UpsertSelectIT
Tests run: 11, Failures: 0, Errors: 0, Skipped: 0, Time elapsed: 65.506 sec - in org.apache.phoenix.end2end.UpsertSelectIT
Running org.apache.phoenix.end2end.ToNumberFunctionIT
Tests run: 18, Failures: 0, Errors: 0, Skipped: 0, Time elapsed: 8.432 sec - in org.apache.phoenix.end2end.ToNumberFunctionIT
Running org.apache.phoenix.end2end.IsNullIT
Tests run: 2, Failures: 0, Errors: 0, Skipped: 0, Time elapsed: 9.136 sec - in org.apache.phoenix.end2end.IsNullIT
Running org.apache.phoenix.end2end.ExtendedQueryExecIT
Tests run: 4, Failures: 0, Errors: 0, Skipped: 0, Time elapsed: 7.521 sec - in org.apache.phoenix.end2end.ExtendedQueryExecIT
Running org.apache.phoenix.end2end.TopNIT
Tests run: 4, Failures: 0, Errors: 0, Skipped: 0, Time elapsed: 10.319 sec - in org.apache.phoenix.end2end.TopNIT
Running org.apache.phoenix.end2end.QueryDatabaseMetaDataIT
Tests run: 15, Failures: 0, Errors: 0, Skipped: 0, Time elapsed: 78.557 sec - in org.apache.phoenix.end2end.QueryDatabaseMetaDataIT
Running org.apache.phoenix.end2end.SkipRangeParallelIteratorRegionSplitterIT
Tests run: 8, Failures: 0, Errors: 0, Skipped: 0, Time elapsed: 9.559 sec - in org.apache.phoenix.end2end.SkipRangeParallelIteratorRegionSplitterIT
Running org.apache.phoenix.end2end.UpsertValuesIT
Tests run: 12, Failures: 0, Errors: 0, Skipped: 0, Time elapsed: 36.149 sec - in org.apache.phoenix.end2end.UpsertValuesIT
Running org.apache.phoenix.end2end.TenantSpecificTablesDMLIT
Tests run: 14, Failures: 0, Errors: 0, Skipped: 0, Time elapsed: 30.149 sec - in org.apache.phoenix.end2end.TenantSpecificTablesDMLIT
Running org.apache.phoenix.end2end.DynamicUpsertIT
Tests run: 7, Failures: 0, Errors: 0, Skipped: 0, Time elapsed: 5.254 sec - in org.apache.phoenix.end2end.DynamicUpsertIT
Running org.apache.phoenix.end2end.CustomEntityDataIT
Tests run: 3, Failures: 0, Errors: 0, Skipped: 0, Time elapsed: 6.479 sec - in org.apache.phoenix.end2end.CustomEntityDataIT
Running org.apache.phoenix.end2end.ClientTimeArithmeticQueryIT
Tests run: 216, Failures: 0, Errors: 0, Skipped: 0, Time elapsed: 164.048 sec - in org.apache.phoenix.end2end.ClientTimeArithmeticQueryIT
Running org.apache.phoenix.end2end.MultiCfQueryExecIT
Tests run: 7, Failures: 0, Errors: 0, Skipped: 0, Time elapsed: 17.664 sec - in org.apache.phoenix.end2end.MultiCfQueryExecIT
Running org.apache.phoenix.end2end.InMemoryOrderByIT
Tests run: 3, Failures: 0, Errors: 0, Skipped: 1, Time elapsed: 8.047 sec - in org.apache.phoenix.end2end.InMemoryOrderByIT
Running org.apache.phoenix.end2end.ArrayIT
Tests run: 39, Failures: 0, Errors: 0, Skipped: 0, Time elapsed: 71.739 sec - in org.apache.phoenix.end2end.ArrayIT
Running org.apache.phoenix.end2end.DerivedTableIT
Tests run: 16, Failures: 0, Errors: 0, Skipped: 0, Time elapsed: 31.02 sec - in org.apache.phoenix.end2end.DerivedTableIT
Running org.apache.phoenix.end2end.GroupByIT
Tests run: 152, Failures: 0, Errors: 0, Skipped: 0, Time elapsed: 134.605 sec - in org.apache.phoenix.end2end.GroupByIT
Running org.apache.phoenix.end2end.NotQueryIT
Tests run: 144, Failures: 0, Errors: 0, Skipped: 0, Time elapsed: 135.417 sec - in org.apache.phoenix.end2end.NotQueryIT
Running org.apache.phoenix.end2end.KeyOnlyIT
Tests run: 2, Failures: 0, Errors: 0, Skipped: 0, Time elapsed: 12.319 sec - in org.apache.phoenix.end2end.KeyOnlyIT
Running org.apache.phoenix.end2end.DynamicColumnIT
Tests run: 5, Failures: 0, Errors: 0, Skipped: 0, Time elapsed: 4.85 sec - in org.apache.phoenix.end2end.DynamicColumnIT
Running org.apache.phoenix.end2end.RowValueConstructorIT
Tests run: 25, Failures: 0, Errors: 0, Skipped: 0, Time elapsed: 34.223 sec - in org.apache.phoenix.end2end.RowValueConstructorIT
Running org.apache.phoenix.end2end.SequenceIT
Tests run: 21, Failures: 0, Errors: 0, Skipped: 0, Time elapsed: 29.844 sec - in org.apache.phoenix.end2end.SequenceIT
Running org.apache.phoenix.end2end.ColumnProjectionOptimizationIT
Tests run: 2, Failures: 0, Errors: 0, Skipped: 0, Time elapsed: 14.278 sec - in org.apache.phoenix.end2end.ColumnProjectionOptimizationIT

Results :

Tests run: 1476, Failures: 0, Errors: 0, Skipped: 3

[INFO] 
[INFO] --- maven-failsafe-plugin:2.17:integration-test (HBaseManagedTimeTests) @ phoenix-core
---
[INFO] Failsafe report directory: <https://builds.apache.org/job/Phoenix-3.0-hadoop1/ws/phoenix-core/target/failsafe-reports>
[INFO] parallel='none', perCoreThreadCount=true, threadCount=0, useUnlimitedThreads=false,
threadCountSuites=0, threadCountClasses=0, threadCountMethods=0, parallelOptimized=true

-------------------------------------------------------
 T E S T S
-------------------------------------------------------
Running org.apache.phoenix.end2end.BinaryRowKeyIT
Tests run: 3, Failures: 0, Errors: 0, Skipped: 0, Time elapsed: 5.42 sec - in org.apache.phoenix.end2end.BinaryRowKeyIT
Running org.apache.phoenix.end2end.SpillableGroupByIT
Tests run: 1, Failures: 0, Errors: 0, Skipped: 0, Time elapsed: 5.309 sec - in org.apache.phoenix.end2end.SpillableGroupByIT
Running org.apache.phoenix.end2end.MD5FunctionIT
Tests run: 2, Failures: 0, Errors: 0, Skipped: 0, Time elapsed: 8.337 sec - in org.apache.phoenix.end2end.MD5FunctionIT
Running org.apache.phoenix.end2end.AutoCommitIT
Tests run: 1, Failures: 0, Errors: 0, Skipped: 0, Time elapsed: 4.789 sec - in org.apache.phoenix.end2end.AutoCommitIT
Running org.apache.phoenix.end2end.SortOrderFIT
Tests run: 29, Failures: 0, Errors: 0, Skipped: 0, Time elapsed: 7.656 sec - in org.apache.phoenix.end2end.SortOrderFIT
Running org.apache.phoenix.end2end.AlterTableIT
Tests run: 13, Failures: 0, Errors: 0, Skipped: 0, Time elapsed: 47.936 sec - in org.apache.phoenix.end2end.AlterTableIT
Running org.apache.phoenix.end2end.TenantSpecificViewIndexIT
Tests run: 3, Failures: 0, Errors: 0, Skipped: 0, Time elapsed: 16.699 sec - in org.apache.phoenix.end2end.TenantSpecificViewIndexIT
Running org.apache.phoenix.end2end.SaltedViewIT
Tests run: 1, Failures: 0, Errors: 0, Skipped: 0, Time elapsed: 12.853 sec - in org.apache.phoenix.end2end.SaltedViewIT
Running org.apache.phoenix.end2end.UpsertBigValuesIT
Tests run: 4, Failures: 0, Errors: 0, Skipped: 0, Time elapsed: 15.501 sec - in org.apache.phoenix.end2end.UpsertBigValuesIT
Running org.apache.phoenix.end2end.HashJoinIT
Tests run: 60, Failures: 0, Errors: 0, Skipped: 0, Time elapsed: 78.568 sec - in org.apache.phoenix.end2end.HashJoinIT
Running org.apache.phoenix.end2end.salted.SaltedTableUpsertSelectIT
Tests run: 5, Failures: 0, Errors: 0, Skipped: 0, Time elapsed: 12.902 sec - in org.apache.phoenix.end2end.salted.SaltedTableUpsertSelectIT
Running org.apache.phoenix.end2end.TimezoneOffsetFunctionIT
Tests run: 6, Failures: 0, Errors: 0, Skipped: 0, Time elapsed: 5.22 sec - in org.apache.phoenix.end2end.TimezoneOffsetFunctionIT
Running org.apache.phoenix.end2end.QueryExecWithoutSCNIT
Tests run: 1, Failures: 0, Errors: 0, Skipped: 0, Time elapsed: 5.906 sec - in org.apache.phoenix.end2end.QueryExecWithoutSCNIT
Running org.apache.phoenix.end2end.ReverseFunctionIT
Tests run: 5, Failures: 0, Errors: 0, Skipped: 0, Time elapsed: 4.614 sec - in org.apache.phoenix.end2end.ReverseFunctionIT
Running org.apache.phoenix.end2end.UpsertSelectAutoCommitIT
Tests run: 2, Failures: 0, Errors: 0, Skipped: 0, Time elapsed: 17.878 sec - in org.apache.phoenix.end2end.UpsertSelectAutoCommitIT
Running org.apache.phoenix.end2end.DeleteIT
Tests run: 15, Failures: 0, Errors: 0, Skipped: 0, Time elapsed: 23.42 sec - in org.apache.phoenix.end2end.DeleteIT
Running org.apache.phoenix.end2end.ArithmeticQueryIT
Tests run: 8, Failures: 0, Errors: 0, Skipped: 0, Time elapsed: 16.743 sec - in org.apache.phoenix.end2end.ArithmeticQueryIT
Running org.apache.phoenix.end2end.CSVCommonsLoaderIT
Tests run: 13, Failures: 0, Errors: 0, Skipped: 0, Time elapsed: 18.63 sec - in org.apache.phoenix.end2end.CSVCommonsLoaderIT
Running org.apache.phoenix.end2end.ViewIT
Tests run: 7, Failures: 0, Errors: 0, Skipped: 0, Time elapsed: 13.783 sec - in org.apache.phoenix.end2end.ViewIT
Running org.apache.phoenix.end2end.SkipScanQueryIT
Tests run: 7, Failures: 0, Errors: 0, Skipped: 0, Time elapsed: 18.465 sec - in org.apache.phoenix.end2end.SkipScanQueryIT
Running org.apache.phoenix.end2end.DecodeFunctionIT
Tests run: 6, Failures: 0, Errors: 0, Skipped: 0, Time elapsed: 5.296 sec - in org.apache.phoenix.end2end.DecodeFunctionIT
Running org.apache.phoenix.end2end.DynamicFamilyIT
Tests run: 4, Failures: 0, Errors: 0, Skipped: 0, Time elapsed: 11.601 sec - in org.apache.phoenix.end2end.DynamicFamilyIT
Running org.apache.phoenix.end2end.TenantSpecificViewIndexSaltedIT
Tests run: 2, Failures: 0, Errors: 0, Skipped: 0, Time elapsed: 13.152 sec - in org.apache.phoenix.end2end.TenantSpecificViewIndexSaltedIT
Running org.apache.phoenix.end2end.StatementHintsIT
Tests run: 2, Failures: 0, Errors: 0, Skipped: 0, Time elapsed: 4.714 sec - in org.apache.phoenix.end2end.StatementHintsIT
Running org.apache.phoenix.end2end.ExecuteStatementsIT
Build timed out (after 140 minutes). Marking the build as failed.
Build was aborted
Archiving artifacts
ERROR: Failed to archive artifacts: **/surefire-reports/*,**/failsafe-reports/*.xml,**/*.txt,**/*.jar,**/bin/*.py,**/bin/*.xml,**/bin/*.properties
java.io.IOException: java.util.concurrent.ExecutionException: hudson.os.PosixException: native
error calling stat: No such file or directory <https://builds.apache.org/job/Phoenix-3.0-hadoop1/85/artifact/phoenix-core/target/surefire/surefirebooter2938325839025129228.jar>
ENOENT
	at hudson.FilePath.copyRecursiveTo(FilePath.java:2029)
	at jenkins.model.StandardArtifactManager.archive(StandardArtifactManager.java:61)
	at hudson.tasks.ArtifactArchiver.perform(ArtifactArchiver.java:140)
	at hudson.tasks.BuildStepMonitor$1.perform(BuildStepMonitor.java:20)
	at hudson.model.AbstractBuild$AbstractBuildExecution.perform(AbstractBuild.java:745)
	at hudson.model.AbstractBuild$AbstractBuildExecution.performAllBuildSteps(AbstractBuild.java:709)
	at hudson.model.Build$BuildExecution.post2(Build.java:182)
	at hudson.model.AbstractBuild$AbstractBuildExecution.post(AbstractBuild.java:658)
	at hudson.model.Run.execute(Run.java:1731)
	at hudson.model.FreeStyleBuild.run(FreeStyleBuild.java:43)
	at hudson.model.ResourceController.execute(ResourceController.java:88)
	at hudson.model.Executor.run(Executor.java:231)
Caused by: java.util.concurrent.ExecutionException: hudson.os.PosixException: native error
calling stat: No such file or directory <https://builds.apache.org/job/Phoenix-3.0-hadoop1/85/artifact/phoenix-core/target/surefire/surefirebooter2938325839025129228.jar>
ENOENT
	at hudson.remoting.Channel$3.adapt(Channel.java:772)
	at hudson.remoting.Channel$3.adapt(Channel.java:767)
	at hudson.remoting.FutureAdapter.get(FutureAdapter.java:55)
	at hudson.FilePath.copyRecursiveTo(FilePath.java:2027)
	... 11 more
Caused by: hudson.os.PosixException: native error calling stat: No such file or directory
<https://builds.apache.org/job/Phoenix-3.0-hadoop1/85/artifact/phoenix-core/target/surefire/surefirebooter2938325839025129228.jar>
ENOENT
	at hudson.os.PosixAPI$1.error(PosixAPI.java:35)
	at jnr.posix.LinuxPOSIX.stat(LinuxPOSIX.java:117)
	at jnr.posix.CheckedPOSIX.stat(CheckedPOSIX.java:265)
	at jnr.posix.LazyPOSIX.stat(LazyPOSIX.java:267)
	at hudson.util.IOUtils.mode(IOUtils.java:128)
	at hudson.util.io.TarArchiver.visit(TarArchiver.java:101)
	at hudson.util.DirScanner.scanSingle(DirScanner.java:49)
	at hudson.FilePath$ExplicitlySpecifiedDirScanner.scan(FilePath.java:2553)
	at hudson.FilePath.writeToTar(FilePath.java:2065)
	at hudson.FilePath.access$1000(FilePath.java:178)
	at hudson.FilePath$41.invoke(FilePath.java:2006)
	at hudson.FilePath$41.invoke(FilePath.java:2002)
	at hudson.FilePath$FileCallableWrapper.call(FilePath.java:2474)
	at hudson.remoting.UserRequest.perform(UserRequest.java:118)
	at hudson.remoting.UserRequest.perform(UserRequest.java:48)
	at hudson.remoting.Request$2.run(Request.java:328)
	at hudson.remoting.InterceptingExecutorService$1.call(InterceptingExecutorService.java:72)
	at java.util.concurrent.FutureTask.run(FutureTask.java:266)
	at java.util.concurrent.ThreadPoolExecutor.runWorker(ThreadPoolExecutor.java:1142)
	at java.util.concurrent.ThreadPoolExecutor$Worker.run(ThreadPoolExecutor.java:617)
	at java.lang.Thread.run(Thread.java:745)
Recording test results

Mime
View raw message