phoenix-commits mailing list archives

Site index · List index
Message view « Date » · « Thread »
Top « Date » · « Thread »
From Apache Jenkins Server <jenk...@builds.apache.org>
Subject Build failed in Jenkins: Apache Phoenix - Branch:master #206
Date Wed, 09 Apr 2014 01:21:48 GMT
See <https://builds.apache.org/job/Phoenix/206/changes>

Changes:

[elilevine] Commit PHOENIX-907 patch to master

------------------------------------------
[...truncated 3638 lines...]
[INFO] Using 'UTF-8' encoding to copy filtered resources.
[INFO] Copying 0 resource
[INFO] Copying 3 resources
[INFO] 
[INFO] --- maven-compiler-plugin:2.5.1:compile (default-compile) @ hbase-shell ---
[INFO] No sources to compile
[INFO] 
[INFO] --- maven-dependency-plugin:2.1:build-classpath (create-mrapp-generated-classpath)
@ hbase-shell ---
[INFO] Wrote classpath file '<https://builds.apache.org/job/Phoenix/ws/hbasetrunk/hbase-shell/target/test-classes/mrapp-generated-classpath'.>
[INFO] 
[INFO] --- maven-resources-plugin:2.6:testResources (default-testResources) @ hbase-shell
---
[INFO] Using 'UTF-8' encoding to copy filtered resources.
[INFO] skip non existing resourceDirectory <https://builds.apache.org/job/Phoenix/ws/hbasetrunk/hbase-shell/src/test/resources>
[INFO] Copying 3 resources
[INFO] 
[INFO] --- maven-compiler-plugin:2.5.1:testCompile (default-testCompile) @ hbase-shell ---
[INFO] Compiling 1 source file to <https://builds.apache.org/job/Phoenix/ws/hbasetrunk/hbase-shell/target/test-classes>
[INFO] 
[INFO] --- maven-surefire-plugin:2.12-TRUNK-HBASE-2:test (default-test) @ hbase-shell ---
[INFO] Tests are skipped.
[INFO] 
[INFO] --- maven-surefire-plugin:2.12-TRUNK-HBASE-2:test (secondPartTestsExecution) @ hbase-shell
---
[INFO] Tests are skipped.
[INFO] 
[INFO] --- maven-jar-plugin:2.4:test-jar (default) @ hbase-shell ---
[INFO] Building jar: <https://builds.apache.org/job/Phoenix/206/artifact/hbasetrunk/hbase-shell/target/hbase-shell-0.99.0-SNAPSHOT-tests.jar>
[INFO] 
[INFO] --- maven-source-plugin:2.2.1:jar-no-fork (attach-sources) @ hbase-shell ---
[INFO] Building jar: <https://builds.apache.org/job/Phoenix/206/artifact/hbasetrunk/hbase-shell/target/hbase-shell-0.99.0-SNAPSHOT-sources.jar>
[INFO] 
[INFO] --- maven-jar-plugin:2.4:jar (default-jar) @ hbase-shell ---
[INFO] Building jar: <https://builds.apache.org/job/Phoenix/206/artifact/hbasetrunk/hbase-shell/target/hbase-shell-0.99.0-SNAPSHOT.jar>
[INFO] 
[INFO] --- maven-install-plugin:2.3.1:install (default-install) @ hbase-shell ---
[INFO] Installing <https://builds.apache.org/job/Phoenix/206/artifact/hbasetrunk/hbase-shell/target/hbase-shell-0.99.0-SNAPSHOT.jar>
to /home/jenkins/.m2/repository/org/apache/hbase/hbase-shell/0.99.0-SNAPSHOT/hbase-shell-0.99.0-SNAPSHOT.jar
[INFO] Installing <https://builds.apache.org/job/Phoenix/ws/hbasetrunk/hbase-shell/pom.xml>
to /home/jenkins/.m2/repository/org/apache/hbase/hbase-shell/0.99.0-SNAPSHOT/hbase-shell-0.99.0-SNAPSHOT.pom
[INFO] Installing <https://builds.apache.org/job/Phoenix/206/artifact/hbasetrunk/hbase-shell/target/hbase-shell-0.99.0-SNAPSHOT-tests.jar>
to /home/jenkins/.m2/repository/org/apache/hbase/hbase-shell/0.99.0-SNAPSHOT/hbase-shell-0.99.0-SNAPSHOT-tests.jar
[INFO] Installing <https://builds.apache.org/job/Phoenix/206/artifact/hbasetrunk/hbase-shell/target/hbase-shell-0.99.0-SNAPSHOT-sources.jar>
to /home/jenkins/.m2/repository/org/apache/hbase/hbase-shell/0.99.0-SNAPSHOT/hbase-shell-0.99.0-SNAPSHOT-sources.jar
[INFO]                                                                         
[INFO] ------------------------------------------------------------------------
[INFO] Building HBase - Integration Tests 0.99.0-SNAPSHOT
[INFO] ------------------------------------------------------------------------
[INFO] 
[INFO] --- maven-remote-resources-plugin:1.4:process (default) @ hbase-it ---
[INFO] 
[INFO] --- maven-resources-plugin:2.6:resources (default-resources) @ hbase-it ---
[INFO] Using 'UTF-8' encoding to copy filtered resources.
[INFO] skip non existing resourceDirectory <https://builds.apache.org/job/Phoenix/ws/hbasetrunk/hbase-it/src/main/resources>
[INFO] Copying 3 resources
[INFO] 
[INFO] --- maven-compiler-plugin:2.5.1:compile (default-compile) @ hbase-it ---
[INFO] No sources to compile
[INFO] 
[INFO] --- maven-dependency-plugin:2.1:build-classpath (create-mrapp-generated-classpath)
@ hbase-it ---
[INFO] Wrote classpath file '<https://builds.apache.org/job/Phoenix/ws/hbasetrunk/hbase-it/target/test-classes/mrapp-generated-classpath'.>
[INFO] 
[INFO] --- maven-resources-plugin:2.6:testResources (default-testResources) @ hbase-it ---
[INFO] Using 'UTF-8' encoding to copy filtered resources.
[INFO] Copying 9 resources
[INFO] Copying 3 resources
[INFO] 
[INFO] --- maven-compiler-plugin:2.5.1:testCompile (default-testCompile) @ hbase-it ---
[INFO] Compiling 63 source files to <https://builds.apache.org/job/Phoenix/ws/hbasetrunk/hbase-it/target/test-classes>
[INFO] 
[INFO] --- maven-surefire-plugin:2.12-TRUNK-HBASE-2:test (default-test) @ hbase-it ---
[INFO] Tests are skipped.
[INFO] 
[INFO] --- maven-surefire-plugin:2.12-TRUNK-HBASE-2:test (secondPartTestsExecution) @ hbase-it
---
[INFO] Tests are skipped.
[INFO] 
[INFO] --- maven-jar-plugin:2.4:test-jar (default) @ hbase-it ---
[INFO] Building jar: <https://builds.apache.org/job/Phoenix/206/artifact/hbasetrunk/hbase-it/target/hbase-it-0.99.0-SNAPSHOT-tests.jar>
[INFO] 
[INFO] --- maven-jar-plugin:2.4:jar (default-jar) @ hbase-it ---
[INFO] Building jar: <https://builds.apache.org/job/Phoenix/206/artifact/hbasetrunk/hbase-it/target/hbase-it-0.99.0-SNAPSHOT.jar>
[INFO] 
[INFO] --- maven-failsafe-plugin:2.12-TRUNK-HBASE-2:integration-test (integration-test) @
hbase-it ---
[INFO] Tests are skipped.
[INFO] 
[INFO] --- maven-failsafe-plugin:2.12-TRUNK-HBASE-2:verify (verify) @ hbase-it ---
[INFO] Tests are skipped.
[INFO] 
[INFO] --- maven-install-plugin:2.3.1:install (default-install) @ hbase-it ---
[INFO] Installing <https://builds.apache.org/job/Phoenix/206/artifact/hbasetrunk/hbase-it/target/hbase-it-0.99.0-SNAPSHOT.jar>
to /home/jenkins/.m2/repository/org/apache/hbase/hbase-it/0.99.0-SNAPSHOT/hbase-it-0.99.0-SNAPSHOT.jar
[INFO] Installing <https://builds.apache.org/job/Phoenix/ws/hbasetrunk/hbase-it/pom.xml>
to /home/jenkins/.m2/repository/org/apache/hbase/hbase-it/0.99.0-SNAPSHOT/hbase-it-0.99.0-SNAPSHOT.pom
[INFO] Installing <https://builds.apache.org/job/Phoenix/206/artifact/hbasetrunk/hbase-it/target/hbase-it-0.99.0-SNAPSHOT-tests.jar>
to /home/jenkins/.m2/repository/org/apache/hbase/hbase-it/0.99.0-SNAPSHOT/hbase-it-0.99.0-SNAPSHOT-tests.jar
[INFO]                                                                         
[INFO] ------------------------------------------------------------------------
[INFO] Building HBase - Examples 0.99.0-SNAPSHOT
[INFO] ------------------------------------------------------------------------
[INFO] 
[INFO] --- maven-remote-resources-plugin:1.4:process (default) @ hbase-examples ---
[INFO] 
[INFO] --- maven-resources-plugin:2.6:resources (default-resources) @ hbase-examples ---
[INFO] Using 'UTF-8' encoding to copy filtered resources.
[INFO] skip non existing resourceDirectory <https://builds.apache.org/job/Phoenix/ws/hbasetrunk/hbase-examples/src/main/resources>
[INFO] Copying 3 resources
[INFO] 
[INFO] --- maven-compiler-plugin:2.5.1:compile (default-compile) @ hbase-examples ---
[INFO] Compiling 9 source files to <https://builds.apache.org/job/Phoenix/ws/hbasetrunk/hbase-examples/target/classes>
[INFO] 
[INFO] --- maven-dependency-plugin:2.1:build-classpath (create-mrapp-generated-classpath)
@ hbase-examples ---
[INFO] Wrote classpath file '<https://builds.apache.org/job/Phoenix/ws/hbasetrunk/hbase-examples/target/test-classes/mrapp-generated-classpath'.>
[INFO] 
[INFO] --- maven-resources-plugin:2.6:testResources (default-testResources) @ hbase-examples
---
[INFO] Using 'UTF-8' encoding to copy filtered resources.
[INFO] skip non existing resourceDirectory <https://builds.apache.org/job/Phoenix/ws/hbasetrunk/hbase-examples/src/test/resources>
[INFO] Copying 3 resources
[INFO] 
[INFO] --- maven-compiler-plugin:2.5.1:testCompile (default-testCompile) @ hbase-examples
---
[INFO] Compiling 4 source files to <https://builds.apache.org/job/Phoenix/ws/hbasetrunk/hbase-examples/target/test-classes>
[INFO] 
[INFO] --- maven-surefire-plugin:2.12-TRUNK-HBASE-2:test (default-test) @ hbase-examples ---
[INFO] Tests are skipped.
[INFO] 
[INFO] --- maven-surefire-plugin:2.12-TRUNK-HBASE-2:test (secondPartTestsExecution) @ hbase-examples
---
[INFO] Tests are skipped.
[INFO] 
[INFO] --- maven-source-plugin:2.2.1:jar-no-fork (attach-sources) @ hbase-examples ---
[INFO] Building jar: <https://builds.apache.org/job/Phoenix/206/artifact/hbasetrunk/hbase-examples/target/hbase-examples-0.99.0-SNAPSHOT-sources.jar>
[INFO] 
[INFO] --- maven-jar-plugin:2.4:test-jar (default) @ hbase-examples ---
[INFO] Building jar: <https://builds.apache.org/job/Phoenix/206/artifact/hbasetrunk/hbase-examples/target/hbase-examples-0.99.0-SNAPSHOT-tests.jar>
[INFO] 
[INFO] --- maven-jar-plugin:2.4:jar (default-jar) @ hbase-examples ---
[INFO] Building jar: <https://builds.apache.org/job/Phoenix/206/artifact/hbasetrunk/hbase-examples/target/hbase-examples-0.99.0-SNAPSHOT.jar>
[INFO] 
[INFO] --- maven-install-plugin:2.3.1:install (default-install) @ hbase-examples ---
[INFO] Installing <https://builds.apache.org/job/Phoenix/206/artifact/hbasetrunk/hbase-examples/target/hbase-examples-0.99.0-SNAPSHOT.jar>
to /home/jenkins/.m2/repository/org/apache/hbase/hbase-examples/0.99.0-SNAPSHOT/hbase-examples-0.99.0-SNAPSHOT.jar
[INFO] Installing <https://builds.apache.org/job/Phoenix/ws/hbasetrunk/hbase-examples/pom.xml>
to /home/jenkins/.m2/repository/org/apache/hbase/hbase-examples/0.99.0-SNAPSHOT/hbase-examples-0.99.0-SNAPSHOT.pom
[INFO] Installing <https://builds.apache.org/job/Phoenix/206/artifact/hbasetrunk/hbase-examples/target/hbase-examples-0.99.0-SNAPSHOT-sources.jar>
to /home/jenkins/.m2/repository/org/apache/hbase/hbase-examples/0.99.0-SNAPSHOT/hbase-examples-0.99.0-SNAPSHOT-sources.jar
[INFO] Installing <https://builds.apache.org/job/Phoenix/206/artifact/hbasetrunk/hbase-examples/target/hbase-examples-0.99.0-SNAPSHOT-tests.jar>
to /home/jenkins/.m2/repository/org/apache/hbase/hbase-examples/0.99.0-SNAPSHOT/hbase-examples-0.99.0-SNAPSHOT-tests.jar
[INFO]                                                                         
[INFO] ------------------------------------------------------------------------
[INFO] Building HBase - Assembly 0.99.0-SNAPSHOT
[INFO] ------------------------------------------------------------------------
[INFO] 
[INFO] --- maven-remote-resources-plugin:1.4:process (default) @ hbase-assembly ---
[INFO] 
[INFO] --- maven-dependency-plugin:2.1:build-classpath (create-hbase-generated-classpath)
@ hbase-assembly ---
[INFO] Wrote classpath file '<https://builds.apache.org/job/Phoenix/ws/hbasetrunk/target/cached_classpath.txt'.>
[INFO] 
[INFO] --- maven-install-plugin:2.3.1:install (default-install) @ hbase-assembly ---
[INFO] Installing <https://builds.apache.org/job/Phoenix/ws/hbasetrunk/hbase-assembly/pom.xml>
to /home/jenkins/.m2/repository/org/apache/hbase/hbase-assembly/0.99.0-SNAPSHOT/hbase-assembly-0.99.0-SNAPSHOT.pom
[INFO] ------------------------------------------------------------------------
[INFO] Reactor Summary:
[INFO] 
[INFO] HBase ............................................. SUCCESS [11.559s]
[INFO] HBase - Common .................................... SUCCESS [20.055s]
[INFO] HBase - Protocol .................................. SUCCESS [8.854s]
[INFO] HBase - Client .................................... SUCCESS [3.683s]
[INFO] HBase - Hadoop Compatibility ...................... SUCCESS [0.841s]
[INFO] HBase - Hadoop Two Compatibility .................. SUCCESS [1.929s]
[INFO] HBase - Prefix Tree ............................... SUCCESS [0.928s]
[INFO] HBase - Server .................................... SUCCESS [22.074s]
[INFO] HBase - Testing Util .............................. SUCCESS [1.153s]
[INFO] HBase - Thrift .................................... SUCCESS [6.021s]
[INFO] HBase - Shell ..................................... SUCCESS [0.854s]
[INFO] HBase - Integration Tests ......................... SUCCESS [1.256s]
[INFO] HBase - Examples .................................. SUCCESS [0.999s]
[INFO] HBase - Assembly .................................. SUCCESS [1.306s]
[INFO] ------------------------------------------------------------------------
[INFO] BUILD SUCCESS
[INFO] ------------------------------------------------------------------------
[INFO] Total time: 1:22.393s
[INFO] Finished at: Wed Apr 09 01:20:47 UTC 2014
[INFO] Final Memory: 96M/1020M
[INFO] ------------------------------------------------------------------------
[Phoenix] $ /home/hudson/tools/maven/apache-maven-3.0.4/bin/mvn clean install apache-rat:check
[INFO] Scanning for projects...
[INFO] ------------------------------------------------------------------------
[INFO] Reactor Build Order:
[INFO] 
[INFO] Apache Phoenix
[INFO] Phoenix Hadoop Compatibility
[INFO] Phoenix Core
[INFO] Phoenix - Flume
[INFO] Phoenix - Pig
[INFO] Phoenix Hadoop1 Compatibility
[INFO] Phoenix Assembly
[WARNING] The POM for org.eclipse.m2e:lifecycle-mapping:jar:1.0.0 is missing, no dependency
information available
[WARNING] Failed to retrieve plugin descriptor for org.eclipse.m2e:lifecycle-mapping:1.0.0:
Plugin org.eclipse.m2e:lifecycle-mapping:1.0.0 or one of its dependencies could not be resolved:
Failed to read artifact descriptor for org.eclipse.m2e:lifecycle-mapping:jar:1.0.0
[INFO]                                                                         
[INFO] ------------------------------------------------------------------------
[INFO] Building Apache Phoenix 4.1.0-incubating-SNAPSHOT
[INFO] ------------------------------------------------------------------------
[WARNING] The POM for org.eclipse.m2e:lifecycle-mapping:jar:1.0.0 is missing, no dependency
information available
[WARNING] Failed to retrieve plugin descriptor for org.eclipse.m2e:lifecycle-mapping:1.0.0:
Plugin org.eclipse.m2e:lifecycle-mapping:1.0.0 or one of its dependencies could not be resolved:
Failed to read artifact descriptor for org.eclipse.m2e:lifecycle-mapping:jar:1.0.0
[INFO] 
[INFO] --- maven-clean-plugin:2.5:clean (default-clean) @ phoenix ---
[INFO] Deleting <https://builds.apache.org/job/Phoenix/ws/target>
[INFO] 
[INFO] --- maven-remote-resources-plugin:1.5:process (default) @ phoenix ---
[INFO] 
[INFO] --- maven-source-plugin:2.2.1:jar-no-fork (attach-sources) @ phoenix ---
[INFO] 
[INFO] --- maven-jar-plugin:2.4:test-jar (default) @ phoenix ---
[WARNING] JAR will be empty - no content was marked for inclusion!
[INFO] Building jar: <https://builds.apache.org/job/Phoenix/206/artifact/target/phoenix-4.1.0-incubating-SNAPSHOT-tests.jar>
[INFO] 
[INFO] --- maven-site-plugin:3.2:attach-descriptor (attach-descriptor) @ phoenix ---
[INFO] 
[INFO] --- maven-install-plugin:2.5.1:install (default-install) @ phoenix ---
[INFO] Installing <https://builds.apache.org/job/Phoenix/ws/pom.xml> to /home/jenkins/.m2/repository/org/apache/phoenix/phoenix/4.1.0-incubating-SNAPSHOT/phoenix-4.1.0-incubating-SNAPSHOT.pom
[INFO] Installing <https://builds.apache.org/job/Phoenix/206/artifact/target/phoenix-4.1.0-incubating-SNAPSHOT-tests.jar>
to /home/jenkins/.m2/repository/org/apache/phoenix/phoenix/4.1.0-incubating-SNAPSHOT/phoenix-4.1.0-incubating-SNAPSHOT-tests.jar
[INFO] 
[INFO] --- apache-rat-plugin:0.8:check (default-cli) @ phoenix ---
[INFO] Exclude: CHANGES.txt
[INFO] Exclude: README.md
[INFO] Exclude: dev/phoenix.importorder
[INFO] Exclude: **/target/**
[INFO] Exclude: **/*.versionsBackup
[INFO] Exclude: docs/**
[INFO] Exclude: examples/**
[INFO] Exclude: .gitignore
[INFO] Exclude: .git/**
[INFO] Exclude: **/.idea/**
[INFO] Exclude: **/*.iml
[INFO] Exclude: .project
[INFO] Exclude: .classpath
[INFO] Exclude: .settings/**
[INFO] ------------------------------------------------------------------------
[INFO] Reactor Summary:
[INFO] 
[INFO] Apache Phoenix .................................... FAILURE [26.566s]
[INFO] Phoenix Hadoop Compatibility ...................... SKIPPED
[INFO] Phoenix Core ...................................... SKIPPED
[INFO] Phoenix - Flume ................................... SKIPPED
[INFO] Phoenix - Pig ..................................... SKIPPED
[INFO] Phoenix Hadoop1 Compatibility ..................... SKIPPED
[INFO] Phoenix Assembly .................................. SKIPPED
[INFO] ------------------------------------------------------------------------
[INFO] BUILD FAILURE
[INFO] ------------------------------------------------------------------------
[INFO] Total time: 28.933s
[INFO] Finished at: Wed Apr 09 01:21:18 UTC 2014
[INFO] Final Memory: 23M/379M
[INFO] ------------------------------------------------------------------------
[ERROR] Failed to execute goal org.apache.rat:apache-rat-plugin:0.8:check (default-cli) on
project phoenix: Too many unapproved licenses: 136 -> [Help 1]
[ERROR] 
[ERROR] To see the full stack trace of the errors, re-run Maven with the -e switch.
[ERROR] Re-run Maven using the -X switch to enable full debug logging.
[ERROR] 
[ERROR] For more information about the errors and possible solutions, please read the following
articles:
[ERROR] [Help 1] http://cwiki.apache.org/confluence/display/MAVEN/MojoFailureException
Build step 'Invoke top-level Maven targets' marked build as failure
Archiving artifacts
Updating PHOENIX-907
Recording test results

Mime
View raw message