phoenix-commits mailing list archives

Site index · List index
Message view « Date » · « Thread »
Top « Date » · « Thread »
From Apache Jenkins Server <jenk...@builds.apache.org>
Subject Build failed in Jenkins: Apache Phoenix - Branch:master #94
Date Mon, 03 Mar 2014 01:34:50 GMT
See <https://builds.apache.org/job/Phoenix/94/changes>

Changes:

[jamestaylor] PHOENIX-97 Sort columns by COLUMN_NAME for metaData.getPrimaryKey() as dictated
by spec (JamesTaylor)

------------------------------------------
[...truncated 293 lines...]
Tests run: 61, Failures: 0, Errors: 0, Skipped: 0, Time elapsed: 51.174 sec - in org.apache.phoenix.end2end.ProductMetricsTest
Running org.apache.phoenix.end2end.DynamicUpsertTest
Tests run: 7, Failures: 0, Errors: 0, Skipped: 0, Time elapsed: 30.399 sec - in org.apache.phoenix.end2end.DynamicUpsertTest
Running org.apache.phoenix.end2end.UpsertSelectAutoCommitTest
Tests run: 1, Failures: 0, Errors: 0, Skipped: 0, Time elapsed: 30.193 sec - in org.apache.phoenix.end2end.UpsertSelectAutoCommitTest
Running org.apache.phoenix.end2end.TenantSpecificViewIndexTest
Tests run: 1, Failures: 0, Errors: 0, Skipped: 0, Time elapsed: 30.636 sec - in org.apache.phoenix.end2end.TenantSpecificViewIndexTest
Running org.apache.phoenix.end2end.SpooledOrderByTest
Tests run: 3, Failures: 0, Errors: 0, Skipped: 1, Time elapsed: 30.681 sec - in org.apache.phoenix.end2end.SpooledOrderByTest
Running org.apache.phoenix.end2end.DeleteTest
Tests run: 13, Failures: 0, Errors: 0, Skipped: 0, Time elapsed: 39.61 sec - in org.apache.phoenix.end2end.DeleteTest
Running org.apache.phoenix.end2end.ViewTest
Tests run: 6, Failures: 0, Errors: 0, Skipped: 0, Time elapsed: 29.584 sec - in org.apache.phoenix.end2end.ViewTest
Running org.apache.phoenix.end2end.ArrayTest
Tests run: 29, Failures: 0, Errors: 0, Skipped: 0, Time elapsed: 39.369 sec - in org.apache.phoenix.end2end.ArrayTest
Running org.apache.phoenix.end2end.PercentileTest
Tests run: 17, Failures: 0, Errors: 0, Skipped: 0, Time elapsed: 32.728 sec - in org.apache.phoenix.end2end.PercentileTest
Running org.apache.phoenix.end2end.UpsertBigValuesTest
Tests run: 4, Failures: 0, Errors: 0, Skipped: 0, Time elapsed: 34.18 sec - in org.apache.phoenix.end2end.UpsertBigValuesTest
Running org.apache.phoenix.end2end.QueryTest
Tests run: 432, Failures: 0, Errors: 0, Skipped: 0, Time elapsed: 241.554 sec - in org.apache.phoenix.end2end.QueryTest
Running org.apache.phoenix.end2end.CoalesceFunctionTest
Tests run: 1, Failures: 0, Errors: 0, Skipped: 0, Time elapsed: 32.293 sec - in org.apache.phoenix.end2end.CoalesceFunctionTest
Running org.apache.phoenix.end2end.UpsertValuesTest
Tests run: 10, Failures: 0, Errors: 0, Skipped: 0, Time elapsed: 44.469 sec - in org.apache.phoenix.end2end.UpsertValuesTest
Running org.apache.phoenix.end2end.RoundFloorCeilFunctionsEnd2EndTest
Tests run: 21, Failures: 0, Errors: 0, Skipped: 0, Time elapsed: 31.687 sec - in org.apache.phoenix.end2end.RoundFloorCeilFunctionsEnd2EndTest
Running org.apache.phoenix.end2end.UpsertSelectTest
Tests run: 11, Failures: 0, Errors: 0, Skipped: 0, Time elapsed: 57.728 sec - in org.apache.phoenix.end2end.UpsertSelectTest
Running org.apache.phoenix.end2end.ReverseFunctionTest
Tests run: 5, Failures: 0, Errors: 0, Skipped: 0, Time elapsed: 28.915 sec - in org.apache.phoenix.end2end.ReverseFunctionTest
Running org.apache.phoenix.end2end.RowValueConstructorTest
Tests run: 24, Failures: 0, Errors: 0, Skipped: 0, Time elapsed: 40.154 sec - in org.apache.phoenix.end2end.RowValueConstructorTest
Running org.apache.phoenix.end2end.NativeHBaseTypesTest
Tests run: 7, Failures: 0, Errors: 0, Skipped: 0, Time elapsed: 30.224 sec - in org.apache.phoenix.end2end.NativeHBaseTypesTest
Running org.apache.phoenix.end2end.DynamicFamilyTest
Tests run: 4, Failures: 0, Errors: 0, Skipped: 0, Time elapsed: 31.173 sec - in org.apache.phoenix.end2end.DynamicFamilyTest
Running org.apache.phoenix.end2end.AutoCommitTest
Tests run: 1, Failures: 0, Errors: 0, Skipped: 0, Time elapsed: 28.978 sec - in org.apache.phoenix.end2end.AutoCommitTest
Running org.apache.phoenix.end2end.SpillableGroupByTest
Tests run: 1, Failures: 0, Errors: 0, Skipped: 0, Time elapsed: 30.261 sec - in org.apache.phoenix.end2end.SpillableGroupByTest
Running org.apache.phoenix.end2end.ExecuteStatementsTest
Tests run: 2, Failures: 0, Errors: 0, Skipped: 0, Time elapsed: 36.033 sec - in org.apache.phoenix.end2end.ExecuteStatementsTest
Running org.apache.phoenix.end2end.index.ImmutableIndexTest
Tests run: 7, Failures: 0, Errors: 0, Skipped: 0, Time elapsed: 41.154 sec - in org.apache.phoenix.end2end.index.ImmutableIndexTest
Running org.apache.phoenix.end2end.index.DropViewTest
Tests run: 1, Failures: 0, Errors: 0, Skipped: 0, Time elapsed: 29.834 sec - in org.apache.phoenix.end2end.index.DropViewTest
Running org.apache.phoenix.end2end.index.SaltedIndexTest
Tests run: 3, Failures: 0, Errors: 0, Skipped: 0, Time elapsed: 51.228 sec - in org.apache.phoenix.end2end.index.SaltedIndexTest
Running org.apache.phoenix.end2end.index.MutableIndexFailureTest
Tests run: 1, Failures: 0, Errors: 0, Skipped: 0, Time elapsed: 61.162 sec - in org.apache.phoenix.end2end.index.MutableIndexFailureTest
Running org.apache.phoenix.end2end.index.MutableIndexTest
Tests run: 11, Failures: 0, Errors: 0, Skipped: 0, Time elapsed: 74.99 sec - in org.apache.phoenix.end2end.index.MutableIndexTest
Running org.apache.phoenix.end2end.index.IndexMetadataTest
Tests run: 4, Failures: 0, Errors: 0, Skipped: 0, Time elapsed: 39.826 sec - in org.apache.phoenix.end2end.index.IndexMetadataTest
Running org.apache.phoenix.end2end.ToCharFunctionTest
Tests run: 10, Failures: 0, Errors: 0, Skipped: 0, Time elapsed: 30.816 sec - in org.apache.phoenix.end2end.ToCharFunctionTest
Running org.apache.phoenix.filter.SkipScanFilterTest
Tests run: 13, Failures: 0, Errors: 0, Skipped: 0, Time elapsed: 0.02 sec - in org.apache.phoenix.filter.SkipScanFilterTest
Running org.apache.phoenix.filter.SkipScanFilterIntersectTest
Tests run: 17, Failures: 0, Errors: 0, Skipped: 0, Time elapsed: 0.007 sec - in org.apache.phoenix.filter.SkipScanFilterIntersectTest
Running org.apache.phoenix.jdbc.PhoenixEmbeddedDriverTest
Tests run: 3, Failures: 0, Errors: 0, Skipped: 0, Time elapsed: 0.001 sec - in org.apache.phoenix.jdbc.PhoenixEmbeddedDriverTest
Running org.apache.phoenix.expression.CoerceExpressionTest
Tests run: 5, Failures: 0, Errors: 0, Skipped: 0, Time elapsed: 0.001 sec - in org.apache.phoenix.expression.CoerceExpressionTest
Running org.apache.phoenix.expression.ColumnExpressionTest
Tests run: 4, Failures: 0, Errors: 0, Skipped: 0, Time elapsed: 0 sec - in org.apache.phoenix.expression.ColumnExpressionTest
Running org.apache.phoenix.expression.LikeExpressionTest
Tests run: 1, Failures: 0, Errors: 0, Skipped: 0, Time elapsed: 0 sec - in org.apache.phoenix.expression.LikeExpressionTest
Running org.apache.phoenix.expression.SortOrderExpressionTest
Tests run: 23, Failures: 0, Errors: 0, Skipped: 0, Time elapsed: 0.006 sec - in org.apache.phoenix.expression.SortOrderExpressionTest
Running org.apache.phoenix.schema.SchemaUtilTest
Tests run: 3, Failures: 0, Errors: 0, Skipped: 0, Time elapsed: 0 sec - in org.apache.phoenix.schema.SchemaUtilTest
Running org.apache.phoenix.schema.SortOrderTest
Tests run: 7, Failures: 0, Errors: 0, Skipped: 0, Time elapsed: 0 sec - in org.apache.phoenix.schema.SortOrderTest
Running org.apache.phoenix.schema.PDataTypeForArraysTest
Tests run: 60, Failures: 0, Errors: 0, Skipped: 0, Time elapsed: 0.009 sec - in org.apache.phoenix.schema.PDataTypeForArraysTest
Running org.apache.phoenix.schema.RowKeySchemaTest
Tests run: 6, Failures: 0, Errors: 0, Skipped: 0, Time elapsed: 0.025 sec - in org.apache.phoenix.schema.RowKeySchemaTest
Running org.apache.phoenix.schema.PMetaDataImplTest
Tests run: 1, Failures: 0, Errors: 0, Skipped: 0, Time elapsed: 0.001 sec - in org.apache.phoenix.schema.PMetaDataImplTest
Running org.apache.phoenix.schema.RowKeyValueAccessorTest
Tests run: 1, Failures: 0, Errors: 0, Skipped: 0, Time elapsed: 0.021 sec - in org.apache.phoenix.schema.RowKeyValueAccessorTest
Running org.apache.phoenix.schema.ValueBitSetTest
Tests run: 2, Failures: 0, Errors: 0, Skipped: 0, Time elapsed: 0 sec - in org.apache.phoenix.schema.ValueBitSetTest
Running org.apache.phoenix.schema.PDataTypeTest
Tests run: 22, Failures: 0, Errors: 0, Skipped: 0, Time elapsed: 0.007 sec - in org.apache.phoenix.schema.PDataTypeTest
Running org.apache.phoenix.util.LikeExpressionTest
Tests run: 1, Failures: 0, Errors: 0, Skipped: 0, Time elapsed: 0 sec - in org.apache.phoenix.util.LikeExpressionTest
Running org.apache.phoenix.util.DateUtilTest
Tests run: 1, Failures: 0, Errors: 0, Skipped: 0, Time elapsed: 0 sec - in org.apache.phoenix.util.DateUtilTest
Running org.apache.phoenix.util.PhoenixRuntimeTest
Tests run: 1, Failures: 0, Errors: 0, Skipped: 0, Time elapsed: 0.019 sec - in org.apache.phoenix.util.PhoenixRuntimeTest
Running org.apache.phoenix.util.MetaDataUtilTest
Tests run: 3, Failures: 0, Errors: 0, Skipped: 0, Time elapsed: 0.002 sec - in org.apache.phoenix.util.MetaDataUtilTest
Running org.apache.phoenix.util.ScanUtilTest
Tests run: 20, Failures: 0, Errors: 0, Skipped: 0, Time elapsed: 0.006 sec - in org.apache.phoenix.util.ScanUtilTest
Running org.apache.phoenix.util.ByteUtilTest
Tests run: 3, Failures: 0, Errors: 0, Skipped: 0, Time elapsed: 0.024 sec - in org.apache.phoenix.util.ByteUtilTest
Running org.apache.phoenix.query.HBaseFactoryProviderTest
Tests run: 3, Failures: 0, Errors: 0, Skipped: 0, Time elapsed: 0 sec - in org.apache.phoenix.query.HBaseFactoryProviderTest
Running org.apache.phoenix.query.ConnectionlessUpsertTest
Tests run: 3, Failures: 0, Errors: 0, Skipped: 0, Time elapsed: 0.016 sec - in org.apache.phoenix.query.ConnectionlessUpsertTest
Running org.apache.phoenix.index.IndexMaintainerTest
Tests run: 17, Failures: 0, Errors: 0, Skipped: 0, Time elapsed: 0.105 sec - in org.apache.phoenix.index.IndexMaintainerTest
Running org.apache.phoenix.arithmetic.ArithmeticOperationTest
Tests run: 4, Failures: 0, Errors: 0, Skipped: 0, Time elapsed: 0.001 sec - in org.apache.phoenix.arithmetic.ArithmeticOperationTest
Running org.apache.hadoop.hbase.regionserver.wal.TestWALReplayWithIndexWritesAndCompressedWAL
Tests run: 1, Failures: 0, Errors: 0, Skipped: 0, Time elapsed: 36.556 sec - in org.apache.hadoop.hbase.regionserver.wal.TestWALReplayWithIndexWritesAndCompressedWAL
Running org.apache.hadoop.hbase.regionserver.wal.TestWALReplayWithIndexWritesAndUncompressedWALInHBase_094_9
Tests run: 1, Failures: 0, Errors: 0, Skipped: 0, Time elapsed: 35.171 sec - in org.apache.hadoop.hbase.regionserver.wal.TestWALReplayWithIndexWritesAndUncompressedWALInHBase_094_9
Running org.apache.hadoop.hbase.regionserver.wal.TestReadWriteKeyValuesWithCodec
Tests run: 2, Failures: 0, Errors: 0, Skipped: 0, Time elapsed: 0.025 sec - in org.apache.hadoop.hbase.regionserver.wal.TestReadWriteKeyValuesWithCodec

Results :

Tests run: 1739, Failures: 0, Errors: 0, Skipped: 8

[INFO] 
[INFO] --- maven-source-plugin:2.2.1:jar-no-fork (attach-sources) @ phoenix-core ---
[INFO] Building jar: <https://builds.apache.org/job/Phoenix/94/artifact/phoenix-core/target/phoenix-core-3.0.0-SNAPSHOT-sources.jar>
[INFO] 
[INFO] --- maven-jar-plugin:2.4:test-jar (default) @ phoenix-core ---
[INFO] Building jar: <https://builds.apache.org/job/Phoenix/94/artifact/phoenix-core/target/phoenix-core-3.0.0-SNAPSHOT-tests.jar>
[INFO] 
[INFO] --- maven-jar-plugin:2.4:jar (default-jar) @ phoenix-core ---
[INFO] Building jar: <https://builds.apache.org/job/Phoenix/94/artifact/phoenix-core/target/phoenix-core-3.0.0-SNAPSHOT.jar>
[INFO]                                                                         
[INFO] ------------------------------------------------------------------------
[INFO] Building Phoenix - Flume 3.0.0-SNAPSHOT
[INFO] ------------------------------------------------------------------------
[INFO] 
[INFO] --- maven-clean-plugin:2.4.1:clean (default-clean) @ phoenix-flume ---
[INFO] Deleting <https://builds.apache.org/job/Phoenix/ws/phoenix-flume/target>
[INFO] 
[INFO] --- maven-resources-plugin:2.5:resources (default-resources) @ phoenix-flume ---
[debug] execute contextualize
[INFO] Using 'UTF-8' encoding to copy filtered resources.
[INFO] skip non existing resourceDirectory <https://builds.apache.org/job/Phoenix/ws/phoenix-flume/src/main/resources>
[INFO] 
[INFO] --- maven-compiler-plugin:3.0:compile (default-compile) @ phoenix-flume ---
[INFO] Changes detected - recompiling the module!
[INFO] Compiling 9 source files to <https://builds.apache.org/job/Phoenix/ws/phoenix-flume/target/classes>
[INFO] 
[INFO] --- maven-resources-plugin:2.5:testResources (default-testResources) @ phoenix-flume
---
[debug] execute contextualize
[INFO] Using 'UTF-8' encoding to copy filtered resources.
[INFO] skip non existing resourceDirectory <https://builds.apache.org/job/Phoenix/ws/phoenix-flume/src/test/resources>
[INFO] 
[INFO] --- maven-compiler-plugin:3.0:testCompile (default-testCompile) @ phoenix-flume ---
[INFO] Changes detected - recompiling the module!
[INFO] Compiling 2 source files to <https://builds.apache.org/job/Phoenix/ws/phoenix-flume/target/test-classes>
[INFO] 
[INFO] --- maven-surefire-plugin:2.16:test (default-test) @ phoenix-flume ---
[INFO] Surefire report directory: <https://builds.apache.org/job/Phoenix/ws/phoenix-flume/target/surefire-reports>

-------------------------------------------------------
 T E S T S
-------------------------------------------------------
Running org.apache.phoenix.flume.TestRegexEventSerializer
Tests run: 6, Failures: 1, Errors: 3, Skipped: 0, Time elapsed: 54.754 sec <<< FAILURE!
- in org.apache.phoenix.flume.TestRegexEventSerializer
testMismatchKeyGenerator(org.apache.phoenix.flume.TestRegexEventSerializer)  Time elapsed:
28.871 sec  <<< FAILURE!
java.lang.AssertionError: null
	at org.junit.Assert.fail(Assert.java:86)
	at org.junit.Assert.assertTrue(Assert.java:41)
	at org.junit.Assert.assertTrue(Assert.java:52)
	at org.apache.phoenix.flume.TestRegexEventSerializer.testMismatchKeyGenerator(TestRegexEventSerializer.java:122)

testEventsWithHeaders(org.apache.phoenix.flume.TestRegexEventSerializer)  Time elapsed: 3.551
sec  <<< ERROR!
java.lang.RuntimeException: org.apache.phoenix.schema.ColumnNotFoundException: ERROR 504 (42703):
Undefined column. columnName=FLUME_TEST.CF1.COL2
	at org.apache.phoenix.exception.SQLExceptionCode$5.newException(SQLExceptionCode.java:117)
	at org.apache.phoenix.exception.SQLExceptionInfo.buildException(SQLExceptionInfo.java:133)
	at org.apache.phoenix.flume.serializer.BaseEventSerializer.addToColumnMetadataInfo(BaseEventSerializer.java:216)
	at org.apache.phoenix.flume.serializer.BaseEventSerializer.initialize(BaseEventSerializer.java:179)
	at org.apache.phoenix.flume.sink.PhoenixSink.start(PhoenixSink.java:114)
	at org.apache.phoenix.flume.TestRegexEventSerializer.testEventsWithHeaders(TestRegexEventSerializer.java:303)

testKeyGenerator(org.apache.phoenix.flume.TestRegexEventSerializer)  Time elapsed: 3.149 sec
 <<< ERROR!
org.apache.flume.EventDeliveryException: Failed to persist message to Hbase
	at org.apache.phoenix.flume.serializer.RegexEventSerializer.upsertEvents(RegexEventSerializer.java:138)
	at org.apache.phoenix.flume.sink.PhoenixSink.process(PhoenixSink.java:171)
	at org.apache.phoenix.flume.TestRegexEventSerializer.testKeyGenerator(TestRegexEventSerializer.java:82)

testApacheLogRegex(org.apache.phoenix.flume.TestRegexEventSerializer)  Time elapsed: 2.303
sec  <<< ERROR!
java.lang.RuntimeException: org.apache.phoenix.schema.TableNotFoundException: ERROR 1012 (42M03):
Table undefined. tableName=apachelogs
	at org.apache.phoenix.exception.SQLExceptionCode$9.newException(SQLExceptionCode.java:175)
	at org.apache.phoenix.exception.SQLExceptionInfo.buildException(SQLExceptionInfo.java:133)
	at org.apache.phoenix.flume.serializer.BaseEventSerializer.initialize(BaseEventSerializer.java:169)
	at org.apache.phoenix.flume.sink.PhoenixSink.start(PhoenixSink.java:114)
	at org.apache.phoenix.flume.TestRegexEventSerializer.testApacheLogRegex(TestRegexEventSerializer.java:244)

Running org.apache.phoenix.flume.TestPhoenixSink
Tests run: 7, Failures: 0, Errors: 1, Skipped: 0, Time elapsed: 31.017 sec <<< FAILURE!
- in org.apache.phoenix.flume.TestPhoenixSink
testSinkLifecycle(org.apache.phoenix.flume.TestPhoenixSink)  Time elapsed: 0.082 sec  <<<
ERROR!
java.lang.RuntimeException: org.apache.phoenix.schema.TableNotFoundException: ERROR 1012 (42M03):
Table undefined. tableName=flume_test
	at org.apache.phoenix.exception.SQLExceptionCode$9.newException(SQLExceptionCode.java:175)
	at org.apache.phoenix.exception.SQLExceptionInfo.buildException(SQLExceptionInfo.java:133)
	at org.apache.phoenix.flume.serializer.BaseEventSerializer.initialize(BaseEventSerializer.java:169)
	at org.apache.phoenix.flume.sink.PhoenixSink.start(PhoenixSink.java:114)
	at org.apache.phoenix.flume.TestPhoenixSink.testSinkLifecycle(TestPhoenixSink.java:142)


Results :

Failed tests: 
  TestRegexEventSerializer.testMismatchKeyGenerator:122 null

Tests in error: 
  TestRegexEventSerializer.testEventsWithHeaders:303 ? Runtime org.apache.phoeni...
  TestRegexEventSerializer.testKeyGenerator:82 ? EventDelivery Failed to persist...
  TestRegexEventSerializer.testApacheLogRegex:244 ? Runtime org.apache.phoenix.s...
  TestPhoenixSink.testSinkLifecycle:142 ? Runtime org.apache.phoenix.schema.Tabl...

Tests run: 13, Failures: 1, Errors: 4, Skipped: 0

[INFO] ------------------------------------------------------------------------
[INFO] Reactor Summary:
[INFO] 
[INFO] Apache Phoenix .................................... SUCCESS [4.357s]
[INFO] Phoenix Hadoop Compatibility ...................... SUCCESS [4.048s]
[INFO] Phoenix Core ...................................... SUCCESS [58:15.707s]
[INFO] Phoenix - Flume ................................... FAILURE [1:28.884s]
[INFO] Phoenix - Pig ..................................... SKIPPED
[INFO] Phoenix Hadoop1 Compatibility ..................... SKIPPED
[INFO] Phoenix Assebmly .................................. SKIPPED
[INFO] ------------------------------------------------------------------------
[INFO] BUILD FAILURE
[INFO] ------------------------------------------------------------------------
[INFO] Total time: 59:53.350s
[INFO] Finished at: Mon Mar 03 01:34:31 UTC 2014
[INFO] Final Memory: 26M/254M
[INFO] ------------------------------------------------------------------------
[ERROR] Failed to execute goal org.apache.maven.plugins:maven-surefire-plugin:2.16:test (default-test)
on project phoenix-flume: There are test failures.
[ERROR] 
[ERROR] Please refer to <https://builds.apache.org/job/Phoenix/ws/phoenix-flume/target/surefire-reports>
for the individual test results.
[ERROR] -> [Help 1]
[ERROR] 
[ERROR] To see the full stack trace of the errors, re-run Maven with the -e switch.
[ERROR] Re-run Maven using the -X switch to enable full debug logging.
[ERROR] 
[ERROR] For more information about the errors and possible solutions, please read the following
articles:
[ERROR] [Help 1] http://cwiki.apache.org/confluence/display/MAVEN/MojoFailureException
[ERROR] 
[ERROR] After correcting the problems, you can resume the build with the command
[ERROR]   mvn <goals> -rf :phoenix-flume
Build step 'Invoke top-level Maven targets' marked build as failure
Archiving artifacts
Updating PHOENIX-97
Recording test results

Mime
View raw message