phoenix-commits mailing list archives

Site index · List index
Message view « Date » · « Thread »
Top « Date » · « Thread »
From Apache Jenkins Server <jenk...@builds.apache.org>
Subject Build failed in Jenkins: Apache Phoenix - Branch:master #112
Date Thu, 06 Mar 2014 04:33:43 GMT
See <https://builds.apache.org/job/Phoenix/112/changes>

Changes:

[jamestaylor] Add missing @Override tag

[jamestaylor] PHOENIX-113 Enable usage of ClientKeyValue on client-side (JamesTaylor)

[jamestaylor] Fix coprocessor path for old indexer coprocessor

[jamestaylor] Make default estimation for number of distinct group by values configurable

------------------------------------------
[...truncated 340 lines...]
Running org.apache.phoenix.hbase.index.parallel.TestThreadPoolBuilder
Tests run: 2, Failures: 0, Errors: 0, Skipped: 0, Time elapsed: 0 sec - in org.apache.phoenix.hbase.index.parallel.TestThreadPoolBuilder
Running org.apache.phoenix.hbase.index.parallel.TestThreadPoolManager
Tests run: 3, Failures: 0, Errors: 0, Skipped: 0, Time elapsed: 0.002 sec - in org.apache.phoenix.hbase.index.parallel.TestThreadPoolManager
Running org.apache.phoenix.hbase.index.TestFailForUnsupportedHBaseVersions
Tests run: 2, Failures: 0, Errors: 0, Skipped: 0, Time elapsed: 20.741 sec - in org.apache.phoenix.hbase.index.TestFailForUnsupportedHBaseVersions
Running org.apache.phoenix.hbase.index.util.TestIndexManagementUtil
Tests run: 3, Failures: 0, Errors: 0, Skipped: 0, Time elapsed: 0 sec - in org.apache.phoenix.hbase.index.util.TestIndexManagementUtil
Running org.apache.phoenix.hbase.index.covered.update.TestIndexUpdateManager
Tests run: 2, Failures: 0, Errors: 0, Skipped: 0, Time elapsed: 0.008 sec - in org.apache.phoenix.hbase.index.covered.update.TestIndexUpdateManager
Running org.apache.phoenix.hbase.index.covered.filter.TestNewerTimestampFilter
Tests run: 1, Failures: 0, Errors: 0, Skipped: 0, Time elapsed: 0 sec - in org.apache.phoenix.hbase.index.covered.filter.TestNewerTimestampFilter
Running org.apache.phoenix.hbase.index.covered.filter.TestApplyAndFilterDeletesFilter
Tests run: 6, Failures: 0, Errors: 0, Skipped: 0, Time elapsed: 0.001 sec - in org.apache.phoenix.hbase.index.covered.filter.TestApplyAndFilterDeletesFilter
Running org.apache.phoenix.hbase.index.covered.filter.TestFamilyOnlyFilter
Tests run: 3, Failures: 0, Errors: 0, Skipped: 0, Time elapsed: 0.001 sec - in org.apache.phoenix.hbase.index.covered.filter.TestFamilyOnlyFilter
Running org.apache.phoenix.hbase.index.covered.TestLocalTableState
Tests run: 3, Failures: 0, Errors: 0, Skipped: 0, Time elapsed: 0.066 sec - in org.apache.phoenix.hbase.index.covered.TestLocalTableState
Running org.apache.phoenix.hbase.index.covered.TestEndToEndCoveredColumnsIndexBuilder
Tests run: 2, Failures: 0, Errors: 0, Skipped: 0, Time elapsed: 28.954 sec - in org.apache.phoenix.hbase.index.covered.TestEndToEndCoveredColumnsIndexBuilder
Running org.apache.phoenix.hbase.index.covered.data.TestIndexMemStore
Tests run: 2, Failures: 0, Errors: 0, Skipped: 0, Time elapsed: 0.001 sec - in org.apache.phoenix.hbase.index.covered.data.TestIndexMemStore
Running org.apache.phoenix.hbase.index.covered.TestCoveredColumns
Tests run: 1, Failures: 0, Errors: 0, Skipped: 0, Time elapsed: 0 sec - in org.apache.phoenix.hbase.index.covered.TestCoveredColumns
Running org.apache.phoenix.hbase.index.covered.example.TestCoveredIndexSpecifierBuilder
Tests run: 1, Failures: 0, Errors: 0, Skipped: 0, Time elapsed: 0 sec - in org.apache.phoenix.hbase.index.covered.example.TestCoveredIndexSpecifierBuilder
Running org.apache.phoenix.hbase.index.covered.example.TestEndtoEndIndexingWithCompression
Tests run: 11, Failures: 0, Errors: 0, Skipped: 0, Time elapsed: 111.263 sec - in org.apache.phoenix.hbase.index.covered.example.TestEndtoEndIndexingWithCompression
Running org.apache.phoenix.hbase.index.covered.example.TestCoveredColumnIndexCodec
Tests run: 3, Failures: 0, Errors: 0, Skipped: 0, Time elapsed: 0.003 sec - in org.apache.phoenix.hbase.index.covered.example.TestCoveredColumnIndexCodec
Running org.apache.phoenix.hbase.index.covered.example.TestEndToEndCoveredIndexing
Tests run: 11, Failures: 0, Errors: 0, Skipped: 0, Time elapsed: 108.101 sec - in org.apache.phoenix.hbase.index.covered.example.TestEndToEndCoveredIndexing
Running org.apache.phoenix.hbase.index.covered.example.TestFailWithoutRetries
Tests run: 1, Failures: 0, Errors: 0, Skipped: 0, Time elapsed: 23.564 sec - in org.apache.phoenix.hbase.index.covered.example.TestFailWithoutRetries
Running org.apache.phoenix.hbase.index.covered.example.TestColumnTracker
Tests run: 3, Failures: 0, Errors: 0, Skipped: 0, Time elapsed: 0.001 sec - in org.apache.phoenix.hbase.index.covered.example.TestColumnTracker
Running org.apache.phoenix.arithmetic.ArithmeticOperationTest
Tests run: 4, Failures: 0, Errors: 0, Skipped: 0, Time elapsed: 0.004 sec - in org.apache.phoenix.arithmetic.ArithmeticOperationTest
Running org.apache.phoenix.iterate.SpoolingResultIteratorTest
Tests run: 3, Failures: 0, Errors: 0, Skipped: 0, Time elapsed: 0.009 sec - in org.apache.phoenix.iterate.SpoolingResultIteratorTest
Running org.apache.phoenix.iterate.ConcatResultIteratorTest
Tests run: 2, Failures: 0, Errors: 0, Skipped: 0, Time elapsed: 0.002 sec - in org.apache.phoenix.iterate.ConcatResultIteratorTest
Running org.apache.phoenix.iterate.AggregateResultScannerTest
Tests run: 1, Failures: 0, Errors: 0, Skipped: 0, Time elapsed: 0.043 sec - in org.apache.phoenix.iterate.AggregateResultScannerTest
Running org.apache.phoenix.iterate.MergeSortResultIteratorTest
Tests run: 1, Failures: 0, Errors: 0, Skipped: 0, Time elapsed: 0.001 sec - in org.apache.phoenix.iterate.MergeSortResultIteratorTest
Running org.apache.phoenix.end2end.QueryDatabaseMetaDataTest
Tests run: 15, Failures: 0, Errors: 0, Skipped: 0, Time elapsed: 62.463 sec - in org.apache.phoenix.end2end.QueryDatabaseMetaDataTest
Running org.apache.phoenix.end2end.OrderByTest
Tests run: 3, Failures: 0, Errors: 0, Skipped: 1, Time elapsed: 23.282 sec - in org.apache.phoenix.end2end.OrderByTest
Running org.apache.phoenix.end2end.InMemoryOrderByTest
Tests run: 3, Failures: 0, Errors: 0, Skipped: 1, Time elapsed: 20.652 sec - in org.apache.phoenix.end2end.InMemoryOrderByTest
Running org.apache.phoenix.end2end.SequenceTest
Tests run: 21, Failures: 0, Errors: 0, Skipped: 0, Time elapsed: 32.373 sec - in org.apache.phoenix.end2end.SequenceTest
Running org.apache.phoenix.end2end.ViewTest
Tests run: 7, Failures: 0, Errors: 0, Skipped: 0, Time elapsed: 28.203 sec - in org.apache.phoenix.end2end.ViewTest
Running org.apache.phoenix.end2end.NativeHBaseTypesTest
Tests run: 7, Failures: 0, Errors: 0, Skipped: 0, Time elapsed: 28.534 sec - in org.apache.phoenix.end2end.NativeHBaseTypesTest
Running org.apache.phoenix.end2end.VariableLengthPKTest
Tests run: 49, Failures: 0, Errors: 0, Skipped: 0, Time elapsed: 39.049 sec - in org.apache.phoenix.end2end.VariableLengthPKTest
Running org.apache.phoenix.end2end.UpsertSelectAutoCommitTest
Tests run: 2, Failures: 0, Errors: 0, Skipped: 0, Time elapsed: 27.693 sec - in org.apache.phoenix.end2end.UpsertSelectAutoCommitTest
Running org.apache.phoenix.end2end.CoalesceFunctionTest
Tests run: 1, Failures: 0, Errors: 0, Skipped: 0, Time elapsed: 21.655 sec - in org.apache.phoenix.end2end.CoalesceFunctionTest
Running org.apache.phoenix.end2end.RoundFloorCeilFunctionsEnd2EndTest
Tests run: 21, Failures: 0, Errors: 0, Skipped: 0, Time elapsed: 27.763 sec - in org.apache.phoenix.end2end.RoundFloorCeilFunctionsEnd2EndTest
Running org.apache.phoenix.end2end.UpsertValuesTest
Tests run: 10, Failures: 0, Errors: 0, Skipped: 0, Time elapsed: 33.474 sec - in org.apache.phoenix.end2end.UpsertValuesTest
Running org.apache.phoenix.end2end.ToNumberFunctionTest
Tests run: 18, Failures: 0, Errors: 0, Skipped: 0, Time elapsed: 28.274 sec - in org.apache.phoenix.end2end.ToNumberFunctionTest
Running org.apache.phoenix.end2end.DynamicFamilyTest
Tests run: 4, Failures: 0, Errors: 0, Skipped: 0, Time elapsed: 28.196 sec - in org.apache.phoenix.end2end.DynamicFamilyTest
Running org.apache.phoenix.end2end.QueryPlanTest
Tests run: 1, Failures: 0, Errors: 0, Skipped: 0, Time elapsed: 28.089 sec - in org.apache.phoenix.end2end.QueryPlanTest
Running org.apache.phoenix.end2end.ProductMetricsTest
Tests run: 61, Failures: 0, Errors: 0, Skipped: 0, Time elapsed: 48.267 sec - in org.apache.phoenix.end2end.ProductMetricsTest
Running org.apache.phoenix.end2end.BinaryRowKeyTest
Tests run: 3, Failures: 0, Errors: 0, Skipped: 0, Time elapsed: 30.818 sec - in org.apache.phoenix.end2end.BinaryRowKeyTest
Running org.apache.phoenix.end2end.ArithmeticQueryTest
Tests run: 8, Failures: 0, Errors: 0, Skipped: 0, Time elapsed: 32.595 sec - in org.apache.phoenix.end2end.ArithmeticQueryTest
Running org.apache.phoenix.end2end.QueryExecWithoutSCNTest
Tests run: 1, Failures: 0, Errors: 0, Skipped: 0, Time elapsed: 30.173 sec - in org.apache.phoenix.end2end.QueryExecWithoutSCNTest
Running org.apache.phoenix.end2end.TenantSpecificViewIndexTest
Tests run: 2, Failures: 0, Errors: 0, Skipped: 0, Time elapsed: 37.298 sec - in org.apache.phoenix.end2end.TenantSpecificViewIndexTest
Running org.apache.phoenix.end2end.AutoCommitTest
Tests run: 1, Failures: 0, Errors: 0, Skipped: 0, Time elapsed: 32.139 sec - in org.apache.phoenix.end2end.AutoCommitTest
Running org.apache.phoenix.end2end.MD5FunctionTest
Tests run: 2, Failures: 0, Errors: 0, Skipped: 0, Time elapsed: 32.056 sec - in org.apache.phoenix.end2end.MD5FunctionTest
Running org.apache.phoenix.end2end.ColumnProjectionOptimizationTest
Tests run: 2, Failures: 0, Errors: 0, Skipped: 0, Time elapsed: 43.207 sec - in org.apache.phoenix.end2end.ColumnProjectionOptimizationTest
Running org.apache.phoenix.end2end.SaltedViewTest
Tests run: 1, Failures: 0, Errors: 0, Skipped: 0, Time elapsed: 32.853 sec - in org.apache.phoenix.end2end.SaltedViewTest
Running org.apache.phoenix.end2end.index.ImmutableIndexTest
Tests run: 7, Failures: 0, Errors: 0, Skipped: 0, Time elapsed: 41.817 sec - in org.apache.phoenix.end2end.index.ImmutableIndexTest
Running org.apache.phoenix.end2end.index.DropViewTest
Tests run: 1, Failures: 0, Errors: 0, Skipped: 0, Time elapsed: 31.317 sec - in org.apache.phoenix.end2end.index.DropViewTest
Running org.apache.phoenix.end2end.index.MutableIndexFailureTest
Tests run: 1, Failures: 0, Errors: 0, Skipped: 0, Time elapsed: 60.091 sec - in org.apache.phoenix.end2end.index.MutableIndexFailureTest
Running org.apache.phoenix.end2end.index.IndexMetadataTest
Tests run: 4, Failures: 0, Errors: 0, Skipped: 0, Time elapsed: 37.991 sec - in org.apache.phoenix.end2end.index.IndexMetadataTest
Running org.apache.phoenix.end2end.index.SaltedIndexTest
Tests run: 3, Failures: 0, Errors: 0, Skipped: 0, Time elapsed: 47.724 sec - in org.apache.phoenix.end2end.index.SaltedIndexTest
Running org.apache.phoenix.end2end.index.MutableIndexTest
Tests run: 12, Failures: 0, Errors: 0, Skipped: 1, Time elapsed: 63.49 sec - in org.apache.phoenix.end2end.index.MutableIndexTest
Running org.apache.phoenix.end2end.TenantSpecificTablesDDLTest
Tests run: 16, Failures: 0, Errors: 0, Skipped: 0, Time elapsed: 38.436 sec - in org.apache.phoenix.end2end.TenantSpecificTablesDDLTest
Running org.apache.phoenix.end2end.UpsertBigValuesTest
Tests run: 4, Failures: 0, Errors: 0, Skipped: 0, Time elapsed: 27.371 sec - in org.apache.phoenix.end2end.UpsertBigValuesTest
Running org.apache.phoenix.end2end.DeleteTest
Tests run: 13, Failures: 0, Errors: 0, Skipped: 0, Time elapsed: 38.361 sec - in org.apache.phoenix.end2end.DeleteTest
Running org.apache.phoenix.end2end.salted.SaltedTableTest
Tests run: 8, Failures: 0, Errors: 0, Skipped: 0, Time elapsed: 26.966 sec - in org.apache.phoenix.end2end.salted.SaltedTableTest
Running org.apache.phoenix.end2end.salted.SaltedTableVarLengthRowKeyTest
Tests run: 1, Failures: 0, Errors: 0, Skipped: 0, Time elapsed: 28.279 sec - in org.apache.phoenix.end2end.salted.SaltedTableVarLengthRowKeyTest
Running org.apache.phoenix.end2end.salted.SaltedTableUpsertSelectTest
Tests run: 5, Failures: 0, Errors: 0, Skipped: 0, Time elapsed: 28.838 sec - in org.apache.phoenix.end2end.salted.SaltedTableUpsertSelectTest
Running org.apache.phoenix.end2end.CompareDecimalToLongTest
Tests run: 8, Failures: 0, Errors: 0, Skipped: 0, Time elapsed: 28.304 sec - in org.apache.phoenix.end2end.CompareDecimalToLongTest
Running org.apache.phoenix.end2end.ExecuteStatementsTest
Tests run: 2, Failures: 0, Errors: 0, Skipped: 0, Time elapsed: 28.56 sec - in org.apache.phoenix.end2end.ExecuteStatementsTest
Running org.apache.phoenix.end2end.ToCharFunctionTest
Tests run: 10, Failures: 0, Errors: 0, Skipped: 0, Time elapsed: 28.498 sec - in org.apache.phoenix.end2end.ToCharFunctionTest
Running org.apache.phoenix.end2end.SpillableGroupByTest
Tests run: 1, Failures: 0, Errors: 0, Skipped: 0, Time elapsed: 28.795 sec - in org.apache.phoenix.end2end.SpillableGroupByTest
Running org.apache.phoenix.end2end.SpooledOrderByTest
Tests run: 3, Failures: 0, Errors: 0, Skipped: 1, Time elapsed: 28.036 sec - in org.apache.phoenix.end2end.SpooledOrderByTest
Running org.apache.phoenix.end2end.PercentileTest
Tests run: 17, Failures: 0, Errors: 0, Skipped: 0, Time elapsed: 28.505 sec - in org.apache.phoenix.end2end.PercentileTest
Running org.apache.phoenix.end2end.ExtendedQueryExecTest
Tests run: 4, Failures: 0, Errors: 0, Skipped: 0, Time elapsed: 28.096 sec - in org.apache.phoenix.end2end.ExtendedQueryExecTest
Running org.apache.phoenix.end2end.CSVCommonsLoaderTest
Tests run: 11, Failures: 0, Errors: 0, Skipped: 0, Time elapsed: 28.438 sec - in org.apache.phoenix.end2end.CSVCommonsLoaderTest
Running org.apache.phoenix.end2end.DefaultParallelIteratorsRegionSplitterTest
Tests run: 2, Failures: 0, Errors: 0, Skipped: 0, Time elapsed: 27.107 sec - in org.apache.phoenix.end2end.DefaultParallelIteratorsRegionSplitterTest
Running org.apache.phoenix.end2end.MultiCfQueryExecTest
Tests run: 7, Failures: 0, Errors: 0, Skipped: 0, Time elapsed: 29.854 sec - in org.apache.phoenix.end2end.MultiCfQueryExecTest
Running org.apache.phoenix.end2end.CreateTableTest
Tests run: 2, Failures: 0, Errors: 0, Skipped: 0, Time elapsed: 28.312 sec - in org.apache.phoenix.end2end.CreateTableTest
Running org.apache.phoenix.end2end.ReadIsolationLevelTest
Tests run: 2, Failures: 0, Errors: 0, Skipped: 0, Time elapsed: 28.695 sec - in org.apache.phoenix.end2end.ReadIsolationLevelTest
Running org.apache.phoenix.end2end.ReverseFunctionTest
Tests run: 5, Failures: 0, Errors: 0, Skipped: 0, Time elapsed: 28.443 sec - in org.apache.phoenix.end2end.ReverseFunctionTest
Running org.apache.phoenix.end2end.HashJoinTest
Tests run: 48, Failures: 0, Errors: 0, Skipped: 0, Time elapsed: 61.468 sec - in org.apache.phoenix.end2end.HashJoinTest
Running org.apache.phoenix.end2end.KeyOnlyTest
Tests run: 2, Failures: 0, Errors: 0, Skipped: 0, Time elapsed: 28.392 sec - in org.apache.phoenix.end2end.KeyOnlyTest
Running org.apache.phoenix.end2end.TruncateFunctionTest
Tests run: 1, Failures: 0, Errors: 0, Skipped: 0, Time elapsed: 19.377 sec - in org.apache.phoenix.end2end.TruncateFunctionTest
Running org.apache.phoenix.end2end.StatementHintsTest
Tests run: 2, Failures: 0, Errors: 0, Skipped: 0, Time elapsed: 28.194 sec - in org.apache.phoenix.end2end.StatementHintsTest
Running org.apache.phoenix.end2end.DistinctCountTest
Tests run: 9, Failures: 0, Errors: 0, Skipped: 0, Time elapsed: 28.127 sec - in org.apache.phoenix.end2end.DistinctCountTest
Running org.apache.phoenix.end2end.FunkyNamesTest
Tests run: 3, Failures: 0, Errors: 0, Skipped: 0, Time elapsed: 21.104 sec - in org.apache.phoenix.end2end.FunkyNamesTest
Running org.apache.phoenix.end2end.SkipRangeParallelIteratorRegionSplitterTest
Tests run: 8, Failures: 0, Errors: 0, Skipped: 0, Time elapsed: 27.884 sec - in org.apache.phoenix.end2end.SkipRangeParallelIteratorRegionSplitterTest
Running org.apache.phoenix.end2end.RowValueConstructorTest
Tests run: 24, Failures: 0, Errors: 0, Skipped: 0, Time elapsed: 31.885 sec - in org.apache.phoenix.end2end.RowValueConstructorTest
Running org.apache.phoenix.end2end.StddevTest
Tests run: 4, Failures: 0, Errors: 0, Skipped: 0, Time elapsed: 30.953 sec - in org.apache.phoenix.end2end.StddevTest
Running org.apache.phoenix.end2end.TenantSpecificViewIndexSaltedTest
Tests run: 2, Failures: 0, Errors: 0, Skipped: 0, Time elapsed: 33.878 sec - in org.apache.phoenix.end2end.TenantSpecificViewIndexSaltedTest
Running org.apache.phoenix.end2end.TenantSpecificTablesDMLTest
Tests run: 12, Failures: 0, Errors: 0, Skipped: 0, Time elapsed: 28.66 sec - in org.apache.phoenix.end2end.TenantSpecificTablesDMLTest
Running org.apache.phoenix.end2end.DynamicColumnTest
Tests run: 5, Failures: 0, Errors: 0, Skipped: 0, Time elapsed: 29.952 sec - in org.apache.phoenix.end2end.DynamicColumnTest
Running org.apache.phoenix.end2end.ServerExceptionTest
Tests run: 1, Failures: 0, Errors: 0, Skipped: 0, Time elapsed: 33.122 sec - in org.apache.phoenix.end2end.ServerExceptionTest
Running org.apache.phoenix.end2end.AlterTableTest
Tests run: 13, Failures: 0, Errors: 0, Skipped: 0, Time elapsed: 53.546 sec - in org.apache.phoenix.end2end.AlterTableTest
Running org.apache.phoenix.end2end.DynamicUpsertTest
Tests run: 7, Failures: 0, Errors: 0, Skipped: 0, Time elapsed: 27.374 sec - in org.apache.phoenix.end2end.DynamicUpsertTest
Running org.apache.phoenix.end2end.CustomEntityDataTest
Tests run: 3, Failures: 0, Errors: 0, Skipped: 0, Time elapsed: 31.18 sec - in org.apache.phoenix.end2end.CustomEntityDataTest
Running org.apache.phoenix.end2end.SortOrderFTest
Tests run: 29, Failures: 0, Errors: 0, Skipped: 0, Time elapsed: 29.688 sec - in org.apache.phoenix.end2end.SortOrderFTest
Running org.apache.phoenix.end2end.StatsManagerTest
Tests run: 1, Failures: 0, Errors: 0, Skipped: 0, Time elapsed: 57.121 sec - in org.apache.phoenix.end2end.StatsManagerTest
Running org.apache.phoenix.end2end.GroupByCaseTest
Tests run: 3, Failures: 0, Errors: 0, Skipped: 0, Time elapsed: 30.142 sec - in org.apache.phoenix.end2end.GroupByCaseTest
Running org.apache.phoenix.end2end.UpsertSelectTest
Tests run: 11, Failures: 0, Errors: 0, Skipped: 0, Time elapsed: 51.094 sec - in org.apache.phoenix.end2end.UpsertSelectTest
Running org.apache.phoenix.end2end.QueryTest
Tests run: 432, Failures: 0, Errors: 0, Skipped: 0, Time elapsed: 272.091 sec - in org.apache.phoenix.end2end.QueryTest
Running org.apache.phoenix.end2end.SkipScanQueryTest
Tests run: 7, Failures: 0, Errors: 0, Skipped: 0, Time elapsed: 34.753 sec - in org.apache.phoenix.end2end.SkipScanQueryTest
Running org.apache.phoenix.end2end.TopNTest
Tests run: 4, Failures: 0, Errors: 0, Skipped: 0, Time elapsed: 30.144 sec - in org.apache.phoenix.end2end.TopNTest
Running org.apache.phoenix.end2end.IsNullTest
Tests run: 1, Failures: 0, Errors: 0, Skipped: 0, Time elapsed: 21.63 sec - in org.apache.phoenix.end2end.IsNullTest
Running org.apache.phoenix.end2end.ArrayTest
Tests run: 34, Failures: 0, Errors: 0, Skipped: 0, Time elapsed: 40.823 sec - in org.apache.phoenix.end2end.ArrayTest

Results :

Failed tests: 
  ConnectionlessUpsertTest.testSaltedConnectionlessUpsert:88->testConnectionlessUpsert:127->assertRow1:144
expected:<[Eli]> but was:<[? D?|?z]>
  ConnectionlessUpsertTest.testConnectionlessUpsert:83->testConnectionlessUpsert:127->assertRow1:144
expected:<[Eli]> but was:<[? D?|?z]>

Tests in error: 
  RowKeyValueAccessorTest.testFixedLengthValueAtEnd:85->assertExpectedRowKeyValue:44->assertExpectedRowKeyValue:72
? UnsupportedOperation
  RowKeySchemaTest.testVarNullNull:137->assertExpectedRowKeyValue:48->assertIteration:90
? UnsupportedOperation
  RowKeySchemaTest.testFixedFixedVar:132->assertExpectedRowKeyValue:48->assertIteration:90
? UnsupportedOperation
  RowKeySchemaTest.testFixedLengthValueAtEnd:122->assertExpectedRowKeyValue:48->assertIteration:90
? UnsupportedOperation
  RowKeySchemaTest.testVarFixedVar:142->assertExpectedRowKeyValue:48->assertIteration:90
? UnsupportedOperation
  RowKeySchemaTest.testFixedVarVar:127->assertExpectedRowKeyValue:48->assertIteration:90
? UnsupportedOperation
  RowKeySchemaTest.testVarFixedFixed:147->assertExpectedRowKeyValue:48->assertIteration:90
? UnsupportedOperation
  IndexMaintainerTest.testMultiKeyValueCoveredIndex:198->testIndexRowKeyBuilding:67->testIndexRowKeyBuilding:87->testIndexRowKeyBuilding:137
? UnsupportedOperation
  IndexMaintainerTest.testMultiKeyValueIndex:193->testIndexRowKeyBuilding:63->testIndexRowKeyBuilding:87->testIndexRowKeyBuilding:137
? UnsupportedOperation
  IndexMaintainerTest.testMultiKeyValueCoveredSaltedIndex:256->testIndexRowKeyBuilding:71->testIndexRowKeyBuilding:87->testIndexRowKeyBuilding:137
? UnsupportedOperation
  IndexMaintainerTest.testSingleKeyValueDescIndex:203->testIndexRowKeyBuilding:63->testIndexRowKeyBuilding:87->testIndexRowKeyBuilding:137
? UnsupportedOperation
  IndexMaintainerTest.testSingleKeyValueIndex:188->testIndexRowKeyBuilding:63->testIndexRowKeyBuilding:87->testIndexRowKeyBuilding:137
? UnsupportedOperation

Tests run: 1751, Failures: 2, Errors: 12, Skipped: 7

[INFO] ------------------------------------------------------------------------
[INFO] Reactor Summary:
[INFO] 
[INFO] Apache Phoenix .................................... SUCCESS [2.794s]
[INFO] Phoenix Hadoop Compatibility ...................... SUCCESS [2.312s]
[INFO] Phoenix Core ...................................... FAILURE [51:21.543s]
[INFO] Phoenix - Flume ................................... SKIPPED
[INFO] Phoenix - Pig ..................................... SKIPPED
[INFO] Phoenix Hadoop1 Compatibility ..................... SKIPPED
[INFO] Phoenix Assebmly .................................. SKIPPED
[INFO] ------------------------------------------------------------------------
[INFO] BUILD FAILURE
[INFO] ------------------------------------------------------------------------
[INFO] Total time: 51:27.759s
[INFO] Finished at: Thu Mar 06 04:32:58 UTC 2014
[INFO] Final Memory: 20M/180M
[INFO] ------------------------------------------------------------------------
[ERROR] Failed to execute goal org.apache.maven.plugins:maven-surefire-plugin:2.16:test (default-test)
on project phoenix-core: There are test failures.
[ERROR] 
[ERROR] Please refer to /home/hudson/jenkins-slave/workspace/Phoenix/phoenix-core/target/surefire-reports
for the individual test results.
[ERROR] -> [Help 1]
[ERROR] 
[ERROR] To see the full stack trace of the errors, re-run Maven with the -e switch.
[ERROR] Re-run Maven using the -X switch to enable full debug logging.
[ERROR] 
[ERROR] For more information about the errors and possible solutions, please read the following
articles:
[ERROR] [Help 1] http://cwiki.apache.org/confluence/display/MAVEN/MojoFailureException
[ERROR] 
[ERROR] After correcting the problems, you can resume the build with the command
[ERROR]   mvn <goals> -rf :phoenix-core
Build step 'Invoke top-level Maven targets' marked build as failure
Archiving artifacts
Updating PHOENIX-113
Recording test results

Mime
View raw message