phoenix-commits mailing list archives

Site index · List index
Message view « Date » · « Thread »
Top « Date » · « Thread »
From Apache Jenkins Server <jenk...@builds.apache.org>
Subject Build failed in Jenkins: Apache Phoenix - Branch:master #99
Date Mon, 03 Mar 2014 23:42:25 GMT
See <https://builds.apache.org/job/Phoenix/99/changes>

Changes:

[jamestaylor] Fix failing unit test

------------------------------------------
[...truncated 208 lines...]
Tests run: 6, Failures: 0, Errors: 0, Skipped: 2, Time elapsed: 0 sec - in org.apache.phoenix.client.TestClientKeyValueLocal
Running org.apache.phoenix.hbase.index.write.TestParalleWriterIndexCommitter
Tests run: 2, Failures: 0, Errors: 0, Skipped: 0, Time elapsed: 0.029 sec - in org.apache.phoenix.hbase.index.write.TestParalleWriterIndexCommitter
Running org.apache.phoenix.hbase.index.write.TestCachingHTableFactory
Tests run: 1, Failures: 0, Errors: 0, Skipped: 0, Time elapsed: 0.008 sec - in org.apache.phoenix.hbase.index.write.TestCachingHTableFactory
Running org.apache.phoenix.hbase.index.write.TestIndexWriter
Tests run: 5, Failures: 0, Errors: 0, Skipped: 0, Time elapsed: 0.034 sec - in org.apache.phoenix.hbase.index.write.TestIndexWriter
Running org.apache.phoenix.hbase.index.write.TestParalleIndexWriter
Tests run: 2, Failures: 0, Errors: 0, Skipped: 0, Time elapsed: 0.005 sec - in org.apache.phoenix.hbase.index.write.TestParalleIndexWriter
Running org.apache.phoenix.hbase.index.write.recovery.TestPerRegionIndexWriteCache
Tests run: 3, Failures: 0, Errors: 0, Skipped: 0, Time elapsed: 0 sec - in org.apache.phoenix.hbase.index.write.recovery.TestPerRegionIndexWriteCache
Running org.apache.phoenix.hbase.index.write.TestWALRecoveryCaching
Tests run: 1, Failures: 0, Errors: 0, Skipped: 1, Time elapsed: 0 sec - in org.apache.phoenix.hbase.index.write.TestWALRecoveryCaching
Running org.apache.phoenix.hbase.index.parallel.TestThreadPoolBuilder
Tests run: 2, Failures: 0, Errors: 0, Skipped: 0, Time elapsed: 0 sec - in org.apache.phoenix.hbase.index.parallel.TestThreadPoolBuilder
Running org.apache.phoenix.hbase.index.parallel.TestThreadPoolManager
Tests run: 3, Failures: 0, Errors: 0, Skipped: 0, Time elapsed: 0.002 sec - in org.apache.phoenix.hbase.index.parallel.TestThreadPoolManager
Running org.apache.phoenix.hbase.index.TestFailForUnsupportedHBaseVersions
Tests run: 2, Failures: 0, Errors: 0, Skipped: 0, Time elapsed: 20.918 sec - in org.apache.phoenix.hbase.index.TestFailForUnsupportedHBaseVersions
Running org.apache.phoenix.hbase.index.util.TestIndexManagementUtil
Tests run: 3, Failures: 0, Errors: 0, Skipped: 0, Time elapsed: 0.006 sec - in org.apache.phoenix.hbase.index.util.TestIndexManagementUtil
Running org.apache.phoenix.hbase.index.covered.update.TestIndexUpdateManager
Tests run: 2, Failures: 0, Errors: 0, Skipped: 0, Time elapsed: 0.007 sec - in org.apache.phoenix.hbase.index.covered.update.TestIndexUpdateManager
Running org.apache.phoenix.hbase.index.covered.filter.TestNewerTimestampFilter
Tests run: 1, Failures: 0, Errors: 0, Skipped: 0, Time elapsed: 0.001 sec - in org.apache.phoenix.hbase.index.covered.filter.TestNewerTimestampFilter
Running org.apache.phoenix.hbase.index.covered.filter.TestApplyAndFilterDeletesFilter
Tests run: 6, Failures: 0, Errors: 0, Skipped: 0, Time elapsed: 0.001 sec - in org.apache.phoenix.hbase.index.covered.filter.TestApplyAndFilterDeletesFilter
Running org.apache.phoenix.hbase.index.covered.filter.TestFamilyOnlyFilter
Tests run: 3, Failures: 0, Errors: 0, Skipped: 0, Time elapsed: 0 sec - in org.apache.phoenix.hbase.index.covered.filter.TestFamilyOnlyFilter
Running org.apache.phoenix.hbase.index.covered.TestLocalTableState
Tests run: 3, Failures: 0, Errors: 0, Skipped: 0, Time elapsed: 0.068 sec - in org.apache.phoenix.hbase.index.covered.TestLocalTableState
Running org.apache.phoenix.hbase.index.covered.TestEndToEndCoveredColumnsIndexBuilder
Tests run: 2, Failures: 0, Errors: 0, Skipped: 0, Time elapsed: 44.85 sec - in org.apache.phoenix.hbase.index.covered.TestEndToEndCoveredColumnsIndexBuilder
Running org.apache.phoenix.hbase.index.covered.data.TestIndexMemStore
Tests run: 2, Failures: 0, Errors: 0, Skipped: 0, Time elapsed: 0.001 sec - in org.apache.phoenix.hbase.index.covered.data.TestIndexMemStore
Running org.apache.phoenix.hbase.index.covered.TestCoveredColumns
Tests run: 1, Failures: 0, Errors: 0, Skipped: 0, Time elapsed: 0 sec - in org.apache.phoenix.hbase.index.covered.TestCoveredColumns
Running org.apache.phoenix.hbase.index.covered.example.TestCoveredIndexSpecifierBuilder
Tests run: 1, Failures: 0, Errors: 0, Skipped: 0, Time elapsed: 0 sec - in org.apache.phoenix.hbase.index.covered.example.TestCoveredIndexSpecifierBuilder
Running org.apache.phoenix.hbase.index.covered.example.TestEndtoEndIndexingWithCompression
Tests run: 11, Failures: 0, Errors: 0, Skipped: 0, Time elapsed: 108.57 sec - in org.apache.phoenix.hbase.index.covered.example.TestEndtoEndIndexingWithCompression
Running org.apache.phoenix.hbase.index.covered.example.TestCoveredColumnIndexCodec
Tests run: 3, Failures: 0, Errors: 0, Skipped: 0, Time elapsed: 0.004 sec - in org.apache.phoenix.hbase.index.covered.example.TestCoveredColumnIndexCodec
Running org.apache.phoenix.hbase.index.covered.example.TestEndToEndCoveredIndexing
Tests run: 11, Failures: 0, Errors: 0, Skipped: 0, Time elapsed: 109.424 sec - in org.apache.phoenix.hbase.index.covered.example.TestEndToEndCoveredIndexing
Running org.apache.phoenix.hbase.index.covered.example.TestFailWithoutRetries
Tests run: 1, Failures: 0, Errors: 0, Skipped: 0, Time elapsed: 21.257 sec - in org.apache.phoenix.hbase.index.covered.example.TestFailWithoutRetries
Running org.apache.phoenix.hbase.index.covered.example.TestColumnTracker
Tests run: 3, Failures: 0, Errors: 0, Skipped: 0, Time elapsed: 0 sec - in org.apache.phoenix.hbase.index.covered.example.TestColumnTracker
Running org.apache.phoenix.arithmetic.ArithmeticOperationTest
Tests run: 4, Failures: 0, Errors: 0, Skipped: 0, Time elapsed: 0.003 sec - in org.apache.phoenix.arithmetic.ArithmeticOperationTest
Running org.apache.phoenix.iterate.SpoolingResultIteratorTest
Tests run: 3, Failures: 0, Errors: 0, Skipped: 0, Time elapsed: 0.007 sec - in org.apache.phoenix.iterate.SpoolingResultIteratorTest
Running org.apache.phoenix.iterate.ConcatResultIteratorTest
Tests run: 2, Failures: 0, Errors: 0, Skipped: 0, Time elapsed: 0.001 sec - in org.apache.phoenix.iterate.ConcatResultIteratorTest
Running org.apache.phoenix.iterate.AggregateResultScannerTest
Tests run: 1, Failures: 0, Errors: 0, Skipped: 0, Time elapsed: 0.042 sec - in org.apache.phoenix.iterate.AggregateResultScannerTest
Running org.apache.phoenix.iterate.MergeSortResultIteratorTest
Tests run: 1, Failures: 0, Errors: 0, Skipped: 0, Time elapsed: 0 sec - in org.apache.phoenix.iterate.MergeSortResultIteratorTest
Running org.apache.phoenix.end2end.QueryDatabaseMetaDataTest
Tests run: 15, Failures: 0, Errors: 0, Skipped: 0, Time elapsed: 79.078 sec - in org.apache.phoenix.end2end.QueryDatabaseMetaDataTest
Running org.apache.phoenix.end2end.OrderByTest
Tests run: 3, Failures: 0, Errors: 0, Skipped: 1, Time elapsed: 33.763 sec - in org.apache.phoenix.end2end.OrderByTest
Running org.apache.phoenix.end2end.InMemoryOrderByTest
Tests run: 3, Failures: 0, Errors: 0, Skipped: 1, Time elapsed: 29.337 sec - in org.apache.phoenix.end2end.InMemoryOrderByTest
Running org.apache.phoenix.end2end.SequenceTest
Tests run: 21, Failures: 0, Errors: 0, Skipped: 0, Time elapsed: 29.698 sec - in org.apache.phoenix.end2end.SequenceTest
Running org.apache.phoenix.end2end.ViewTest
Tests run: 6, Failures: 0, Errors: 0, Skipped: 0, Time elapsed: 28.081 sec - in org.apache.phoenix.end2end.ViewTest
Running org.apache.phoenix.end2end.NativeHBaseTypesTest
Tests run: 7, Failures: 0, Errors: 0, Skipped: 0, Time elapsed: 29.454 sec - in org.apache.phoenix.end2end.NativeHBaseTypesTest
Running org.apache.phoenix.end2end.VariableLengthPKTest
Tests run: 49, Failures: 0, Errors: 0, Skipped: 0, Time elapsed: 39.323 sec - in org.apache.phoenix.end2end.VariableLengthPKTest
Running org.apache.phoenix.end2end.UpsertSelectAutoCommitTest
Tests run: 1, Failures: 0, Errors: 0, Skipped: 0, Time elapsed: 27.309 sec - in org.apache.phoenix.end2end.UpsertSelectAutoCommitTest
Running org.apache.phoenix.end2end.CoalesceFunctionTest
Tests run: 1, Failures: 0, Errors: 0, Skipped: 0, Time elapsed: 21.304 sec - in org.apache.phoenix.end2end.CoalesceFunctionTest
Running org.apache.phoenix.end2end.RoundFloorCeilFunctionsEnd2EndTest
Tests run: 21, Failures: 0, Errors: 0, Skipped: 0, Time elapsed: 29.108 sec - in org.apache.phoenix.end2end.RoundFloorCeilFunctionsEnd2EndTest
Running org.apache.phoenix.end2end.UpsertValuesTest
Tests run: 10, Failures: 0, Errors: 0, Skipped: 0, Time elapsed: 38.206 sec - in org.apache.phoenix.end2end.UpsertValuesTest
Running org.apache.phoenix.end2end.ToNumberFunctionTest
Tests run: 18, Failures: 0, Errors: 0, Skipped: 0, Time elapsed: 27.854 sec - in org.apache.phoenix.end2end.ToNumberFunctionTest
Running org.apache.phoenix.end2end.DynamicFamilyTest
Tests run: 4, Failures: 0, Errors: 0, Skipped: 0, Time elapsed: 33.931 sec - in org.apache.phoenix.end2end.DynamicFamilyTest
Running org.apache.phoenix.end2end.QueryPlanTest
Tests run: 1, Failures: 0, Errors: 0, Skipped: 0, Time elapsed: 29.215 sec - in org.apache.phoenix.end2end.QueryPlanTest
Running org.apache.phoenix.end2end.ProductMetricsTest
Tests run: 61, Failures: 0, Errors: 0, Skipped: 0, Time elapsed: 50.078 sec - in org.apache.phoenix.end2end.ProductMetricsTest
Running org.apache.phoenix.end2end.BinaryRowKeyTest
Tests run: 3, Failures: 0, Errors: 0, Skipped: 0, Time elapsed: 28.663 sec - in org.apache.phoenix.end2end.BinaryRowKeyTest
Running org.apache.phoenix.end2end.ArithmeticQueryTest
Tests run: 8, Failures: 0, Errors: 0, Skipped: 0, Time elapsed: 32.533 sec - in org.apache.phoenix.end2end.ArithmeticQueryTest
Running org.apache.phoenix.end2end.QueryExecWithoutSCNTest
Tests run: 1, Failures: 0, Errors: 0, Skipped: 0, Time elapsed: 37.298 sec - in org.apache.phoenix.end2end.QueryExecWithoutSCNTest
Running org.apache.phoenix.end2end.TenantSpecificViewIndexTest
Tests run: 1, Failures: 0, Errors: 0, Skipped: 0, Time elapsed: 30.695 sec - in org.apache.phoenix.end2end.TenantSpecificViewIndexTest
Running org.apache.phoenix.end2end.AutoCommitTest
Tests run: 1, Failures: 0, Errors: 0, Skipped: 0, Time elapsed: 23.617 sec - in org.apache.phoenix.end2end.AutoCommitTest
Running org.apache.phoenix.end2end.MD5FunctionTest
Tests run: 2, Failures: 0, Errors: 0, Skipped: 0, Time elapsed: 32.147 sec - in org.apache.phoenix.end2end.MD5FunctionTest
Running org.apache.phoenix.end2end.ColumnProjectionOptimizationTest
Tests run: 2, Failures: 0, Errors: 0, Skipped: 0, Time elapsed: 41.559 sec - in org.apache.phoenix.end2end.ColumnProjectionOptimizationTest
Running org.apache.phoenix.end2end.SaltedViewTest
Tests run: 1, Failures: 0, Errors: 0, Skipped: 0, Time elapsed: 44.644 sec - in org.apache.phoenix.end2end.SaltedViewTest
Running org.apache.phoenix.end2end.index.ImmutableIndexTest
Tests run: 7, Failures: 0, Errors: 0, Skipped: 0, Time elapsed: 54.584 sec - in org.apache.phoenix.end2end.index.ImmutableIndexTest
Running org.apache.phoenix.end2end.index.DropViewTest
Tests run: 1, Failures: 0, Errors: 0, Skipped: 0, Time elapsed: 50.718 sec - in org.apache.phoenix.end2end.index.DropViewTest
Running org.apache.phoenix.end2end.index.MutableIndexFailureTest
Tests run: 1, Failures: 0, Errors: 0, Skipped: 0, Time elapsed: 59.34 sec - in org.apache.phoenix.end2end.index.MutableIndexFailureTest
Running org.apache.phoenix.end2end.index.IndexMetadataTest
Tests run: 4, Failures: 0, Errors: 0, Skipped: 0, Time elapsed: 39.666 sec - in org.apache.phoenix.end2end.index.IndexMetadataTest
Running org.apache.phoenix.end2end.index.SaltedIndexTest
Tests run: 3, Failures: 0, Errors: 0, Skipped: 0, Time elapsed: 51.947 sec - in org.apache.phoenix.end2end.index.SaltedIndexTest
Running org.apache.phoenix.end2end.index.MutableIndexTest
Tests run: 11, Failures: 0, Errors: 0, Skipped: 0, Time elapsed: 68.08 sec - in org.apache.phoenix.end2end.index.MutableIndexTest
Running org.apache.phoenix.end2end.TenantSpecificTablesDDLTest
Tests run: 16, Failures: 0, Errors: 0, Skipped: 0, Time elapsed: 67.438 sec - in org.apache.phoenix.end2end.TenantSpecificTablesDDLTest
Running org.apache.phoenix.end2end.UpsertBigValuesTest
Tests run: 4, Failures: 0, Errors: 0, Skipped: 0, Time elapsed: 52.358 sec - in org.apache.phoenix.end2end.UpsertBigValuesTest
Running org.apache.phoenix.end2end.DeleteTest
Tests run: 13, Failures: 0, Errors: 0, Skipped: 0, Time elapsed: 55.952 sec - in org.apache.phoenix.end2end.DeleteTest
Running org.apache.phoenix.end2end.salted.SaltedTableTest
Tests run: 8, Failures: 0, Errors: 0, Skipped: 0, Time elapsed: 36.207 sec - in org.apache.phoenix.end2end.salted.SaltedTableTest
Running org.apache.phoenix.end2end.salted.SaltedTableVarLengthRowKeyTest
Tests run: 1, Failures: 0, Errors: 0, Skipped: 0, Time elapsed: 20.044 sec - in org.apache.phoenix.end2end.salted.SaltedTableVarLengthRowKeyTest
Running org.apache.phoenix.end2end.salted.SaltedTableUpsertSelectTest
Tests run: 5, Failures: 0, Errors: 0, Skipped: 0, Time elapsed: 32.981 sec - in org.apache.phoenix.end2end.salted.SaltedTableUpsertSelectTest
Running org.apache.phoenix.end2end.CompareDecimalToLongTest
Tests run: 8, Failures: 0, Errors: 0, Skipped: 0, Time elapsed: 32.269 sec - in org.apache.phoenix.end2end.CompareDecimalToLongTest
Running org.apache.phoenix.end2end.ExecuteStatementsTest
Tests run: 2, Failures: 0, Errors: 0, Skipped: 0, Time elapsed: 40.197 sec - in org.apache.phoenix.end2end.ExecuteStatementsTest
Running org.apache.phoenix.end2end.ToCharFunctionTest
Tests run: 10, Failures: 0, Errors: 0, Skipped: 0, Time elapsed: 33.78 sec - in org.apache.phoenix.end2end.ToCharFunctionTest
Running org.apache.phoenix.end2end.SpillableGroupByTest
Tests run: 1, Failures: 0, Errors: 0, Skipped: 0, Time elapsed: 35.504 sec - in org.apache.phoenix.end2end.SpillableGroupByTest
Running org.apache.phoenix.end2end.SpooledOrderByTest
Tests run: 3, Failures: 0, Errors: 0, Skipped: 1, Time elapsed: 39.064 sec - in org.apache.phoenix.end2end.SpooledOrderByTest
Running org.apache.phoenix.end2end.PercentileTest
Tests run: 17, Failures: 0, Errors: 0, Skipped: 0, Time elapsed: 52.649 sec - in org.apache.phoenix.end2end.PercentileTest
Running org.apache.phoenix.end2end.ExtendedQueryExecTest
Tests run: 4, Failures: 0, Errors: 0, Skipped: 0, Time elapsed: 32.655 sec - in org.apache.phoenix.end2end.ExtendedQueryExecTest
Running org.apache.phoenix.end2end.CSVLoaderTest
Tests run: 10, Failures: 0, Errors: 0, Skipped: 0, Time elapsed: 40.252 sec - in org.apache.phoenix.end2end.CSVLoaderTest
Running org.apache.phoenix.end2end.DefaultParallelIteratorsRegionSplitterTest
Tests run: 3, Failures: 1, Errors: 0, Skipped: 0, Time elapsed: 53.332 sec <<< FAILURE!
- in org.apache.phoenix.end2end.DefaultParallelIteratorsRegionSplitterTest
testStatsManagerImpl(org.apache.phoenix.end2end.DefaultParallelIteratorsRegionSplitterTest)
 Time elapsed: 12.905 sec  <<< FAILURE!
java.lang.AssertionError: null
	at org.junit.Assert.fail(Assert.java:86)
	at org.junit.Assert.assertTrue(Assert.java:41)
	at org.junit.Assert.assertTrue(Assert.java:52)
	at org.apache.phoenix.end2end.DefaultParallelIteratorsRegionSplitterTest.testStatsManagerImpl(DefaultParallelIteratorsRegionSplitterTest.java:294)

Running org.apache.phoenix.end2end.MultiCfQueryExecTest
Tests run: 7, Failures: 0, Errors: 0, Skipped: 0, Time elapsed: 45.294 sec - in org.apache.phoenix.end2end.MultiCfQueryExecTest
Running org.apache.phoenix.end2end.CreateTableTest
Tests run: 2, Failures: 0, Errors: 0, Skipped: 0, Time elapsed: 31.436 sec - in org.apache.phoenix.end2end.CreateTableTest
Running org.apache.phoenix.end2end.ReadIsolationLevelTest
Tests run: 2, Failures: 0, Errors: 0, Skipped: 0, Time elapsed: 32.4 sec - in org.apache.phoenix.end2end.ReadIsolationLevelTest
Running org.apache.phoenix.end2end.ReverseFunctionTest
Tests run: 5, Failures: 0, Errors: 0, Skipped: 0, Time elapsed: 44.954 sec - in org.apache.phoenix.end2end.ReverseFunctionTest
Running org.apache.phoenix.end2end.HashJoinTest
Tests run: 48, Failures: 0, Errors: 0, Skipped: 0, Time elapsed: 75.452 sec - in org.apache.phoenix.end2end.HashJoinTest
Running org.apache.phoenix.end2end.KeyOnlyTest
Tests run: 2, Failures: 0, Errors: 0, Skipped: 0, Time elapsed: 28.109 sec - in org.apache.phoenix.end2end.KeyOnlyTest
Running org.apache.phoenix.end2end.StatementHintsTest
Tests run: 2, Failures: 0, Errors: 0, Skipped: 0, Time elapsed: 21.688 sec - in org.apache.phoenix.end2end.StatementHintsTest
Running org.apache.phoenix.end2end.DistinctCountTest
Tests run: 9, Failures: 0, Errors: 0, Skipped: 0, Time elapsed: 34.877 sec - in org.apache.phoenix.end2end.DistinctCountTest
Running org.apache.phoenix.end2end.FunkyNamesTest
Tests run: 3, Failures: 0, Errors: 0, Skipped: 0, Time elapsed: 39.73 sec - in org.apache.phoenix.end2end.FunkyNamesTest
Running org.apache.phoenix.end2end.SkipRangeParallelIteratorRegionSplitterTest
Tests run: 8, Failures: 0, Errors: 0, Skipped: 0, Time elapsed: 56.294 sec - in org.apache.phoenix.end2end.SkipRangeParallelIteratorRegionSplitterTest
Running org.apache.phoenix.end2end.RowValueConstructorTest
Tests run: 24, Failures: 0, Errors: 0, Skipped: 0, Time elapsed: 52.778 sec - in org.apache.phoenix.end2end.RowValueConstructorTest
Running org.apache.phoenix.end2end.StddevTest
Tests run: 4, Failures: 0, Errors: 0, Skipped: 0, Time elapsed: 39.71 sec - in org.apache.phoenix.end2end.StddevTest
Running org.apache.phoenix.end2end.TenantSpecificViewIndexSaltedTest
Tests run: 1, Failures: 0, Errors: 0, Skipped: 0, Time elapsed: 31.809 sec - in org.apache.phoenix.end2end.TenantSpecificViewIndexSaltedTest
Running org.apache.phoenix.end2end.TenantSpecificTablesDMLTest
Tests run: 12, Failures: 0, Errors: 0, Skipped: 0, Time elapsed: 38.193 sec - in org.apache.phoenix.end2end.TenantSpecificTablesDMLTest
Running org.apache.phoenix.end2end.DynamicColumnTest
Tests run: 5, Failures: 0, Errors: 0, Skipped: 0, Time elapsed: 20.732 sec - in org.apache.phoenix.end2end.DynamicColumnTest
Running org.apache.phoenix.end2end.ServerExceptionTest
Tests run: 1, Failures: 0, Errors: 0, Skipped: 0, Time elapsed: 29.421 sec - in org.apache.phoenix.end2end.ServerExceptionTest
Running org.apache.phoenix.end2end.AlterTableTest
Tests run: 13, Failures: 0, Errors: 0, Skipped: 0, Time elapsed: 77.091 sec - in org.apache.phoenix.end2end.AlterTableTest
Running org.apache.phoenix.end2end.DynamicUpsertTest
Tests run: 7, Failures: 0, Errors: 0, Skipped: 0, Time elapsed: 38.946 sec - in org.apache.phoenix.end2end.DynamicUpsertTest
Running org.apache.phoenix.end2end.CustomEntityDataTest
Tests run: 3, Failures: 0, Errors: 0, Skipped: 0, Time elapsed: 28.347 sec - in org.apache.phoenix.end2end.CustomEntityDataTest
Running org.apache.phoenix.end2end.SortOrderFTest
Tests run: 29, Failures: 0, Errors: 0, Skipped: 0, Time elapsed: 27.394 sec - in org.apache.phoenix.end2end.SortOrderFTest
Running org.apache.phoenix.end2end.GroupByCaseTest
Tests run: 3, Failures: 0, Errors: 0, Skipped: 0, Time elapsed: 30.589 sec - in org.apache.phoenix.end2end.GroupByCaseTest
Running org.apache.phoenix.end2end.UpsertSelectTest
Tests run: 11, Failures: 0, Errors: 0, Skipped: 0, Time elapsed: 58.89 sec - in org.apache.phoenix.end2end.UpsertSelectTest
Running org.apache.phoenix.end2end.QueryTest
Tests run: 432, Failures: 0, Errors: 0, Skipped: 0, Time elapsed: 307.78 sec - in org.apache.phoenix.end2end.QueryTest
Running org.apache.phoenix.end2end.SkipScanQueryTest
Tests run: 7, Failures: 0, Errors: 0, Skipped: 0, Time elapsed: 40.412 sec - in org.apache.phoenix.end2end.SkipScanQueryTest
Running org.apache.phoenix.end2end.TopNTest
Tests run: 4, Failures: 0, Errors: 0, Skipped: 0, Time elapsed: 63.5 sec - in org.apache.phoenix.end2end.TopNTest
Running org.apache.phoenix.end2end.IsNullTest
Tests run: 1, Failures: 0, Errors: 0, Skipped: 0, Time elapsed: 63.959 sec - in org.apache.phoenix.end2end.IsNullTest
Running org.apache.phoenix.end2end.ArrayTest
Tests run: 29, Failures: 0, Errors: 0, Skipped: 0, Time elapsed: 61.773 sec - in org.apache.phoenix.end2end.ArrayTest

Results :

Failed tests: 
  DefaultParallelIteratorsRegionSplitterTest.testStatsManagerImpl:294 null

Tests run: 1739, Failures: 1, Errors: 0, Skipped: 8

[INFO] ------------------------------------------------------------------------
[INFO] Reactor Summary:
[INFO] 
[INFO] Apache Phoenix .................................... SUCCESS [1.844s]
[INFO] Phoenix Hadoop Compatibility ...................... SUCCESS [2.141s]
[INFO] Phoenix Core ...................................... FAILURE [59:57.816s]
[INFO] Phoenix - Flume ................................... SKIPPED
[INFO] Phoenix - Pig ..................................... SKIPPED
[INFO] Phoenix Hadoop1 Compatibility ..................... SKIPPED
[INFO] Phoenix Assebmly .................................. SKIPPED
[INFO] ------------------------------------------------------------------------
[INFO] BUILD FAILURE
[INFO] ------------------------------------------------------------------------
[INFO] Total time: 1:00:02.162s
[INFO] Finished at: Mon Mar 03 23:41:34 UTC 2014
[INFO] Final Memory: 21M/373M
[INFO] ------------------------------------------------------------------------
[ERROR] Failed to execute goal org.apache.maven.plugins:maven-surefire-plugin:2.16:test (default-test)
on project phoenix-core: There are test failures.
[ERROR] 
[ERROR] Please refer to /home/hudson/jenkins-slave/workspace/Phoenix/phoenix-core/target/surefire-reports
for the individual test results.
[ERROR] -> [Help 1]
[ERROR] 
[ERROR] To see the full stack trace of the errors, re-run Maven with the -e switch.
[ERROR] Re-run Maven using the -X switch to enable full debug logging.
[ERROR] 
[ERROR] For more information about the errors and possible solutions, please read the following
articles:
[ERROR] [Help 1] http://cwiki.apache.org/confluence/display/MAVEN/MojoFailureException
[ERROR] 
[ERROR] After correcting the problems, you can resume the build with the command
[ERROR]   mvn <goals> -rf :phoenix-core
Build step 'Invoke top-level Maven targets' marked build as failure
Archiving artifacts
Recording test results

Mime
View raw message