phoenix-commits mailing list archives

Site index · List index
Message view « Date » · « Thread »
Top « Date » · « Thread »
From Apache Jenkins Server <jenk...@builds.apache.org>
Subject Build failed in Jenkins: Apache Phoenix - Branch:4.0 #113
Date Thu, 20 Mar 2014 17:59:48 GMT
See <https://builds.apache.org/job/Phoenix-4.0/113/changes>

Changes:

[mujtaba] PHOENIX-880 Exclude resources/java.sql.driver from apache-rat check

------------------------------------------
[...truncated 3740 lines...]
[INFO] --- maven-surefire-plugin:2.12-TRUNK-HBASE-2:test (secondPartTestsExecution) @ hbase-examples
---
[INFO] Tests are skipped.
[INFO] 
[INFO] --- maven-source-plugin:2.2.1:jar-no-fork (attach-sources) @ hbase-examples ---
[INFO] Building jar: <https://builds.apache.org/job/Phoenix-4.0/113/artifact/hbasetrunk/hbase-examples/target/hbase-examples-0.99.0-SNAPSHOT-sources.jar>
[INFO] 
[INFO] --- maven-jar-plugin:2.4:test-jar (default) @ hbase-examples ---
[INFO] Building jar: <https://builds.apache.org/job/Phoenix-4.0/113/artifact/hbasetrunk/hbase-examples/target/hbase-examples-0.99.0-SNAPSHOT-tests.jar>
[INFO] 
[INFO] --- maven-jar-plugin:2.4:jar (default-jar) @ hbase-examples ---
[INFO] Building jar: <https://builds.apache.org/job/Phoenix-4.0/113/artifact/hbasetrunk/hbase-examples/target/hbase-examples-0.99.0-SNAPSHOT.jar>
[INFO] 
[INFO] --- maven-install-plugin:2.3.1:install (default-install) @ hbase-examples ---
[INFO] Installing <https://builds.apache.org/job/Phoenix-4.0/113/artifact/hbasetrunk/hbase-examples/target/hbase-examples-0.99.0-SNAPSHOT.jar>
to /home/jenkins/.m2/repository/org/apache/hbase/hbase-examples/0.99.0-SNAPSHOT/hbase-examples-0.99.0-SNAPSHOT.jar
[INFO] Installing <https://builds.apache.org/job/Phoenix-4.0/ws/hbasetrunk/hbase-examples/pom.xml>
to /home/jenkins/.m2/repository/org/apache/hbase/hbase-examples/0.99.0-SNAPSHOT/hbase-examples-0.99.0-SNAPSHOT.pom
[INFO] Installing <https://builds.apache.org/job/Phoenix-4.0/113/artifact/hbasetrunk/hbase-examples/target/hbase-examples-0.99.0-SNAPSHOT-sources.jar>
to /home/jenkins/.m2/repository/org/apache/hbase/hbase-examples/0.99.0-SNAPSHOT/hbase-examples-0.99.0-SNAPSHOT-sources.jar
[INFO] Installing <https://builds.apache.org/job/Phoenix-4.0/113/artifact/hbasetrunk/hbase-examples/target/hbase-examples-0.99.0-SNAPSHOT-tests.jar>
to /home/jenkins/.m2/repository/org/apache/hbase/hbase-examples/0.99.0-SNAPSHOT/hbase-examples-0.99.0-SNAPSHOT-tests.jar
[INFO]                                                                         
[INFO] ------------------------------------------------------------------------
[INFO] Building HBase - Assembly 0.99.0-SNAPSHOT
[INFO] ------------------------------------------------------------------------
[INFO] 
[INFO] --- maven-remote-resources-plugin:1.4:process (default) @ hbase-assembly ---
[INFO] 
[INFO] --- maven-dependency-plugin:2.1:build-classpath (create-hbase-generated-classpath)
@ hbase-assembly ---
[INFO] Wrote classpath file '<https://builds.apache.org/job/Phoenix-4.0/ws/hbasetrunk/target/cached_classpath.txt'.>
[INFO] 
[INFO] --- maven-install-plugin:2.3.1:install (default-install) @ hbase-assembly ---
[INFO] Installing <https://builds.apache.org/job/Phoenix-4.0/ws/hbasetrunk/hbase-assembly/pom.xml>
to /home/jenkins/.m2/repository/org/apache/hbase/hbase-assembly/0.99.0-SNAPSHOT/hbase-assembly-0.99.0-SNAPSHOT.pom
[INFO] ------------------------------------------------------------------------
[INFO] Reactor Summary:
[INFO] 
[INFO] HBase ............................................. SUCCESS [15.803s]
[INFO] HBase - Common .................................... SUCCESS [15.601s]
[INFO] HBase - Protocol .................................. SUCCESS [9.064s]
[INFO] HBase - Client .................................... SUCCESS [4.259s]
[INFO] HBase - Hadoop Compatibility ...................... SUCCESS [0.370s]
[INFO] HBase - Hadoop Two Compatibility .................. SUCCESS [1.581s]
[INFO] HBase - Prefix Tree ............................... SUCCESS [1.123s]
[INFO] HBase - Server .................................... SUCCESS [19.072s]
[INFO] HBase - Testing Util .............................. SUCCESS [0.974s]
[INFO] HBase - Thrift .................................... SUCCESS [4.628s]
[INFO] HBase - Shell ..................................... SUCCESS [0.877s]
[INFO] HBase - Integration Tests ......................... SUCCESS [1.552s]
[INFO] HBase - Examples .................................. SUCCESS [1.590s]
[INFO] HBase - Assembly .................................. SUCCESS [1.885s]
[INFO] ------------------------------------------------------------------------
[INFO] BUILD SUCCESS
[INFO] ------------------------------------------------------------------------
[INFO] Total time: 1:20.465s
[INFO] Finished at: Thu Mar 20 17:59:03 UTC 2014
[INFO] Final Memory: 82M/449M
[INFO] ------------------------------------------------------------------------
[Phoenix-4.0] $ /home/jenkins/jenkins-slave/tools/hudson.tasks.Maven_MavenInstallation/Maven_3.0.3/bin/mvn
clean install
[INFO] Scanning for projects...
[INFO] ------------------------------------------------------------------------
[INFO] Reactor Build Order:
[INFO] 
[INFO] Apache Phoenix
[INFO] Phoenix Hadoop Compatibility
[INFO] Phoenix Core
[INFO] Phoenix - Flume
[INFO] Phoenix - Pig
[INFO] Phoenix Hadoop1 Compatibility
[INFO] Phoenix Assembly
[INFO]                                                                         
[INFO] ------------------------------------------------------------------------
[INFO] Building Apache Phoenix 4.0.0-incubating
[INFO] ------------------------------------------------------------------------
[INFO] 
[INFO] --- maven-clean-plugin:2.5:clean (default-clean) @ phoenix ---
[INFO] Deleting <https://builds.apache.org/job/Phoenix-4.0/ws/target>
[INFO] 
[INFO] --- maven-remote-resources-plugin:1.5:process (default) @ phoenix ---
[INFO] 
[INFO] --- maven-source-plugin:2.2.1:jar-no-fork (attach-sources) @ phoenix ---
[INFO] 
[INFO] --- maven-jar-plugin:2.4:test-jar (default) @ phoenix ---
[WARNING] JAR will be empty - no content was marked for inclusion!
[INFO] Building jar: <https://builds.apache.org/job/Phoenix-4.0/113/artifact/target/phoenix-4.0.0-incubating-tests.jar>
[INFO] 
[INFO] --- maven-site-plugin:3.2:attach-descriptor (attach-descriptor) @ phoenix ---
[INFO] 
[INFO] --- maven-install-plugin:2.5.1:install (default-install) @ phoenix ---
[INFO] Installing <https://builds.apache.org/job/Phoenix-4.0/ws/pom.xml> to /home/jenkins/.m2/repository/org/apache/phoenix/phoenix/4.0.0-incubating/phoenix-4.0.0-incubating.pom
[INFO] Installing <https://builds.apache.org/job/Phoenix-4.0/113/artifact/target/phoenix-4.0.0-incubating-tests.jar>
to /home/jenkins/.m2/repository/org/apache/phoenix/phoenix/4.0.0-incubating/phoenix-4.0.0-incubating-tests.jar
[INFO]                                                                         
[INFO] ------------------------------------------------------------------------
[INFO] Building Phoenix Hadoop Compatibility 4.0.0-incubating
[INFO] ------------------------------------------------------------------------
[INFO] 
[INFO] --- maven-clean-plugin:2.5:clean (default-clean) @ phoenix-hadoop-compat ---
[INFO] Deleting <https://builds.apache.org/job/Phoenix-4.0/ws/phoenix-hadoop-compat/target>
[INFO] 
[INFO] --- maven-remote-resources-plugin:1.5:process (default) @ phoenix-hadoop-compat ---
[INFO] 
[INFO] --- maven-resources-plugin:2.6:resources (default-resources) @ phoenix-hadoop-compat
---
[INFO] Using 'UTF-8' encoding to copy filtered resources.
[INFO] skip non existing resourceDirectory <https://builds.apache.org/job/Phoenix-4.0/ws/phoenix-hadoop-compat/src/main/resources>
[INFO] Copying 3 resources
[INFO] 
[INFO] --- maven-compiler-plugin:3.0:compile (default-compile) @ phoenix-hadoop-compat ---
[INFO] No sources to compile
[INFO] 
[INFO] --- maven-resources-plugin:2.6:testResources (default-testResources) @ phoenix-hadoop-compat
---
[INFO] Using 'UTF-8' encoding to copy filtered resources.
[INFO] skip non existing resourceDirectory <https://builds.apache.org/job/Phoenix-4.0/ws/phoenix-hadoop-compat/src/test/resources>
[INFO] Copying 3 resources
[INFO] 
[INFO] --- maven-compiler-plugin:3.0:testCompile (default-testCompile) @ phoenix-hadoop-compat
---
[INFO] No sources to compile
[INFO] 
[INFO] --- maven-surefire-plugin:2.16:test (default-test) @ phoenix-hadoop-compat ---
[INFO] 
[INFO] --- maven-source-plugin:2.2.1:jar-no-fork (attach-sources) @ phoenix-hadoop-compat
---
[INFO] Building jar: <https://builds.apache.org/job/Phoenix-4.0/113/artifact/phoenix-hadoop-compat/target/phoenix-hadoop-compat-4.0.0-incubating-sources.jar>
[INFO] 
[INFO] --- maven-jar-plugin:2.4:test-jar (default) @ phoenix-hadoop-compat ---
[INFO] Building jar: <https://builds.apache.org/job/Phoenix-4.0/113/artifact/phoenix-hadoop-compat/target/phoenix-hadoop-compat-4.0.0-incubating-tests.jar>
[INFO] 
[INFO] --- maven-jar-plugin:2.4:jar (default-jar) @ phoenix-hadoop-compat ---
[INFO] Building jar: <https://builds.apache.org/job/Phoenix-4.0/113/artifact/phoenix-hadoop-compat/target/phoenix-hadoop-compat-4.0.0-incubating.jar>
[INFO] 
[INFO] --- maven-site-plugin:3.2:attach-descriptor (attach-descriptor) @ phoenix-hadoop-compat
---
[INFO] 
[INFO] --- maven-install-plugin:2.5.1:install (default-install) @ phoenix-hadoop-compat ---
[INFO] Installing <https://builds.apache.org/job/Phoenix-4.0/113/artifact/phoenix-hadoop-compat/target/phoenix-hadoop-compat-4.0.0-incubating.jar>
to /home/jenkins/.m2/repository/org/apache/phoenix/phoenix-hadoop-compat/4.0.0-incubating/phoenix-hadoop-compat-4.0.0-incubating.jar
[INFO] Installing <https://builds.apache.org/job/Phoenix-4.0/ws/phoenix-hadoop-compat/pom.xml>
to /home/jenkins/.m2/repository/org/apache/phoenix/phoenix-hadoop-compat/4.0.0-incubating/phoenix-hadoop-compat-4.0.0-incubating.pom
[INFO] Installing <https://builds.apache.org/job/Phoenix-4.0/113/artifact/phoenix-hadoop-compat/target/phoenix-hadoop-compat-4.0.0-incubating-sources.jar>
to /home/jenkins/.m2/repository/org/apache/phoenix/phoenix-hadoop-compat/4.0.0-incubating/phoenix-hadoop-compat-4.0.0-incubating-sources.jar
[INFO] Installing <https://builds.apache.org/job/Phoenix-4.0/113/artifact/phoenix-hadoop-compat/target/phoenix-hadoop-compat-4.0.0-incubating-tests.jar>
to /home/jenkins/.m2/repository/org/apache/phoenix/phoenix-hadoop-compat/4.0.0-incubating/phoenix-hadoop-compat-4.0.0-incubating-tests.jar
[INFO]                                                                         
[INFO] ------------------------------------------------------------------------
[INFO] Building Phoenix Core 4.0.0-incubating
[INFO] ------------------------------------------------------------------------
Downloading: https://repository.apache.org/content/repositories/releases/org/apache/hbase/hbase-testing-util/0.98.1-hadoop1/hbase-testing-util-0.98.1-hadoop1.pom

Downloading: http://conjars.org/repo/org/apache/hbase/hbase-testing-util/0.98.1-hadoop1/hbase-testing-util-0.98.1-hadoop1.pom

Downloading: https://repository.apache.org/content/repositories/snapshots/org/apache/hbase/hbase-testing-util/0.98.1-hadoop1/hbase-testing-util-0.98.1-hadoop1.pom

Downloading: http://repo1.maven.org/maven2/org/apache/hbase/hbase-testing-util/0.98.1-hadoop1/hbase-testing-util-0.98.1-hadoop1.pom

[WARNING] The POM for org.apache.hbase:hbase-testing-util:jar:0.98.1-hadoop1 is missing, no
dependency information available
Downloading: https://repository.apache.org/content/repositories/releases/org/apache/hbase/hbase-it/0.98.1-hadoop1/hbase-it-0.98.1-hadoop1.pom

Downloading: http://conjars.org/repo/org/apache/hbase/hbase-it/0.98.1-hadoop1/hbase-it-0.98.1-hadoop1.pom

Downloading: https://repository.apache.org/content/repositories/snapshots/org/apache/hbase/hbase-it/0.98.1-hadoop1/hbase-it-0.98.1-hadoop1.pom

Downloading: http://repo1.maven.org/maven2/org/apache/hbase/hbase-it/0.98.1-hadoop1/hbase-it-0.98.1-hadoop1.pom

[WARNING] The POM for org.apache.hbase:hbase-it:jar:tests:0.98.1-hadoop1 is missing, no dependency
information available
Downloading: https://repository.apache.org/content/repositories/releases/org/apache/hbase/hbase-common/0.98.1-hadoop1/hbase-common-0.98.1-hadoop1.pom

Downloading: http://conjars.org/repo/org/apache/hbase/hbase-common/0.98.1-hadoop1/hbase-common-0.98.1-hadoop1.pom

Downloading: https://repository.apache.org/content/repositories/snapshots/org/apache/hbase/hbase-common/0.98.1-hadoop1/hbase-common-0.98.1-hadoop1.pom

Downloading: http://repo1.maven.org/maven2/org/apache/hbase/hbase-common/0.98.1-hadoop1/hbase-common-0.98.1-hadoop1.pom

[WARNING] The POM for org.apache.hbase:hbase-common:jar:0.98.1-hadoop1 is missing, no dependency
information available
Downloading: https://repository.apache.org/content/repositories/releases/org/apache/hbase/hbase-protocol/0.98.1-hadoop1/hbase-protocol-0.98.1-hadoop1.pom

Downloading: http://conjars.org/repo/org/apache/hbase/hbase-protocol/0.98.1-hadoop1/hbase-protocol-0.98.1-hadoop1.pom

Downloading: https://repository.apache.org/content/repositories/snapshots/org/apache/hbase/hbase-protocol/0.98.1-hadoop1/hbase-protocol-0.98.1-hadoop1.pom

Downloading: http://repo1.maven.org/maven2/org/apache/hbase/hbase-protocol/0.98.1-hadoop1/hbase-protocol-0.98.1-hadoop1.pom

[WARNING] The POM for org.apache.hbase:hbase-protocol:jar:0.98.1-hadoop1 is missing, no dependency
information available
Downloading: https://repository.apache.org/content/repositories/releases/org/apache/hbase/hbase-client/0.98.1-hadoop1/hbase-client-0.98.1-hadoop1.pom

Downloading: http://conjars.org/repo/org/apache/hbase/hbase-client/0.98.1-hadoop1/hbase-client-0.98.1-hadoop1.pom

Downloading: https://repository.apache.org/content/repositories/snapshots/org/apache/hbase/hbase-client/0.98.1-hadoop1/hbase-client-0.98.1-hadoop1.pom

Downloading: http://repo1.maven.org/maven2/org/apache/hbase/hbase-client/0.98.1-hadoop1/hbase-client-0.98.1-hadoop1.pom

[WARNING] The POM for org.apache.hbase:hbase-client:jar:0.98.1-hadoop1 is missing, no dependency
information available
Downloading: https://repository.apache.org/content/repositories/releases/org/apache/hbase/hbase-testing-util/0.98.1-hadoop1/hbase-testing-util-0.98.1-hadoop1.jar
Downloading: https://repository.apache.org/content/repositories/releases/org/apache/hbase/hbase-it/0.98.1-hadoop1/hbase-it-0.98.1-hadoop1-tests.jar
Downloading: https://repository.apache.org/content/repositories/releases/org/apache/hbase/hbase-common/0.98.1-hadoop1/hbase-common-0.98.1-hadoop1.jar
Downloading: https://repository.apache.org/content/repositories/releases/org/apache/hbase/hbase-protocol/0.98.1-hadoop1/hbase-protocol-0.98.1-hadoop1.jar
Downloading: https://repository.apache.org/content/repositories/releases/org/apache/hbase/hbase-client/0.98.1-hadoop1/hbase-client-0.98.1-hadoop1.jar





Downloading: http://conjars.org/repo/org/apache/hbase/hbase-testing-util/0.98.1-hadoop1/hbase-testing-util-0.98.1-hadoop1.jar
Downloading: http://conjars.org/repo/org/apache/hbase/hbase-it/0.98.1-hadoop1/hbase-it-0.98.1-hadoop1-tests.jar
Downloading: http://conjars.org/repo/org/apache/hbase/hbase-common/0.98.1-hadoop1/hbase-common-0.98.1-hadoop1.jar
Downloading: http://conjars.org/repo/org/apache/hbase/hbase-protocol/0.98.1-hadoop1/hbase-protocol-0.98.1-hadoop1.jar
Downloading: http://conjars.org/repo/org/apache/hbase/hbase-client/0.98.1-hadoop1/hbase-client-0.98.1-hadoop1.jar





Downloading: https://repository.apache.org/content/repositories/snapshots/org/apache/hbase/hbase-testing-util/0.98.1-hadoop1/hbase-testing-util-0.98.1-hadoop1.jar
Downloading: https://repository.apache.org/content/repositories/snapshots/org/apache/hbase/hbase-it/0.98.1-hadoop1/hbase-it-0.98.1-hadoop1-tests.jar
Downloading: https://repository.apache.org/content/repositories/snapshots/org/apache/hbase/hbase-common/0.98.1-hadoop1/hbase-common-0.98.1-hadoop1.jar
Downloading: https://repository.apache.org/content/repositories/snapshots/org/apache/hbase/hbase-protocol/0.98.1-hadoop1/hbase-protocol-0.98.1-hadoop1.jar
Downloading: https://repository.apache.org/content/repositories/snapshots/org/apache/hbase/hbase-client/0.98.1-hadoop1/hbase-client-0.98.1-hadoop1.jar





Downloading: http://repo1.maven.org/maven2/org/apache/hbase/hbase-testing-util/0.98.1-hadoop1/hbase-testing-util-0.98.1-hadoop1.jar
Downloading: http://repo1.maven.org/maven2/org/apache/hbase/hbase-it/0.98.1-hadoop1/hbase-it-0.98.1-hadoop1-tests.jar
Downloading: http://repo1.maven.org/maven2/org/apache/hbase/hbase-common/0.98.1-hadoop1/hbase-common-0.98.1-hadoop1.jar
Downloading: http://repo1.maven.org/maven2/org/apache/hbase/hbase-protocol/0.98.1-hadoop1/hbase-protocol-0.98.1-hadoop1.jar
Downloading: http://repo1.maven.org/maven2/org/apache/hbase/hbase-client/0.98.1-hadoop1/hbase-client-0.98.1-hadoop1.jar





[INFO] ------------------------------------------------------------------------
[INFO] Reactor Summary:
[INFO] 
[INFO] Apache Phoenix .................................... SUCCESS [3.221s]
[INFO] Phoenix Hadoop Compatibility ...................... SUCCESS [1.787s]
[INFO] Phoenix Core ...................................... FAILURE [6.029s]
[INFO] Phoenix - Flume ................................... SKIPPED
[INFO] Phoenix - Pig ..................................... SKIPPED
[INFO] Phoenix Hadoop1 Compatibility ..................... SKIPPED
[INFO] Phoenix Assembly .................................. SKIPPED
[INFO] ------------------------------------------------------------------------
[INFO] BUILD FAILURE
[INFO] ------------------------------------------------------------------------
[INFO] Total time: 11.473s
[INFO] Finished at: Thu Mar 20 17:59:17 UTC 2014
[INFO] Final Memory: 20M/311M
[INFO] ------------------------------------------------------------------------
[ERROR] Failed to execute goal on project phoenix-core: Could not resolve dependencies for
project org.apache.phoenix:phoenix-core:jar:4.0.0-incubating: The following artifacts could
not be resolved: org.apache.hbase:hbase-testing-util:jar:0.98.1-hadoop1, org.apache.hbase:hbase-it:jar:tests:0.98.1-hadoop1,
org.apache.hbase:hbase-common:jar:0.98.1-hadoop1, org.apache.hbase:hbase-protocol:jar:0.98.1-hadoop1,
org.apache.hbase:hbase-client:jar:0.98.1-hadoop1: Could not find artifact org.apache.hbase:hbase-testing-util:jar:0.98.1-hadoop1
in apache release (https://repository.apache.org/content/repositories/releases/) -> [Help
1]
[ERROR] 
[ERROR] To see the full stack trace of the errors, re-run Maven with the -e switch.
[ERROR] Re-run Maven using the -X switch to enable full debug logging.
[ERROR] 
[ERROR] For more information about the errors and possible solutions, please read the following
articles:
[ERROR] [Help 1] http://cwiki.apache.org/confluence/display/MAVEN/DependencyResolutionException
[ERROR] 
[ERROR] After correcting the problems, you can resume the build with the command
[ERROR]   mvn <goals> -rf :phoenix-core
Build step 'Invoke top-level Maven targets' marked build as failure
Archiving artifacts
Recording test results

Mime
View raw message