phoenix-commits mailing list archives

Site index · List index
Message view « Date » · « Thread »
Top « Date » · « Thread »
From Apache Jenkins Server <jenk...@builds.apache.org>
Subject Build failed in Jenkins: Apache Phoenix - Branch:master #111
Date Thu, 06 Mar 2014 00:54:19 GMT
See <https://builds.apache.org/job/Phoenix/111/changes>

Changes:

[maryannxue] Add test case (ignored) for PHOENIX-62 Precision loss for decimal type when creation
of Immutable Index happens after the record insertion

[elilevine] Add tests with @Ignore for PHOENIX-110

[maryannxue] Add @Ignore("PHOENIX-62")

------------------------------------------
[...truncated 251 lines...]
Tests run: 9, Failures: 0, Errors: 0, Skipped: 0, Time elapsed: 26.726 sec - in org.apache.phoenix.end2end.DistinctCountTest
Running org.apache.phoenix.end2end.UpsertSelectAutoCommitTest
Tests run: 2, Failures: 0, Errors: 0, Skipped: 0, Time elapsed: 25.303 sec - in org.apache.phoenix.end2end.UpsertSelectAutoCommitTest
Running org.apache.phoenix.end2end.FunkyNamesTest
Tests run: 3, Failures: 0, Errors: 0, Skipped: 0, Time elapsed: 15.36 sec - in org.apache.phoenix.end2end.FunkyNamesTest
Running org.apache.phoenix.end2end.KeyOnlyTest
Tests run: 2, Failures: 0, Errors: 0, Skipped: 0, Time elapsed: 16.841 sec - in org.apache.phoenix.end2end.KeyOnlyTest
Running org.apache.phoenix.end2end.CustomEntityDataTest
Tests run: 3, Failures: 0, Errors: 0, Skipped: 0, Time elapsed: 19.313 sec - in org.apache.phoenix.end2end.CustomEntityDataTest
Running org.apache.phoenix.end2end.QueryDatabaseMetaDataTest
Tests run: 15, Failures: 0, Errors: 0, Skipped: 0, Time elapsed: 50.346 sec - in org.apache.phoenix.end2end.QueryDatabaseMetaDataTest
Running org.apache.phoenix.end2end.ArrayTest
Tests run: 34, Failures: 0, Errors: 0, Skipped: 0, Time elapsed: 36.605 sec - in org.apache.phoenix.end2end.ArrayTest
Running org.apache.phoenix.end2end.TenantSpecificTablesDMLTest
Tests run: 12, Failures: 0, Errors: 0, Skipped: 0, Time elapsed: 25.855 sec - in org.apache.phoenix.end2end.TenantSpecificTablesDMLTest
Running org.apache.phoenix.end2end.SkipRangeParallelIteratorRegionSplitterTest
Tests run: 8, Failures: 0, Errors: 0, Skipped: 0, Time elapsed: 26.554 sec - in org.apache.phoenix.end2end.SkipRangeParallelIteratorRegionSplitterTest
Running org.apache.phoenix.end2end.CompareDecimalToLongTest
Tests run: 8, Failures: 0, Errors: 0, Skipped: 0, Time elapsed: 16.354 sec - in org.apache.phoenix.end2end.CompareDecimalToLongTest
Running org.apache.phoenix.end2end.SpooledOrderByTest
Tests run: 3, Failures: 0, Errors: 0, Skipped: 1, Time elapsed: 16.723 sec - in org.apache.phoenix.end2end.SpooledOrderByTest
Running org.apache.phoenix.end2end.TenantSpecificViewIndexSaltedTest
Tests run: 3, Failures: 0, Errors: 1, Skipped: 2, Time elapsed: 0.014 sec <<< FAILURE!
- in org.apache.phoenix.end2end.TenantSpecificViewIndexSaltedTest
org.apache.phoenix.end2end.TenantSpecificViewIndexSaltedTest  Time elapsed: 0.014 sec  <<<
ERROR!
java.lang.NullPointerException: null
	at org.apache.phoenix.jdbc.PhoenixTestDriver.close(PhoenixTestDriver.java:87)
	at org.apache.phoenix.query.BaseTest.destroyDriver(BaseTest.java:391)
	at org.apache.phoenix.query.BaseTest.stopServer(BaseTest.java:423)
	at sun.reflect.GeneratedMethodAccessor81.invoke(Unknown Source)
	at sun.reflect.DelegatingMethodAccessorImpl.invoke(DelegatingMethodAccessorImpl.java:43)
	at java.lang.reflect.Method.invoke(Method.java:606)
	at org.junit.runners.model.FrameworkMethod$1.runReflectiveCall(FrameworkMethod.java:47)
	at org.junit.internal.runners.model.ReflectiveCallable.run(ReflectiveCallable.java:12)
	at org.junit.runners.model.FrameworkMethod.invokeExplosively(FrameworkMethod.java:44)
	at org.junit.internal.runners.statements.RunAfters.evaluate(RunAfters.java:33)
	at org.junit.runners.ParentRunner.run(ParentRunner.java:309)
	at org.apache.maven.surefire.junit4.JUnit4Provider.execute(JUnit4Provider.java:264)
	at org.apache.maven.surefire.junit4.JUnit4Provider.executeTestSet(JUnit4Provider.java:153)
	at org.apache.maven.surefire.junit4.JUnit4Provider.invoke(JUnit4Provider.java:124)
	at org.apache.maven.surefire.booter.ForkedBooter.invokeProviderInSameClassLoader(ForkedBooter.java:200)
	at org.apache.maven.surefire.booter.ForkedBooter.runSuitesInProcess(ForkedBooter.java:153)
	at org.apache.maven.surefire.booter.ForkedBooter.main(ForkedBooter.java:103)

Running org.apache.phoenix.end2end.ExecuteStatementsTest
Tests run: 2, Failures: 0, Errors: 0, Skipped: 0, Time elapsed: 26.684 sec - in org.apache.phoenix.end2end.ExecuteStatementsTest
Running org.apache.phoenix.end2end.DynamicUpsertTest
Tests run: 7, Failures: 0, Errors: 0, Skipped: 0, Time elapsed: 16.989 sec - in org.apache.phoenix.end2end.DynamicUpsertTest
Running org.apache.phoenix.end2end.SortOrderFTest
Tests run: 29, Failures: 0, Errors: 0, Skipped: 0, Time elapsed: 25.074 sec - in org.apache.phoenix.end2end.SortOrderFTest
Running org.apache.phoenix.end2end.salted.SaltedTableVarLengthRowKeyTest
Tests run: 1, Failures: 0, Errors: 0, Skipped: 0, Time elapsed: 18.18 sec - in org.apache.phoenix.end2end.salted.SaltedTableVarLengthRowKeyTest
Running org.apache.phoenix.end2end.salted.SaltedTableTest
Tests run: 8, Failures: 0, Errors: 0, Skipped: 0, Time elapsed: 26.586 sec - in org.apache.phoenix.end2end.salted.SaltedTableTest
Running org.apache.phoenix.end2end.salted.SaltedTableUpsertSelectTest
Tests run: 5, Failures: 0, Errors: 0, Skipped: 0, Time elapsed: 26.145 sec - in org.apache.phoenix.end2end.salted.SaltedTableUpsertSelectTest
Running org.apache.phoenix.end2end.CSVCommonsLoaderTest
Tests run: 11, Failures: 0, Errors: 0, Skipped: 0, Time elapsed: 25.398 sec - in org.apache.phoenix.end2end.CSVCommonsLoaderTest
Running org.apache.phoenix.end2end.DynamicColumnTest
Tests run: 5, Failures: 0, Errors: 0, Skipped: 0, Time elapsed: 16.692 sec - in org.apache.phoenix.end2end.DynamicColumnTest
Running org.apache.phoenix.end2end.TenantSpecificViewIndexTest
Tests run: 3, Failures: 0, Errors: 1, Skipped: 2, Time elapsed: 0.013 sec <<< FAILURE!
- in org.apache.phoenix.end2end.TenantSpecificViewIndexTest
org.apache.phoenix.end2end.TenantSpecificViewIndexTest  Time elapsed: 0.013 sec  <<<
ERROR!
java.lang.NullPointerException: null
	at org.apache.phoenix.jdbc.PhoenixTestDriver.close(PhoenixTestDriver.java:87)
	at org.apache.phoenix.query.BaseTest.destroyDriver(BaseTest.java:391)
	at org.apache.phoenix.query.BaseTest.stopServer(BaseTest.java:423)
	at sun.reflect.GeneratedMethodAccessor81.invoke(Unknown Source)
	at sun.reflect.DelegatingMethodAccessorImpl.invoke(DelegatingMethodAccessorImpl.java:43)
	at java.lang.reflect.Method.invoke(Method.java:606)
	at org.junit.runners.model.FrameworkMethod$1.runReflectiveCall(FrameworkMethod.java:47)
	at org.junit.internal.runners.model.ReflectiveCallable.run(ReflectiveCallable.java:12)
	at org.junit.runners.model.FrameworkMethod.invokeExplosively(FrameworkMethod.java:44)
	at org.junit.internal.runners.statements.RunAfters.evaluate(RunAfters.java:33)
	at org.junit.runners.ParentRunner.run(ParentRunner.java:309)
	at org.apache.maven.surefire.junit4.JUnit4Provider.execute(JUnit4Provider.java:264)
	at org.apache.maven.surefire.junit4.JUnit4Provider.executeTestSet(JUnit4Provider.java:153)
	at org.apache.maven.surefire.junit4.JUnit4Provider.invoke(JUnit4Provider.java:124)
	at org.apache.maven.surefire.booter.ForkedBooter.invokeProviderInSameClassLoader(ForkedBooter.java:200)
	at org.apache.maven.surefire.booter.ForkedBooter.runSuitesInProcess(ForkedBooter.java:153)
	at org.apache.maven.surefire.booter.ForkedBooter.main(ForkedBooter.java:103)

Running org.apache.phoenix.end2end.BinaryRowKeyTest
Tests run: 3, Failures: 0, Errors: 0, Skipped: 0, Time elapsed: 25.161 sec - in org.apache.phoenix.end2end.BinaryRowKeyTest
Running org.apache.phoenix.end2end.DynamicFamilyTest
Tests run: 4, Failures: 0, Errors: 0, Skipped: 0, Time elapsed: 25.235 sec - in org.apache.phoenix.end2end.DynamicFamilyTest
Running org.apache.phoenix.end2end.DefaultParallelIteratorsRegionSplitterTest
Tests run: 2, Failures: 0, Errors: 0, Skipped: 0, Time elapsed: 16.295 sec - in org.apache.phoenix.end2end.DefaultParallelIteratorsRegionSplitterTest
Running org.apache.phoenix.end2end.TenantSpecificTablesDDLTest
Tests run: 16, Failures: 0, Errors: 0, Skipped: 0, Time elapsed: 37.233 sec - in org.apache.phoenix.end2end.TenantSpecificTablesDDLTest
Running org.apache.phoenix.end2end.CoalesceFunctionTest
Tests run: 1, Failures: 0, Errors: 0, Skipped: 0, Time elapsed: 16.974 sec - in org.apache.phoenix.end2end.CoalesceFunctionTest
Running org.apache.phoenix.end2end.MultiCfQueryExecTest
Tests run: 7, Failures: 0, Errors: 0, Skipped: 0, Time elapsed: 25.935 sec - in org.apache.phoenix.end2end.MultiCfQueryExecTest
Running org.apache.phoenix.end2end.TruncateFunctionTest
Tests run: 1, Failures: 0, Errors: 0, Skipped: 0, Time elapsed: 15.374 sec - in org.apache.phoenix.end2end.TruncateFunctionTest
Running org.apache.phoenix.end2end.UpsertBigValuesTest
Tests run: 4, Failures: 0, Errors: 0, Skipped: 0, Time elapsed: 26.23 sec - in org.apache.phoenix.end2end.UpsertBigValuesTest
Running org.apache.phoenix.end2end.GroupByCaseTest
Tests run: 3, Failures: 0, Errors: 0, Skipped: 0, Time elapsed: 17.315 sec - in org.apache.phoenix.end2end.GroupByCaseTest
Running org.apache.phoenix.end2end.ProductMetricsTest
Tests run: 61, Failures: 0, Errors: 0, Skipped: 0, Time elapsed: 46.94 sec - in org.apache.phoenix.end2end.ProductMetricsTest
Running org.apache.phoenix.end2end.UpsertSelectTest
Tests run: 11, Failures: 0, Errors: 0, Skipped: 0, Time elapsed: 36.372 sec - in org.apache.phoenix.end2end.UpsertSelectTest
Running org.apache.phoenix.end2end.TopNTest
Tests run: 4, Failures: 0, Errors: 0, Skipped: 0, Time elapsed: 26.871 sec - in org.apache.phoenix.end2end.TopNTest
Running org.apache.phoenix.end2end.InMemoryOrderByTest
Tests run: 3, Failures: 0, Errors: 0, Skipped: 1, Time elapsed: 25.055 sec - in org.apache.phoenix.end2end.InMemoryOrderByTest
Running org.apache.phoenix.end2end.IsNullTest
Tests run: 1, Failures: 0, Errors: 0, Skipped: 0, Time elapsed: 18.25 sec - in org.apache.phoenix.end2end.IsNullTest
Running org.apache.phoenix.end2end.ToCharFunctionTest
Tests run: 10, Failures: 0, Errors: 0, Skipped: 0, Time elapsed: 16.985 sec - in org.apache.phoenix.end2end.ToCharFunctionTest
Running org.apache.phoenix.end2end.NativeHBaseTypesTest
Tests run: 7, Failures: 0, Errors: 0, Skipped: 0, Time elapsed: 26.319 sec - in org.apache.phoenix.end2end.NativeHBaseTypesTest
Running org.apache.phoenix.end2end.RoundFloorCeilFunctionsEnd2EndTest
Tests run: 21, Failures: 0, Errors: 0, Skipped: 0, Time elapsed: 16.67 sec - in org.apache.phoenix.end2end.RoundFloorCeilFunctionsEnd2EndTest
Running org.apache.phoenix.end2end.index.SaltedIndexTest
Tests run: 3, Failures: 0, Errors: 0, Skipped: 0, Time elapsed: 46.228 sec - in org.apache.phoenix.end2end.index.SaltedIndexTest
Running org.apache.phoenix.end2end.index.MutableIndexFailureTest
Tests run: 1, Failures: 0, Errors: 0, Skipped: 0, Time elapsed: 56.329 sec - in org.apache.phoenix.end2end.index.MutableIndexFailureTest
Running org.apache.phoenix.end2end.index.ImmutableIndexTest
Tests run: 7, Failures: 0, Errors: 0, Skipped: 0, Time elapsed: 27.814 sec - in org.apache.phoenix.end2end.index.ImmutableIndexTest
Running org.apache.phoenix.end2end.index.MutableIndexTest
Tests run: 12, Failures: 0, Errors: 0, Skipped: 1, Time elapsed: 56.366 sec - in org.apache.phoenix.end2end.index.MutableIndexTest
Running org.apache.phoenix.end2end.index.DropViewTest
Tests run: 1, Failures: 0, Errors: 0, Skipped: 0, Time elapsed: 27.176 sec - in org.apache.phoenix.end2end.index.DropViewTest
Running org.apache.phoenix.end2end.index.IndexMetadataTest
Tests run: 4, Failures: 0, Errors: 0, Skipped: 0, Time elapsed: 35.682 sec - in org.apache.phoenix.end2end.index.IndexMetadataTest
Running org.apache.phoenix.end2end.ToNumberFunctionTest
Tests run: 18, Failures: 0, Errors: 0, Skipped: 0, Time elapsed: 27.829 sec - in org.apache.phoenix.end2end.ToNumberFunctionTest
Running org.apache.phoenix.end2end.SpillableGroupByTest
Tests run: 1, Failures: 0, Errors: 0, Skipped: 0, Time elapsed: 17.099 sec - in org.apache.phoenix.end2end.SpillableGroupByTest
Running org.apache.phoenix.end2end.SkipScanQueryTest
Tests run: 7, Failures: 0, Errors: 0, Skipped: 0, Time elapsed: 26.31 sec - in org.apache.phoenix.end2end.SkipScanQueryTest
Running org.apache.phoenix.end2end.ExtendedQueryExecTest
Tests run: 4, Failures: 0, Errors: 0, Skipped: 0, Time elapsed: 27.678 sec - in org.apache.phoenix.end2end.ExtendedQueryExecTest
Running org.apache.phoenix.end2end.SaltedViewTest
Tests run: 1, Failures: 0, Errors: 0, Skipped: 0, Time elapsed: 26.862 sec - in org.apache.phoenix.end2end.SaltedViewTest
Running org.apache.phoenix.end2end.VariableLengthPKTest
Tests run: 49, Failures: 0, Errors: 0, Skipped: 0, Time elapsed: 49.047 sec - in org.apache.phoenix.end2end.VariableLengthPKTest
Running org.apache.phoenix.end2end.DeleteTest
Tests run: 13, Failures: 0, Errors: 0, Skipped: 0, Time elapsed: 39.234 sec - in org.apache.phoenix.end2end.DeleteTest
Running org.apache.phoenix.end2end.RowValueConstructorTest
Tests run: 24, Failures: 0, Errors: 0, Skipped: 0, Time elapsed: 38.49 sec - in org.apache.phoenix.end2end.RowValueConstructorTest
Running org.apache.phoenix.end2end.StatsManagerTest
Tests run: 1, Failures: 0, Errors: 0, Skipped: 0, Time elapsed: 38.512 sec - in org.apache.phoenix.end2end.StatsManagerTest
Running org.apache.phoenix.end2end.CreateTableTest
Tests run: 2, Failures: 0, Errors: 0, Skipped: 0, Time elapsed: 28.109 sec - in org.apache.phoenix.end2end.CreateTableTest
Running org.apache.phoenix.compile.ViewCompilerTest
Tests run: 3, Failures: 0, Errors: 0, Skipped: 0, Time elapsed: 0.043 sec - in org.apache.phoenix.compile.ViewCompilerTest
Running org.apache.phoenix.compile.QueryMetaDataTest
Tests run: 32, Failures: 0, Errors: 0, Skipped: 0, Time elapsed: 0.06 sec - in org.apache.phoenix.compile.QueryMetaDataTest
Running org.apache.phoenix.compile.HavingCompilerTest
Tests run: 10, Failures: 0, Errors: 0, Skipped: 0, Time elapsed: 0.04 sec - in org.apache.phoenix.compile.HavingCompilerTest
Running org.apache.phoenix.compile.WhereCompilerTest
Tests run: 41, Failures: 0, Errors: 0, Skipped: 1, Time elapsed: 0.075 sec - in org.apache.phoenix.compile.WhereCompilerTest
Running org.apache.phoenix.compile.SelectStatementRewriterTest
Tests run: 5, Failures: 0, Errors: 0, Skipped: 0, Time elapsed: 0.031 sec - in org.apache.phoenix.compile.SelectStatementRewriterTest
Running org.apache.phoenix.compile.LimitCompilerTest
Tests run: 6, Failures: 0, Errors: 0, Skipped: 0, Time elapsed: 0.029 sec - in org.apache.phoenix.compile.LimitCompilerTest
Running org.apache.phoenix.compile.WhereOptimizerTest
Tests run: 89, Failures: 0, Errors: 0, Skipped: 0, Time elapsed: 0.149 sec - in org.apache.phoenix.compile.WhereOptimizerTest
Running org.apache.phoenix.compile.JoinQueryCompilerTest
Tests run: 2, Failures: 0, Errors: 0, Skipped: 0, Time elapsed: 0.04 sec - in org.apache.phoenix.compile.JoinQueryCompilerTest
Running org.apache.phoenix.compile.QueryOptimizerTest
Tests run: 25, Failures: 0, Errors: 0, Skipped: 0, Time elapsed: 0.148 sec - in org.apache.phoenix.compile.QueryOptimizerTest
Running org.apache.phoenix.compile.QueryCompilerTest
Tests run: 76, Failures: 0, Errors: 0, Skipped: 0, Time elapsed: 0.157 sec - in org.apache.phoenix.compile.QueryCompilerTest
Running org.apache.phoenix.compile.ScanRangesTest
Tests run: 34, Failures: 0, Errors: 0, Skipped: 0, Time elapsed: 0.013 sec - in org.apache.phoenix.compile.ScanRangesTest
Running org.apache.phoenix.compile.StatementHintsCompilationTest
Tests run: 3, Failures: 0, Errors: 0, Skipped: 0, Time elapsed: 0.031 sec - in org.apache.phoenix.compile.StatementHintsCompilationTest
Running org.apache.phoenix.parse.QueryParserTest
Tests run: 46, Failures: 0, Errors: 0, Skipped: 0, Time elapsed: 0.032 sec - in org.apache.phoenix.parse.QueryParserTest
Running org.apache.phoenix.schema.PDataTypeTest
Tests run: 22, Failures: 0, Errors: 0, Skipped: 0, Time elapsed: 0.025 sec - in org.apache.phoenix.schema.PDataTypeTest
Running org.apache.phoenix.schema.SchemaUtilTest
Tests run: 3, Failures: 0, Errors: 0, Skipped: 0, Time elapsed: 0 sec - in org.apache.phoenix.schema.SchemaUtilTest
Running org.apache.phoenix.schema.PMetaDataImplTest
Tests run: 1, Failures: 0, Errors: 0, Skipped: 0, Time elapsed: 0.016 sec - in org.apache.phoenix.schema.PMetaDataImplTest
Running org.apache.phoenix.schema.SortOrderTest
Tests run: 7, Failures: 0, Errors: 0, Skipped: 0, Time elapsed: 0 sec - in org.apache.phoenix.schema.SortOrderTest
Running org.apache.phoenix.schema.PDataTypeForArraysTest
Tests run: 60, Failures: 0, Errors: 0, Skipped: 0, Time elapsed: 0.025 sec - in org.apache.phoenix.schema.PDataTypeForArraysTest
Running org.apache.phoenix.schema.RowKeyValueAccessorTest
Tests run: 1, Failures: 0, Errors: 0, Skipped: 0, Time elapsed: 0.046 sec - in org.apache.phoenix.schema.RowKeyValueAccessorTest
Running org.apache.phoenix.schema.RowKeySchemaTest
Tests run: 6, Failures: 0, Errors: 0, Skipped: 0, Time elapsed: 2.407 sec - in org.apache.phoenix.schema.RowKeySchemaTest
Running org.apache.phoenix.schema.ValueBitSetTest
Tests run: 2, Failures: 0, Errors: 0, Skipped: 0, Time elapsed: 0 sec - in org.apache.phoenix.schema.ValueBitSetTest
Running org.apache.phoenix.index.IndexMaintainerTest
Tests run: 17, Failures: 0, Errors: 0, Skipped: 0, Time elapsed: 0.162 sec - in org.apache.phoenix.index.IndexMaintainerTest
Running org.apache.phoenix.expression.SortOrderExpressionTest
Tests run: 23, Failures: 0, Errors: 0, Skipped: 0, Time elapsed: 0.01 sec - in org.apache.phoenix.expression.SortOrderExpressionTest
Running org.apache.phoenix.expression.ColumnExpressionTest
Tests run: 4, Failures: 0, Errors: 0, Skipped: 0, Time elapsed: 0.001 sec - in org.apache.phoenix.expression.ColumnExpressionTest
Running org.apache.phoenix.expression.LikeExpressionTest
Tests run: 1, Failures: 0, Errors: 0, Skipped: 0, Time elapsed: 0.001 sec - in org.apache.phoenix.expression.LikeExpressionTest
Running org.apache.phoenix.expression.CoerceExpressionTest
Tests run: 5, Failures: 0, Errors: 0, Skipped: 0, Time elapsed: 0.002 sec - in org.apache.phoenix.expression.CoerceExpressionTest
Running org.apache.hadoop.hbase.regionserver.wal.TestReadWriteKeyValuesWithCodec
Tests run: 2, Failures: 0, Errors: 0, Skipped: 0, Time elapsed: 0.03 sec - in org.apache.hadoop.hbase.regionserver.wal.TestReadWriteKeyValuesWithCodec
Running org.apache.hadoop.hbase.regionserver.wal.TestWALReplayWithIndexWritesAndCompressedWAL
Tests run: 1, Failures: 0, Errors: 0, Skipped: 0, Time elapsed: 19.281 sec - in org.apache.hadoop.hbase.regionserver.wal.TestWALReplayWithIndexWritesAndCompressedWAL
Running org.apache.hadoop.hbase.regionserver.wal.TestWALReplayWithIndexWritesAndUncompressedWALInHBase_094_9
Tests run: 1, Failures: 0, Errors: 0, Skipped: 0, Time elapsed: 23.812 sec - in org.apache.hadoop.hbase.regionserver.wal.TestWALReplayWithIndexWritesAndUncompressedWALInHBase_094_9

Results :

Tests in error: 
  TenantSpecificViewIndexSaltedTest>BaseTest.stopServer:423->BaseTest.destroyDriver:391
? NullPointer
  TenantSpecificViewIndexTest>BaseTest.stopServer:423->BaseTest.destroyDriver:391 ?
NullPointer

Tests run: 1752, Failures: 0, Errors: 2, Skipped: 13

[INFO] ------------------------------------------------------------------------
[INFO] Reactor Summary:
[INFO] 
[INFO] Apache Phoenix .................................... SUCCESS [2.396s]
[INFO] Phoenix Hadoop Compatibility ...................... SUCCESS [1.773s]
[INFO] Phoenix Core ...................................... FAILURE [43:16.150s]
[INFO] Phoenix - Flume ................................... SKIPPED
[INFO] Phoenix - Pig ..................................... SKIPPED
[INFO] Phoenix Hadoop1 Compatibility ..................... SKIPPED
[INFO] Phoenix Assebmly .................................. SKIPPED
[INFO] ------------------------------------------------------------------------
[INFO] BUILD FAILURE
[INFO] ------------------------------------------------------------------------
[INFO] Total time: 43:20.840s
[INFO] Finished at: Thu Mar 06 00:53:59 UTC 2014
[INFO] Final Memory: 28M/341M
[INFO] ------------------------------------------------------------------------
[ERROR] Failed to execute goal org.apache.maven.plugins:maven-surefire-plugin:2.16:test (default-test)
on project phoenix-core: There are test failures.
[ERROR] 
[ERROR] Please refer to <https://builds.apache.org/job/Phoenix/ws/phoenix-core/target/surefire-reports>
for the individual test results.
[ERROR] -> [Help 1]
[ERROR] 
[ERROR] To see the full stack trace of the errors, re-run Maven with the -e switch.
[ERROR] Re-run Maven using the -X switch to enable full debug logging.
[ERROR] 
[ERROR] For more information about the errors and possible solutions, please read the following
articles:
[ERROR] [Help 1] http://cwiki.apache.org/confluence/display/MAVEN/MojoFailureException
[ERROR] 
[ERROR] After correcting the problems, you can resume the build with the command
[ERROR]   mvn <goals> -rf :phoenix-core
Build step 'Invoke top-level Maven targets' marked build as failure
Archiving artifacts
Updating PHOENIX-62
Updating PHOENIX-110
Recording test results

Mime
View raw message