phoenix-commits mailing list archives

Site index · List index
Message view « Date » · « Thread »
Top « Date » · « Thread »
From Apache Jenkins Server <jenk...@builds.apache.org>
Subject Build failed in Jenkins: Phoenix-2.2.3 #2
Date Sat, 08 Feb 2014 05:36:17 GMT
See <https://builds.apache.org/job/Phoenix-2.2.3/2/changes>

Changes:

[mujtaba] Test is fixed in master. Disabled in 2.2.3 as fails on build machine when time is
not in GMT.

------------------------------------------
Started by an SCM change
Building remotely on ubuntu4 in workspace <https://builds.apache.org/job/Phoenix-2.2.3/ws/>
Fetching changes from the remote Git repository
Fetching upstream changes from git://git.apache.org/incubator-phoenix.git/
Checking out Revision f5806942b923c36e524ada49a9b84378d077a8a6 (origin/2.2.3)
No emails were triggered.
[Phoenix-2.2.3] $ /home/hudson/tools/maven/apache-maven-3.0.4/bin/mvn clean package
[INFO] Scanning for projects...
[INFO]                                                                         
[INFO] ------------------------------------------------------------------------
[INFO] Building Phoenix 2.2.3
[INFO] ------------------------------------------------------------------------
[INFO] 
[INFO] --- maven-clean-plugin:2.4.1:clean (default-clean) @ phoenix ---
[INFO] Deleting <https://builds.apache.org/job/Phoenix-2.2.3/ws/target>
[INFO] 
[INFO] --- build-helper-maven-plugin:1.7:add-source (add-source) @ phoenix ---
[INFO] Source directory: <https://builds.apache.org/job/Phoenix-2.2.3/ws/target/generated-sources/antlr3>
added.
[INFO] Source directory: <https://builds.apache.org/job/Phoenix-2.2.3/ws/src/main/antlr3>
added.
[INFO] 
[INFO] --- antlr3-maven-plugin:3.5:antlr (default) @ phoenix ---
[INFO] ANTLR: Processing source directory <https://builds.apache.org/job/Phoenix-2.2.3/ws/src/main/antlr3>
ANTLR Parser Generator  Version 3.5
Output file <https://builds.apache.org/job/Phoenix-2.2.3/ws/target/generated-sources/antlr3/org/apache/phoenix/parse/PhoenixSQLParser.java>
does not exist: must build <https://builds.apache.org/job/Phoenix-2.2.3/ws/src/main/antlr3/PhoenixSQL.g>
PhoenixSQL.g
[INFO] 
[INFO] --- maven-resources-plugin:2.5:resources (default-resources) @ phoenix ---
[debug] execute contextualize
[INFO] Using 'UTF-8' encoding to copy filtered resources.
[INFO] Copying 1 resource to META-INF/services
[INFO] 
[INFO] --- maven-compiler-plugin:3.0:compile (default-compile) @ phoenix ---
[INFO] Changes detected - recompiling the module!
[INFO] Compiling 554 source files to <https://builds.apache.org/job/Phoenix-2.2.3/ws/target/classes>
[WARNING] <https://builds.apache.org/job/Phoenix-2.2.3/ws/src/main/java/org/apache/phoenix/jdbc/PhoenixResultSet.java>:
Some input files use or override a deprecated API.
[WARNING] <https://builds.apache.org/job/Phoenix-2.2.3/ws/src/main/java/org/apache/phoenix/jdbc/PhoenixResultSet.java>:
Recompile with -Xlint:deprecation for details.
[INFO] 
[INFO] --- maven-resources-plugin:2.5:testResources (default-testResources) @ phoenix ---
[debug] execute contextualize
[INFO] Using 'UTF-8' encoding to copy filtered resources.
[INFO] Copying 2 resources
[INFO] 
[INFO] --- maven-compiler-plugin:3.0:testCompile (default-testCompile) @ phoenix ---
[INFO] Changes detected - recompiling the module!
[INFO] Compiling 145 source files to <https://builds.apache.org/job/Phoenix-2.2.3/ws/target/test-classes>
[INFO] -------------------------------------------------------------
[ERROR] COMPILATION ERROR : 
[INFO] -------------------------------------------------------------
[ERROR] <https://builds.apache.org/job/Phoenix-2.2.3/ws/src/test/java/org/apache/phoenix/compile/StatementHintsCompilationTest.java>:[113,6]
cannot find symbol
  symbol:   class Ignore
  location: class org.apache.phoenix.compile.StatementHintsCompilationTest
[INFO] 1 error
[INFO] -------------------------------------------------------------
[INFO] ------------------------------------------------------------------------
[INFO] BUILD FAILURE
[INFO] ------------------------------------------------------------------------
[INFO] Total time: 17.299s
[INFO] Finished at: Sat Feb 08 05:36:05 UTC 2014
[INFO] Final Memory: 29M/422M
[INFO] ------------------------------------------------------------------------
[ERROR] Failed to execute goal org.apache.maven.plugins:maven-compiler-plugin:3.0:testCompile
(default-testCompile) on project phoenix: Compilation failure
[ERROR] <https://builds.apache.org/job/Phoenix-2.2.3/ws/src/test/java/org/apache/phoenix/compile/StatementHintsCompilationTest.java>:[113,6]
cannot find symbol
[ERROR] symbol:   class Ignore
[ERROR] location: class org.apache.phoenix.compile.StatementHintsCompilationTest
[ERROR] -> [Help 1]
[ERROR] 
[ERROR] To see the full stack trace of the errors, re-run Maven with the -e switch.
[ERROR] Re-run Maven using the -X switch to enable full debug logging.
[ERROR] 
[ERROR] For more information about the errors and possible solutions, please read the following
articles:
[ERROR] [Help 1] http://cwiki.apache.org/confluence/display/MAVEN/MojoFailureException
Build step 'Invoke top-level Maven targets' marked build as failure
Archiving artifacts
Recording test results

Mime
View raw message