phoenix-commits mailing list archives

Site index · List index
Message view « Date » · « Thread »
Top « Date » · « Thread »
From Apache Jenkins Server <jenk...@builds.apache.org>
Subject Build failed in Jenkins: Apache Phoenix - Branch:master #47
Date Wed, 12 Feb 2014 09:32:27 GMT
See <https://builds.apache.org/job/Phoenix/47/changes>

Changes:

[jamestaylor] PHOENIX-40 Add support for batching (JamesTaylor)

------------------------------------------
[...truncated 207 lines...]
Tests run: 20, Failures: 0, Errors: 0, Skipped: 0, Time elapsed: 42.451 sec - in org.apache.phoenix.end2end.SequenceTest
Running org.apache.phoenix.end2end.salted.SaltedTableVarLengthRowKeyTest
Tests run: 1, Failures: 0, Errors: 0, Skipped: 0, Time elapsed: 31.686 sec - in org.apache.phoenix.end2end.salted.SaltedTableVarLengthRowKeyTest
Running org.apache.phoenix.end2end.salted.SaltedTableTest
Tests run: 8, Failures: 0, Errors: 0, Skipped: 0, Time elapsed: 32.695 sec - in org.apache.phoenix.end2end.salted.SaltedTableTest
Running org.apache.phoenix.end2end.salted.SaltedTableUpsertSelectTest
Tests run: 5, Failures: 0, Errors: 0, Skipped: 0, Time elapsed: 36.387 sec - in org.apache.phoenix.end2end.salted.SaltedTableUpsertSelectTest
Running org.apache.phoenix.end2end.UpsertValuesTest
Tests run: 10, Failures: 0, Errors: 0, Skipped: 0, Time elapsed: 43.704 sec - in org.apache.phoenix.end2end.UpsertValuesTest
Running org.apache.phoenix.end2end.IsNullTest
Tests run: 1, Failures: 0, Errors: 0, Skipped: 0, Time elapsed: 32.164 sec - in org.apache.phoenix.end2end.IsNullTest
Running org.apache.phoenix.end2end.DynamicColumnTest
Tests run: 5, Failures: 0, Errors: 0, Skipped: 0, Time elapsed: 31.623 sec - in org.apache.phoenix.end2end.DynamicColumnTest
Running org.apache.phoenix.end2end.QueryDatabaseMetaDataTest
Tests run: 15, Failures: 0, Errors: 0, Skipped: 0, Time elapsed: 74.283 sec - in org.apache.phoenix.end2end.QueryDatabaseMetaDataTest
Running org.apache.phoenix.end2end.ArrayTest
Tests run: 25, Failures: 0, Errors: 0, Skipped: 0, Time elapsed: 42.715 sec - in org.apache.phoenix.end2end.ArrayTest
Running org.apache.phoenix.end2end.ReadIsolationLevelTest
Tests run: 2, Failures: 0, Errors: 0, Skipped: 0, Time elapsed: 31.543 sec - in org.apache.phoenix.end2end.ReadIsolationLevelTest
Running org.apache.phoenix.end2end.CreateTableTest
Tests run: 2, Failures: 0, Errors: 0, Skipped: 0, Time elapsed: 33.422 sec - in org.apache.phoenix.end2end.CreateTableTest
Running org.apache.phoenix.end2end.CustomEntityDataTest
Tests run: 3, Failures: 0, Errors: 0, Skipped: 0, Time elapsed: 31.932 sec - in org.apache.phoenix.end2end.CustomEntityDataTest
Running org.apache.phoenix.end2end.HashJoinTest
Tests run: 48, Failures: 0, Errors: 1, Skipped: 0, Time elapsed: 69.275 sec <<< FAILURE!
- in org.apache.phoenix.end2end.HashJoinTest
testJoinWithWildcard[[Ljava.lang.String;@b448ce](org.apache.phoenix.end2end.HashJoinTest)
 Time elapsed: 0.314 sec  <<< ERROR!
java.lang.UnsupportedOperationException: null
	at org.apache.phoenix.compile.FromCompiler$SingleTableColumnResolver.resolveTable(FromCompiler.java:249)
	at org.apache.phoenix.compile.ProjectionCompiler.compile(ProjectionCompiler.java:253)
	at org.apache.phoenix.compile.QueryCompiler.compileSingleQuery(QueryCompiler.java:280)
	at org.apache.phoenix.compile.QueryCompiler.compile(QueryCompiler.java:126)
	at org.apache.phoenix.compile.QueryCompiler.compile(QueryCompiler.java:113)
	at org.apache.phoenix.optimize.QueryOptimizer.addPlan(QueryOptimizer.java:166)
	at org.apache.phoenix.optimize.QueryOptimizer.optimize(QueryOptimizer.java:93)
	at org.apache.phoenix.optimize.QueryOptimizer.optimize(QueryOptimizer.java:45)
	at org.apache.phoenix.execute.BasicQueryPlan.getExplainPlan(BasicQueryPlan.java:193)
	at org.apache.phoenix.execute.HashJoinPlan.getExplainPlan(HashJoinPlan.java:150)
	at org.apache.phoenix.jdbc.PhoenixStatement$ExecutableExplainStatement.compilePlan(PhoenixStatement.java:320)
	at org.apache.phoenix.jdbc.PhoenixStatement$ExecutableExplainStatement.compilePlan(PhoenixStatement.java:299)
	at org.apache.phoenix.jdbc.PhoenixStatement.executeQuery(PhoenixStatement.java:198)
	at org.apache.phoenix.jdbc.PhoenixStatement.executeQuery(PhoenixStatement.java:843)
	at org.apache.phoenix.end2end.HashJoinTest.testJoinWithWildcard(HashJoinTest.java:1524)

Running org.apache.phoenix.end2end.CSVLoaderTest
Tests run: 10, Failures: 0, Errors: 0, Skipped: 0, Time elapsed: 33.619 sec - in org.apache.phoenix.end2end.CSVLoaderTest
Running org.apache.phoenix.end2end.SortOrderFTest
Tests run: 29, Failures: 0, Errors: 0, Skipped: 0, Time elapsed: 31.067 sec - in org.apache.phoenix.end2end.SortOrderFTest
Running org.apache.phoenix.end2end.QueryPlanTest
Tests run: 1, Failures: 0, Errors: 0, Skipped: 0, Time elapsed: 42.644 sec - in org.apache.phoenix.end2end.QueryPlanTest
Running org.apache.phoenix.end2end.ViewTest
Tests run: 5, Failures: 0, Errors: 0, Skipped: 0, Time elapsed: 32.017 sec - in org.apache.phoenix.end2end.ViewTest
Running org.apache.phoenix.end2end.UpsertSelectTest
Tests run: 10, Failures: 0, Errors: 0, Skipped: 0, Time elapsed: 49.24 sec - in org.apache.phoenix.end2end.UpsertSelectTest
Running org.apache.phoenix.end2end.AlterTableTest
Tests run: 13, Failures: 0, Errors: 0, Skipped: 0, Time elapsed: 66.719 sec - in org.apache.phoenix.end2end.AlterTableTest
Running org.apache.phoenix.end2end.PercentileTest
Tests run: 17, Failures: 0, Errors: 0, Skipped: 0, Time elapsed: 35.93 sec - in org.apache.phoenix.end2end.PercentileTest
Running org.apache.phoenix.end2end.ProductMetricsTest
Tests run: 61, Failures: 0, Errors: 0, Skipped: 0, Time elapsed: 53.784 sec - in org.apache.phoenix.end2end.ProductMetricsTest
Running org.apache.phoenix.end2end.DeleteTest
Tests run: 13, Failures: 0, Errors: 0, Skipped: 0, Time elapsed: 45.197 sec - in org.apache.phoenix.end2end.DeleteTest
Running org.apache.phoenix.end2end.SpooledOrderByTest
Tests run: 3, Failures: 0, Errors: 0, Skipped: 1, Time elapsed: 32.371 sec - in org.apache.phoenix.end2end.SpooledOrderByTest
Running org.apache.phoenix.end2end.QueryTest
Tests run: 428, Failures: 0, Errors: 0, Skipped: 0, Time elapsed: 193.092 sec - in org.apache.phoenix.end2end.QueryTest
Running org.apache.phoenix.end2end.DynamicUpsertTest
Tests run: 7, Failures: 0, Errors: 0, Skipped: 0, Time elapsed: 32.903 sec - in org.apache.phoenix.end2end.DynamicUpsertTest
Running org.apache.phoenix.end2end.RoundFloorCeilFunctionsEnd2EndTest
Tests run: 21, Failures: 0, Errors: 0, Skipped: 0, Time elapsed: 31.731 sec - in org.apache.phoenix.end2end.RoundFloorCeilFunctionsEnd2EndTest
Running org.apache.phoenix.end2end.TenantSpecificTablesDDLTest
Tests run: 16, Failures: 0, Errors: 0, Skipped: 0, Time elapsed: 43.366 sec - in org.apache.phoenix.end2end.TenantSpecificTablesDDLTest
Running org.apache.phoenix.end2end.TenantSpecificTablesDMLTest
Tests run: 12, Failures: 0, Errors: 0, Skipped: 0, Time elapsed: 35.066 sec - in org.apache.phoenix.end2end.TenantSpecificTablesDMLTest
Running org.apache.phoenix.end2end.MD5FunctionTest
Tests run: 2, Failures: 0, Errors: 0, Skipped: 0, Time elapsed: 33.176 sec - in org.apache.phoenix.end2end.MD5FunctionTest
Running org.apache.phoenix.end2end.DefaultParallelIteratorsRegionSplitterTest
Tests run: 3, Failures: 0, Errors: 0, Skipped: 0, Time elapsed: 42.809 sec - in org.apache.phoenix.end2end.DefaultParallelIteratorsRegionSplitterTest
Running org.apache.phoenix.end2end.ToNumberFunctionTest
Tests run: 18, Failures: 0, Errors: 0, Skipped: 0, Time elapsed: 31.445 sec - in org.apache.phoenix.end2end.ToNumberFunctionTest
Running org.apache.phoenix.end2end.SkipScanQueryTest
Tests run: 5, Failures: 0, Errors: 0, Skipped: 0, Time elapsed: 32.25 sec - in org.apache.phoenix.end2end.SkipScanQueryTest
Running org.apache.phoenix.end2end.InMemoryOrderByTest
Tests run: 3, Failures: 0, Errors: 0, Skipped: 1, Time elapsed: 32.725 sec - in org.apache.phoenix.end2end.InMemoryOrderByTest
Running org.apache.phoenix.end2end.StddevTest
Tests run: 4, Failures: 0, Errors: 0, Skipped: 0, Time elapsed: 32.531 sec - in org.apache.phoenix.end2end.StddevTest
Running org.apache.phoenix.end2end.ReverseFunctionTest
Tests run: 5, Failures: 0, Errors: 0, Skipped: 0, Time elapsed: 32.771 sec - in org.apache.phoenix.end2end.ReverseFunctionTest
Running org.apache.phoenix.end2end.QueryExecWithoutSCNTest
Tests run: 1, Failures: 0, Errors: 0, Skipped: 0, Time elapsed: 32.298 sec - in org.apache.phoenix.end2end.QueryExecWithoutSCNTest
Running org.apache.phoenix.end2end.ServerExceptionTest
Tests run: 1, Failures: 0, Errors: 0, Skipped: 0, Time elapsed: 31.517 sec - in org.apache.phoenix.end2end.ServerExceptionTest
Running org.apache.phoenix.end2end.BinaryRowKeyTest
Tests run: 3, Failures: 0, Errors: 0, Skipped: 0, Time elapsed: 32.484 sec - in org.apache.phoenix.end2end.BinaryRowKeyTest
Running org.apache.phoenix.end2end.RowValueConstructorTest
Tests run: 24, Failures: 0, Errors: 0, Skipped: 0, Time elapsed: 41.679 sec - in org.apache.phoenix.end2end.RowValueConstructorTest
Running org.apache.phoenix.end2end.OrderByTest
Tests run: 3, Failures: 0, Errors: 0, Skipped: 1, Time elapsed: 32.083 sec - in org.apache.phoenix.end2end.OrderByTest
Running org.apache.phoenix.end2end.DistinctCountTest
Tests run: 9, Failures: 0, Errors: 0, Skipped: 0, Time elapsed: 34.556 sec - in org.apache.phoenix.end2end.DistinctCountTest
Running org.apache.phoenix.end2end.TopNTest
Tests run: 4, Failures: 0, Errors: 0, Skipped: 0, Time elapsed: 33.249 sec - in org.apache.phoenix.end2end.TopNTest
Running org.apache.phoenix.end2end.UpsertBigValuesTest
Tests run: 4, Failures: 0, Errors: 0, Skipped: 0, Time elapsed: 42.756 sec - in org.apache.phoenix.end2end.UpsertBigValuesTest
Running org.apache.phoenix.end2end.FunkyNamesTest
Tests run: 3, Failures: 0, Errors: 0, Skipped: 0, Time elapsed: 35.152 sec - in org.apache.phoenix.end2end.FunkyNamesTest
Running org.apache.phoenix.end2end.NativeHBaseTypesTest
Tests run: 7, Failures: 0, Errors: 0, Skipped: 0, Time elapsed: 45.668 sec - in org.apache.phoenix.end2end.NativeHBaseTypesTest
Running org.apache.phoenix.end2end.KeyOnlyTest
Tests run: 2, Failures: 0, Errors: 0, Skipped: 0, Time elapsed: 33.155 sec - in org.apache.phoenix.end2end.KeyOnlyTest
Running org.apache.phoenix.end2end.ArithmeticQueryTest
Tests run: 8, Failures: 0, Errors: 0, Skipped: 0, Time elapsed: 45.673 sec - in org.apache.phoenix.end2end.ArithmeticQueryTest
Running org.apache.phoenix.end2end.ToCharFunctionTest
Tests run: 10, Failures: 0, Errors: 0, Skipped: 0, Time elapsed: 31.682 sec - in org.apache.phoenix.end2end.ToCharFunctionTest
Running org.apache.phoenix.end2end.GroupByCaseTest
Tests run: 3, Failures: 0, Errors: 0, Skipped: 0, Time elapsed: 34.073 sec - in org.apache.phoenix.end2end.GroupByCaseTest
Running org.apache.phoenix.end2end.SkipRangeParallelIteratorRegionSplitterTest
Tests run: 8, Failures: 0, Errors: 0, Skipped: 0, Time elapsed: 34.496 sec - in org.apache.phoenix.end2end.SkipRangeParallelIteratorRegionSplitterTest
Running org.apache.phoenix.end2end.ExecuteStatementsTest
Tests run: 2, Failures: 0, Errors: 0, Skipped: 0, Time elapsed: 44.534 sec - in org.apache.phoenix.end2end.ExecuteStatementsTest
Running org.apache.phoenix.end2end.CompareDecimalToLongTest
Tests run: 8, Failures: 0, Errors: 0, Skipped: 0, Time elapsed: 32.757 sec - in org.apache.phoenix.end2end.CompareDecimalToLongTest
Running org.apache.phoenix.expression.LikeExpressionTest
Tests run: 1, Failures: 0, Errors: 0, Skipped: 0, Time elapsed: 0 sec - in org.apache.phoenix.expression.LikeExpressionTest
Running org.apache.phoenix.expression.CoerceExpressionTest
Tests run: 5, Failures: 0, Errors: 0, Skipped: 0, Time elapsed: 0.001 sec - in org.apache.phoenix.expression.CoerceExpressionTest
Running org.apache.phoenix.expression.ColumnExpressionTest
Tests run: 4, Failures: 0, Errors: 0, Skipped: 0, Time elapsed: 0.001 sec - in org.apache.phoenix.expression.ColumnExpressionTest
Running org.apache.phoenix.expression.SortOrderExpressionTest
Tests run: 23, Failures: 0, Errors: 0, Skipped: 0, Time elapsed: 0.008 sec - in org.apache.phoenix.expression.SortOrderExpressionTest
Running org.apache.phoenix.compile.JoinQueryCompilerTest
Tests run: 2, Failures: 0, Errors: 0, Skipped: 0, Time elapsed: 0.043 sec - in org.apache.phoenix.compile.JoinQueryCompilerTest
Running org.apache.phoenix.compile.QueryMetaDataTest
Tests run: 32, Failures: 0, Errors: 0, Skipped: 0, Time elapsed: 0.038 sec - in org.apache.phoenix.compile.QueryMetaDataTest
Running org.apache.phoenix.compile.QueryOptimizerTest
Tests run: 25, Failures: 0, Errors: 0, Skipped: 0, Time elapsed: 0.074 sec - in org.apache.phoenix.compile.QueryOptimizerTest
Running org.apache.phoenix.compile.StatementHintsCompilationTest
Tests run: 3, Failures: 0, Errors: 0, Skipped: 0, Time elapsed: 0.022 sec - in org.apache.phoenix.compile.StatementHintsCompilationTest
Running org.apache.phoenix.compile.WhereCompilerTest
Tests run: 41, Failures: 0, Errors: 0, Skipped: 1, Time elapsed: 0.049 sec - in org.apache.phoenix.compile.WhereCompilerTest
Running org.apache.phoenix.compile.ViewCompilerTest
Tests run: 3, Failures: 0, Errors: 0, Skipped: 0, Time elapsed: 0.032 sec - in org.apache.phoenix.compile.ViewCompilerTest
Running org.apache.phoenix.compile.SelectStatementRewriterTest
Tests run: 5, Failures: 0, Errors: 0, Skipped: 0, Time elapsed: 0.021 sec - in org.apache.phoenix.compile.SelectStatementRewriterTest
Running org.apache.phoenix.compile.HavingCompilerTest
Tests run: 10, Failures: 0, Errors: 0, Skipped: 0, Time elapsed: 0.024 sec - in org.apache.phoenix.compile.HavingCompilerTest
Running org.apache.phoenix.compile.WhereOptimizerTest
Tests run: 89, Failures: 0, Errors: 0, Skipped: 0, Time elapsed: 0.064 sec - in org.apache.phoenix.compile.WhereOptimizerTest
Running org.apache.phoenix.compile.LimitCompilerTest
Tests run: 6, Failures: 0, Errors: 0, Skipped: 0, Time elapsed: 0.022 sec - in org.apache.phoenix.compile.LimitCompilerTest
Running org.apache.phoenix.compile.ScanRangesTest
Tests run: 34, Failures: 0, Errors: 0, Skipped: 0, Time elapsed: 0.059 sec - in org.apache.phoenix.compile.ScanRangesTest
Running org.apache.phoenix.compile.QueryCompilerTest
Tests run: 77, Failures: 0, Errors: 0, Skipped: 0, Time elapsed: 0.067 sec - in org.apache.phoenix.compile.QueryCompilerTest
Running org.apache.hadoop.hbase.index.TestFailForUnsupportedHBaseVersions
Tests run: 2, Failures: 0, Errors: 0, Skipped: 0, Time elapsed: 21.814 sec - in org.apache.hadoop.hbase.index.TestFailForUnsupportedHBaseVersions
Running org.apache.hadoop.hbase.index.util.TestIndexManagementUtil
Tests run: 3, Failures: 0, Errors: 0, Skipped: 0, Time elapsed: 0.003 sec - in org.apache.hadoop.hbase.index.util.TestIndexManagementUtil
Running org.apache.hadoop.hbase.index.write.TestWALRecoveryCaching
Tests run: 1, Failures: 0, Errors: 0, Skipped: 1, Time elapsed: 0.001 sec - in org.apache.hadoop.hbase.index.write.TestWALRecoveryCaching
Running org.apache.hadoop.hbase.index.write.TestCachingHTableFactory
Tests run: 1, Failures: 0, Errors: 0, Skipped: 0, Time elapsed: 0.246 sec - in org.apache.hadoop.hbase.index.write.TestCachingHTableFactory
Running org.apache.hadoop.hbase.index.write.recovery.TestPerRegionIndexWriteCache
Tests run: 3, Failures: 0, Errors: 0, Skipped: 0, Time elapsed: 0.001 sec - in org.apache.hadoop.hbase.index.write.recovery.TestPerRegionIndexWriteCache
Running org.apache.hadoop.hbase.index.write.TestParalleWriterIndexCommitter
Tests run: 2, Failures: 0, Errors: 0, Skipped: 0, Time elapsed: 0.049 sec - in org.apache.hadoop.hbase.index.write.TestParalleWriterIndexCommitter
Running org.apache.hadoop.hbase.index.write.TestIndexWriter
Tests run: 5, Failures: 0, Errors: 0, Skipped: 0, Time elapsed: 0.074 sec - in org.apache.hadoop.hbase.index.write.TestIndexWriter
Running org.apache.hadoop.hbase.index.write.TestParalleIndexWriter
Tests run: 2, Failures: 0, Errors: 0, Skipped: 0, Time elapsed: 0.003 sec - in org.apache.hadoop.hbase.index.write.TestParalleIndexWriter
Running org.apache.hadoop.hbase.index.covered.data.TestIndexMemStore
Tests run: 2, Failures: 0, Errors: 0, Skipped: 0, Time elapsed: 0.001 sec - in org.apache.hadoop.hbase.index.covered.data.TestIndexMemStore
Running org.apache.hadoop.hbase.index.covered.update.TestIndexUpdateManager
Tests run: 2, Failures: 0, Errors: 0, Skipped: 0, Time elapsed: 0.003 sec - in org.apache.hadoop.hbase.index.covered.update.TestIndexUpdateManager
Running org.apache.hadoop.hbase.index.covered.TestLocalTableState
Tests run: 3, Failures: 0, Errors: 0, Skipped: 0, Time elapsed: 0.115 sec - in org.apache.hadoop.hbase.index.covered.TestLocalTableState
Running org.apache.hadoop.hbase.index.covered.filter.TestFamilyOnlyFilter
Tests run: 3, Failures: 0, Errors: 0, Skipped: 0, Time elapsed: 0.002 sec - in org.apache.hadoop.hbase.index.covered.filter.TestFamilyOnlyFilter
Running org.apache.hadoop.hbase.index.covered.filter.TestApplyAndFilterDeletesFilter
Tests run: 6, Failures: 0, Errors: 0, Skipped: 0, Time elapsed: 0.002 sec - in org.apache.hadoop.hbase.index.covered.filter.TestApplyAndFilterDeletesFilter
Running org.apache.hadoop.hbase.index.covered.filter.TestNewerTimestampFilter
Tests run: 1, Failures: 0, Errors: 0, Skipped: 0, Time elapsed: 0.001 sec - in org.apache.hadoop.hbase.index.covered.filter.TestNewerTimestampFilter
Running org.apache.hadoop.hbase.index.covered.example.TestCoveredIndexSpecifierBuilder
Tests run: 1, Failures: 0, Errors: 0, Skipped: 0, Time elapsed: 0.001 sec - in org.apache.hadoop.hbase.index.covered.example.TestCoveredIndexSpecifierBuilder
Running org.apache.hadoop.hbase.index.covered.example.TestEndtoEndIndexingWithCompression
Tests run: 11, Failures: 0, Errors: 0, Skipped: 0, Time elapsed: 132.995 sec - in org.apache.hadoop.hbase.index.covered.example.TestEndtoEndIndexingWithCompression
Running org.apache.hadoop.hbase.index.covered.example.TestFailWithoutRetries
Tests run: 1, Failures: 0, Errors: 0, Skipped: 0, Time elapsed: 22.256 sec - in org.apache.hadoop.hbase.index.covered.example.TestFailWithoutRetries
Running org.apache.hadoop.hbase.index.covered.example.TestCoveredColumnIndexCodec
Tests run: 3, Failures: 0, Errors: 0, Skipped: 0, Time elapsed: 0.022 sec - in org.apache.hadoop.hbase.index.covered.example.TestCoveredColumnIndexCodec
Running org.apache.hadoop.hbase.index.covered.example.TestEndToEndCoveredIndexing
Tests run: 11, Failures: 0, Errors: 0, Skipped: 0, Time elapsed: 144.003 sec - in org.apache.hadoop.hbase.index.covered.example.TestEndToEndCoveredIndexing
Running org.apache.hadoop.hbase.index.covered.example.TestColumnTracker
Tests run: 3, Failures: 0, Errors: 0, Skipped: 0, Time elapsed: 0 sec - in org.apache.hadoop.hbase.index.covered.example.TestColumnTracker
Running org.apache.hadoop.hbase.index.covered.TestEndToEndCoveredColumnsIndexBuilder
Tests run: 2, Failures: 0, Errors: 0, Skipped: 0, Time elapsed: 32.388 sec - in org.apache.hadoop.hbase.index.covered.TestEndToEndCoveredColumnsIndexBuilder
Running org.apache.hadoop.hbase.index.covered.TestCoveredColumns
Tests run: 1, Failures: 0, Errors: 0, Skipped: 0, Time elapsed: 0 sec - in org.apache.hadoop.hbase.index.covered.TestCoveredColumns
Running org.apache.hadoop.hbase.index.parallel.TestThreadPoolManager
Tests run: 3, Failures: 0, Errors: 0, Skipped: 0, Time elapsed: 0.001 sec - in org.apache.hadoop.hbase.index.parallel.TestThreadPoolManager
Running org.apache.hadoop.hbase.index.parallel.TestThreadPoolBuilder
Tests run: 2, Failures: 0, Errors: 0, Skipped: 0, Time elapsed: 0 sec - in org.apache.hadoop.hbase.index.parallel.TestThreadPoolBuilder
Running org.apache.hadoop.hbase.regionserver.wal.TestWALReplayWithIndexWritesAndUncompressedWALInHBase_094_9
Tests run: 1, Failures: 0, Errors: 0, Skipped: 0, Time elapsed: 40.117 sec - in org.apache.hadoop.hbase.regionserver.wal.TestWALReplayWithIndexWritesAndUncompressedWALInHBase_094_9
Running org.apache.hadoop.hbase.regionserver.wal.TestWALReplayWithIndexWritesAndCompressedWAL
Tests run: 1, Failures: 0, Errors: 0, Skipped: 0, Time elapsed: 43.111 sec - in org.apache.hadoop.hbase.regionserver.wal.TestWALReplayWithIndexWritesAndCompressedWAL
Running org.apache.hadoop.hbase.regionserver.wal.TestReadWriteKeyValuesWithCodec
Tests run: 2, Failures: 0, Errors: 0, Skipped: 0, Time elapsed: 0.09 sec - in org.apache.hadoop.hbase.regionserver.wal.TestReadWriteKeyValuesWithCodec

Results :

Tests in error: 
  HashJoinTest.testJoinWithWildcard:1524 ? UnsupportedOperation

Tests run: 1691, Failures: 0, Errors: 1, Skipped: 8

[INFO] ------------------------------------------------------------------------
[INFO] Reactor Summary:
[INFO] 
[INFO] Apache Phoenix .................................... SUCCESS [3.338s]
[INFO] Phoenix Hadoop Compatibility ...................... SUCCESS [4.935s]
[INFO] Phoenix Core ...................................... FAILURE [54:35.038s]
[INFO] Phoenix - Flume ................................... SKIPPED
[INFO] Phoenix - Pig ..................................... SKIPPED
[INFO] Phoenix Hadoop1 Compatibility ..................... SKIPPED
[INFO] Phoenix Assebmly .................................. SKIPPED
[INFO] ------------------------------------------------------------------------
[INFO] BUILD FAILURE
[INFO] ------------------------------------------------------------------------
[INFO] Total time: 54:43.690s
[INFO] Finished at: Wed Feb 12 09:31:49 UTC 2014
[INFO] Final Memory: 23M/415M
[INFO] ------------------------------------------------------------------------
[ERROR] Failed to execute goal org.apache.maven.plugins:maven-surefire-plugin:2.16:test (default-test)
on project phoenix-core: There are test failures.
[ERROR] 
[ERROR] Please refer to <https://builds.apache.org/job/Phoenix/ws/phoenix-core/target/surefire-reports>
for the individual test results.
[ERROR] -> [Help 1]
[ERROR] 
[ERROR] To see the full stack trace of the errors, re-run Maven with the -e switch.
[ERROR] Re-run Maven using the -X switch to enable full debug logging.
[ERROR] 
[ERROR] For more information about the errors and possible solutions, please read the following
articles:
[ERROR] [Help 1] http://cwiki.apache.org/confluence/display/MAVEN/MojoFailureException
[ERROR] 
[ERROR] After correcting the problems, you can resume the build with the command
[ERROR]   mvn <goals> -rf :phoenix-core
Build step 'Invoke top-level Maven targets' marked build as failure
Archiving artifacts
Updating PHOENIX-40
Recording test results

Mime
View raw message