perl-modperl mailing list archives

Site index · List index
Message view « Date » · « Thread »
Top « Date » · « Thread »
From Zakk <rw92672...@hotmail.com>
Subject mod_perl's make test fails.
Date Sat, 02 Feb 2008 02:04:58 GMT
Hi there.



For the last few days, I've been trying to install mod_perl for my
server. It's running Slackware 12.0 with Apache 2.2.8 (with APR 1.2.12)
and Perl 5.10.0.

The version of mod_perl I'm using is 2.0.4-dev, a recent SVN checkout.
I would be normally be using the stable, but I've heard that it's
incompatible with the current Perl stable.



I had no issues with compiling Apache, APR, Perl or mod_perl, and both
Apache & Perl has been compiled for the worker MPM. It's the 'make
test' that keeps failing.



Here's the output of the tests that fail...




user@Sen:~/mod_perl-2.0$ t/TEST -verbose t/perl/ithreads.t t/perl/ithreads2.t t/perl/ithreads_args.t
t/perl/ithreads_eval.t
[warning] setting ulimit to allow core files
ulimit -c unlimited; /usr/bin/perl5.10.0 /home/user/mod_perl-2.0/t/TEST -verbose 't/perl/ithreads.t'
't/perl/ithreads2.t' 't/perl/ithreads_args.t' 't/perl/ithreads_eval.t'
/usr/sbin/httpd  -d /home/user/mod_perl-2.0/t -f /home/user/mod_perl-2.0/t/conf/httpd.conf
-D APACHE2 -D PERL_USEITHREADS
using Apache/2.2.8 (worker MPM)

waiting 300 seconds for server to start: .[Sat Feb 02 14:20:36 2008] [info] 6 Apache2:: modules
loaded
[Sat Feb 02 14:20:36 2008] [info] 0 APR:: modules loaded
[Sat Feb 02 14:20:36 2008] [info] base server + 30 vhosts ready to run tests
..........
waiting 300 seconds for server to start: ok (waited 10 secs)
server localhost:8529 started
server localhost:8530 listening (filter_out_apache)
server localhost:8531 listening (perlsections)
server localhost:8532 listening (inherit)
server localhost:8533 listening (TestUser::rewrite)
server localhost:8534 listening (TestVhost::config)
server localhost:8535 listening (TestVhost::log)
server localhost:8536 listening (TestModperl::merge)
server localhost:8537 listening (TestModperl::perl_options)
server localhost:8538 listening (TestModperl::perl_options2)
server localhost:8539 listening (TestModperl::setupenv)
server localhost:8540 listening (TestModules::proxy)
server localhost:8541 listening (TestProtocol::pseudo_http)
server localhost:8542 listening (TestProtocol::eliza)
server localhost:8543 listening (TestProtocol::echo_bbs2)
server localhost:8544 listening (TestProtocol::echo_block)
server localhost:8545 listening (TestProtocol::echo_timeout)
server localhost:8546 listening (TestProtocol::echo_filter)
server localhost:8547 listening (TestProtocol::echo_bbs)
server localhost:8548 listening (TestProtocol::echo_nonblock)
server localhost:8549 listening (TestPreConnection::note)
server localhost:8550 listening (TestHooks::trans)
server localhost:8551 listening (TestHooks::hookrun)
server localhost:8552 listening (TestHooks::startup)
server localhost:8553 listening (TestHooks::stacked_handlers2)
server localhost:8554 listening (TestHooks::init)
server localhost:8555 listening (TestFilter::in_bbs_inject_header)
server localhost:8556 listening (TestFilter::both_str_con_add)
server localhost:8557 listening (TestFilter::in_bbs_msg)
server localhost:8558 listening (TestFilter::in_str_msg)
server localhost:8559 listening (TestDirective::perlmodule)
server localhost:8560 listening (TestDirective::perlrequire)
server localhost:8561 listening (TestPerl::ithreads)
server localhost:8562 listening (TestDirective::perlloadmodule3)
server localhost:8563 listening (TestDirective::perlloadmodule4)
server localhost:8564 listening (TestDirective::perlloadmodule5)
server localhost:8565 listening (TestAPI::add_config)
server localhost:8566 listening (TestDirective::perlloadmodule6)
server localhost:8567 listening (TestHooks::push_handlers_anon)
t/perl/ithreads.........1..4
# Running under perl version 5.010000 for linux
# Current time local: Sat Feb  2 14:20:41 2008
# Current time GMT:   Sat Feb  2 01:20:41 2008
# Using Test.pm version 1.25
# Using Apache/Test.pm version 1.31
ok 1
FAILED tests 2-4
        Failed 3/4 tests, 25.00% okay
t/perl/ithreads2........# connecting to http://localhost:8561/TestPerl__ithreads
1..4
# Running under perl version 5.010000 for linux
# Current time local: Sat Feb  2 14:20:44 2008
# Current time GMT:   Sat Feb  2 01:20:44 2008
# Using Test.pm version 1.25
# Using Apache/Test.pm version 1.31
ok 1
FAILED tests 2-4
        Failed 3/4 tests, 25.00% okay
t/perl/ithreads_args....1..1
# Running under perl version 5.010000 for linux
# Current time local: Sat Feb  2 14:20:41 2008
# Current time GMT:   Sat Feb  2 01:20:41 2008
# Using Test.pm version 1.25
# Using Apache/Test.pm version 1.31
FAILED before any test output arrived
t/perl/ithreads_eval....1..1
# Running under perl version 5.010000 for linux
# Current time local: Sat Feb  2 14:20:41 2008
# Current time GMT:   Sat Feb  2 01:20:41 2008
# Using Test.pm version 1.25
# Using Apache/Test.pm version 1.31
FAILED before any test output arrived
Failed Test            Stat Wstat Total Fail  List of Failed
-------------------------------------------------------------------------------
t/perl/ithreads.t                     4    3  2-4
t/perl/ithreads2.t                    4    3  2-4
t/perl/ithreads_args.t               ??   ??  ??
t/perl/ithreads_eval.t               ??   ??  ??
Failed 4/4 test scripts. 8/10 subtests failed.
Files=4, Tests=10, 33 wallclock secs ( 8.86 cusr +  0.86 csys =  9.72 CPU)
Failed 4/4 test programs. 8/10 subtests failed.
[warning] server localhost:8529 shutdown
[  error] error running tests (please examine t/logs/error_log)
[  error] oh golly, server dumped core
[  error] for stacktrace, run: gdb /usr/sbin/httpd -core /home/user/mod_perl-2.0/t/core.6705
[  error] oh dangit, server dumped core again
[  error] for stacktrace, run: gdb /usr/sbin/httpd -core /home/user/mod_perl-2.0/t/core.6714
[  error] oh rats, server dumped core again
[  error] for stacktrace, run: gdb /usr/sbin/httpd -core /home/user/mod_perl-2.0/t/core.6727
[  error] oh gosh, server dumped core again
[  error] for stacktrace, run: gdb /usr/sbin/httpd -core /home/user/mod_perl-2.0/t/core.6736
user@Sen:~/mod_perl-2.0$


I've had a look and Google and unfortunately it seems that I'm the only one with this issue.
Does anyone know why this is failing and how I can prevent it?

Huge thanks to any replies.

_________________________________________________________________
Express yourself instantly with MSN Messenger! Download today it's FREE!
http://messenger.msn.click-url.com/go/onm00200471ave/direct/01/
Mime
View raw message