perl-dev mailing list archives

Site index · List index
Message view « Date » · « Thread »
Top « Date » · « Thread »
From "Ali ISIK" <fenlis...@gmail.com>
Subject Re: [RELEASE CANDIDATE] mod_perl-2.0.4 RC1
Date Mon, 07 Apr 2008 08:16:17 GMT
We tried to build 2.0.4 RC1 with Apache 2.2.8 and the following Perl:


C:\test>perl -V
Summary of my perl5 (revision 5 version 10 subversion 0) configuration:
  Platform:
    osname=MSWin32, osvers=5.1, archname=MSWin32-x86-multi-thread
    uname=''
    config_args='undef'
    hint=recommended, useposix=true, d_sigaction=undef
    useithreads=define, usemultiplicity=define
    useperlio=define, d_sfio=undef, uselargefiles=define, usesocks=undef
    use64bitint=undef, use64bitall=undef, uselongdouble=undef
    usemymalloc=n, bincompat5005=undef
  Compiler:
    cc='cl', ccflags ='-nologo -GF -W3 -MD -Zi -DNDEBUG -O1 -DWIN32
-D_CONSOLE -DNO_STRICT -DHAVE_DES_FCRYPT  -DPERL_IMPLICIT_CONTEXT
-DPERL_IMPLICIT_
SYS -DUSE_PERLIO -DPERL_MSVCRT_READFIX',
    optimize='-MD -Zi -DNDEBUG -O1',
    cppflags='-DWIN32'
    ccversion='12.00.8804', gccversion='', gccosandvers=''
    intsize=4, longsize=4, ptrsize=4, doublesize=8, byteorder=1234
    d_longlong=undef, longlongsize=8, d_longdbl=define, longdblsize=10
    ivtype='long', ivsize=4, nvtype='double', nvsize=8,
Off_t='__int64', lseeksize=8
    alignbytes=8, prototype=define
  Linker and Libraries:
    ld='link', ldflags ='-nologo -nodefaultlib -debug -opt:ref,icf
-libpath:"C:\Perl\lib\CORE"  -machine:x86'
    libpth=D:\PROGRA~1\MICROS~3\VC98\lib
    libs=  oldnames.lib kernel32.lib user32.lib gdi32.lib winspool.lib
 comdlg32.lib advapi32.lib shell32.lib ole32.lib oleaut32.lib
netapi32.lib uui
d.lib ws2_32.lib mpr.lib winmm.lib  version.lib odbc32.lib
odbccp32.lib msvcrt.lib
    perllibs=  oldnames.lib kernel32.lib user32.lib gdi32.lib
winspool.lib  comdlg32.lib advapi32.lib shell32.lib ole32.lib
oleaut32.lib  netapi32.lib
 uuid.lib ws2_32.lib mpr.lib winmm.lib  version.lib odbc32.lib
odbccp32.lib msvcrt.lib
    libc=msvcrt.lib, so=dll, useshrplib=true, libperl=perl510.lib
    gnulibc_version=''
  Dynamic Linking:
    dlsrc=dl_win32.xs, dlext=dll, d_dlsymun=undef, ccdlflags=' '
    cccdlflags=' ', lddlflags='-dll -nologo -nodefaultlib -debug
-opt:ref,icf  -libpath:"C:\Perl\lib\CORE"  -machine:x86'


Characteristics of this binary (from libperl):
  Compile-time options: MULTIPLICITY PERL_DONT_CREATE_GVSV
                        PERL_IMPLICIT_CONTEXT PERL_IMPLICIT_SYS
                        PERL_MALLOC_WRAP PL_OP_SLAB_ALLOC USE_ITHREADS
                        USE_LARGE_FILES USE_PERLIO
  Built under MSWin32
  Compiled at Mar 25 2008 13:51:44
  @INC:
    c:/perl/lib
    c:/perl/site/lib
    .

C:\test>



using VC6 for everything.  make was OK, but make test wasn't.  We got
the following
errors (and had apache crashes in there, too):


Microsoft (R) Program Maintenance Utility   Version 6.00.8168.0
Copyright (C) Microsoft Corp 1988-1998. All rights reserved.


Microsoft (R) Program Maintenance Utility   Version 6.00.8168.0
Copyright (C) Microsoft Corp 1988-1998. All rights reserved.

[Mon Apr 07 09:34:16 2008] [info] 6 Apache2:: modules loaded
[Mon Apr 07 09:34:16 2008] [info] 0 APR:: modules loaded
[Mon Apr 07 09:34:16 2008] [info] base server + 29 vhosts ready to run tests
APR::Finfo::stat: (70008) Partial results are valid but processing is
incomplete at D:\perl\src\mod_perl-2.0.4-rc1\t\lib/TestAPRlib/finfo.pm
line 41#
Failed test 2 in t\hooks\trans.t at line 24
# Failed test 3 in t\hooks\trans.t at line 26
request has failed (the response code was: 500)
see t/logs/error_log for more details
# Failed test 1 in t\modules\cgi.t at line 29
# Failed test 2 in t\modules\cgi.t at line 35
# Failed test 3 in t\modules\cgi.t at line 43
# Failed test 4 in t\modules\cgi.t at line 52
# Failed test 5 in t\modules\cgi.t at line 60
# Failed test 1 in t\modules\cgi2.t at line 29
# Failed test 2 in t\modules\cgi2.t at line 35
# Failed test 3 in t\modules\cgi2.t at line 43
# Failed test 4 in t\modules\cgi2.t at line 52
# Failed test 5 in t\modules\cgi2.t at line 60
request has failed (the response code was: 500)
see t/logs/error_log for more details
request has failed (the response code was: 500)
see t/logs/error_log for more details
# Failed test 1 in t\modules\cgiupload.t at line 36
# Failed test 2 in t\modules\cgiupload.t at line 36 fail #2
# Failed test 1 in t\modules\cgiupload2.t at line 36
# Failed test 2 in t\modules\cgiupload2.t at line 36 fail #2
# Failed test 1 in t\modules\include.t at line 26
# Failed test 3 in t\modules\include.t at line 33
# Failed test 4 in t\modules\include.t at line 33 fail #2
# Failed test 5 in t\modules\include.t at line 33 fail #3
# Failed test 6 in t\modules\include.t at line 33 fail #4
# Failed test 1 in t\modules\include2.t at line 23
# Failed test 3 in t\modules\include2.t at line 30
# Failed test 4 in t\modules\include2.t at line 30 fail #2
request has failed (the response code was: 500)
see t/logs/error_log for more details
request has failed (the response code was: 500)
see t/logs/error_log for more details
request has failed (the response code was: 500)
see t/logs/error_log for more details
request has failed (the response code was: 500)
see t/logs/error_log for more details
request has failed (the response code was: 500)
see t/logs/error_log for more details
# Failed test 2 in t\protocol\echo_bbs.t at line 19
# Failed test 3 in t\protocol\echo_bbs.t at line 19 fail #2
# Failed test 4 in t\protocol\echo_bbs.t at line 19 fail #3
# Failed test 2 in t\protocol\echo_bbs2.t at line 19
# Failed test 3 in t\protocol\echo_bbs2.t at line 19 fail #2
# Failed test 2 in t\protocol\echo_block.t at line 22
# Failed test 3 in t\protocol\echo_block.t at line 22 fail #2
# Failed test 2 in t\protocol\echo_filter.t at line 22
# Failed test 3 in t\protocol\echo_filter.t at line 22 fail #2
# Failed test 2 in t\protocol\echo_nonblock.t at line 20
# Failed test 3 in t\protocol\echo_nonblock.t at line 27
# Failed test 2 in t\protocol\echo_timeout.t at line 19
# Failed test 3 in t\protocol\echo_timeout.t at line 19 fail #2
# Failed test 4 in t\protocol\echo_timeout.t at line 19 fail #3
# Failed test 5 in t\protocol\echo_timeout.t at line 19 fail #4
# Failed test 2 in t\protocol\pseudo_http.t at line 54
# Failed test 3 in t\protocol\pseudo_http.t at line 56
# Failed test 4 in t\protocol\pseudo_http.t at line 61
# Failed test 5 in t\protocol\pseudo_http.t at line 67
# Failed test 6 in t\protocol\pseudo_http.t at line 69
# Failed test 7 in t\protocol\pseudo_http.t at line 74
# Failed test 8 in t\protocol\pseudo_http.t at line 79
# Failed test 10 in t\protocol\pseudo_http.t at line 108
# Failed test 11 in t\protocol\pseudo_http.t at line 110
# Failed test 12 in t\protocol\pseudo_http.t at line 115
# Failed test 13 in t\protocol\pseudo_http.t at line 121
request has failed (the response code was: 500)
see t/logs/error_log for more details
server side has failed (response code: 500),
see t/logs/error_log for more details
request has failed (the response code was: 500)
see t/logs/error_log for more details
[warning] server localhost:8529 shutdown
[  error] error running tests (please examine t\logs\error_log)
NMAKE : fatal error U1077: 'C:\perl\bin\perl.exe' : return code '0x1'
Stop.

------------------------------------

	cd "src/modules/perl" && nmake
	cd "xs\APR\aprext" && nmake all -nologo PERL="C:\Perl\bin\perl.exe"
DEFINE="-DMP_HAVE_APR_LIBS" LINKTYPE="static"
	nmake -f Makefile all -nologo PERL="C:\Perl\bin\perl.exe"
DEFINE="-DMP_HAVE_APR_LIBS"
	cd ..
	nmake -f Makefile all -nologo PERL="C:\Perl\bin\perl.exe"
DEFINE="-DMP_HAVE_APR_LIBS"
	cd ..
	nmake -f Makefile all -nologo PERL="C:\Perl\bin\perl.exe"
DEFINE="-DMP_HAVE_APR_LIBS"
	nmake -f Makefile all -nologo
	nmake -f Makefile all -nologo
	cd ..
	nmake -f Makefile all -nologo
	cd ..
	nmake -f Makefile all -nologo
	cd ..
	nmake -f Makefile all -nologo
	cd ..
	nmake -f Makefile all -nologo
	cd ..
	nmake -f Makefile all -nologo
	cd ..
	nmake -f Makefile all -nologo
	cd ..
	nmake -f Makefile all -nologo
	cd ..
	nmake -f Makefile all -nologo
	cd ..
	nmake -f Makefile all -nologo
	cd ..
	nmake -f Makefile all -nologo
	cd ..
	nmake -f Makefile all -nologo
	cd ..
	nmake -f Makefile all -nologo
	cd ..
	nmake -f Makefile all -nologo
	cd ..
	nmake -f Makefile all -nologo
	cd ..
	nmake -f Makefile all -nologo
	cd ..
	nmake -f Makefile all -nologo
	cd ..
	nmake -f Makefile all -nologo
	cd ..
	nmake -f Makefile all -nologo
	cd ..
	nmake -f Makefile all -nologo
	cd ..
	nmake -f Makefile all -nologo
	cd ..
	cd ..
	nmake -f Makefile all -nologo
	nmake -f Makefile all -nologo
	cd ..
	nmake -f Makefile all -nologo
	cd ..
	nmake -f Makefile all -nologo
	cd ..
	nmake -f Makefile all -nologo
	cd ..
	nmake -f Makefile all -nologo
	cd ..
	nmake -f Makefile all -nologo
	cd ..
	nmake -f Makefile all -nologo
	cd ..
	nmake -f Makefile all -nologo
	cd ..
	nmake -f Makefile all -nologo
	cd ..
	nmake -f Makefile all -nologo
	cd ..
	nmake -f Makefile all -nologo
	cd ..
	nmake -f Makefile all -nologo
	cd ..
	nmake -f Makefile all -nologo
	cd ..
	nmake -f Makefile all -nologo
	cd ..
	nmake -f Makefile all -nologo
	cd ..
	nmake -f Makefile all -nologo
	cd ..
	nmake -f Makefile all -nologo
	cd ..
	nmake -f Makefile all -nologo
	cd ..
	nmake -f Makefile all -nologo
	cd ..
	nmake -f Makefile all -nologo
	cd ..
	nmake -f Makefile all -nologo
	cd ..
	nmake -f Makefile all -nologo
	cd ..
	nmake -f Makefile all -nologo
	cd ..
	cd ..
	nmake -f Makefile all -nologo
	nmake -f Makefile all -nologo
	cd ..
	nmake -f Makefile all -nologo
	cd ..
	cd ..
	cd ..
	nmake -f Makefile all -nologo PERL="C:\Perl\bin\perl.exe"
DEFINE="-DMP_HAVE_APR_LIBS"
	nmake -f Makefile all -nologo
	nmake -f Makefile all -nologo
	cd ..
	nmake -f Makefile all -nologo
	cd ..
	nmake -f Makefile all -nologo
	cd ..
	nmake -f Makefile all -nologo
	cd ..
	cd ..
	nmake -f Makefile all -nologo
	nmake -f Makefile all -nologo
	cd ..
	cd ..
	nmake -f Makefile all -nologo
	nmake -f Makefile all -nologo
	cd ..
	cd ..
	cd ..
	C:\Perl\bin\perl.exe -MExtUtils::Command -e cp bin/mp2bug blib\script\mp2bug
	pl2bat.bat blib\script\mp2bug
	C:\perl\bin\perl.exe -Iblib\arch -Iblib\lib  t/TEST -clean
	  C:\perl\bin\perl.exe -Iblib\arch -Iblib\lib  t/TEST -bugreport -verbose=0
C:\Apache2\bin\httpd.exe  -d D:/perl/src/mod_perl-2.0.4-rc1/t -f
D:/perl/src/mod_perl-2.0.4-rc1/t/conf/httpd.conf -D APACHE2 -D
PERL_USEITHREADS
using Apache/2.2.8 (winnt MPM)

waiting 300 seconds for server to start: ....
waiting 300 seconds for server to start: ok (waited 3 secs)
server localhost:8529 started
server localhost:8530 listening (filter_out_apache)
server localhost:8531 listening (perlsections)
server localhost:8532 listening (inherit)
server localhost:8533 listening (TestModperl::merge)
server localhost:8534 listening (TestModperl::perl_options)
server localhost:8535 listening (TestModperl::perl_options2)
server localhost:8536 listening (TestModperl::setupenv)
server localhost:8537 listening (TestModules::proxy)
server localhost:8538 listening (TestUser::rewrite)
server localhost:8539 listening (TestVhost::config)
server localhost:8540 listening (TestVhost::log)
server localhost:8541 listening (TestProtocol::echo_bbs)
server localhost:8542 listening (TestProtocol::echo_bbs2)
server localhost:8543 listening (TestProtocol::echo_block)
server localhost:8544 listening (TestProtocol::echo_filter)
server localhost:8545 listening (TestProtocol::echo_nonblock)
server localhost:8546 listening (TestProtocol::echo_timeout)
server localhost:8547 listening (TestProtocol::pseudo_http)
server localhost:8548 listening (TestPreConnection::note)
server localhost:8549 listening (TestHooks::hookrun)
server localhost:8550 listening (TestHooks::init)
server localhost:8551 listening (TestHooks::stacked_handlers2)
server localhost:8552 listening (TestHooks::startup)
server localhost:8553 listening (TestHooks::trans)
server localhost:8554 listening (TestFilter::both_str_con_add)
server localhost:8555 listening (TestFilter::in_bbs_inject_header)
server localhost:8556 listening (TestFilter::in_bbs_msg)
server localhost:8557 listening (TestFilter::in_str_msg)
server localhost:8558 listening (TestDirective::perlmodule)
server localhost:8559 listening (TestDirective::perlrequire)
server localhost:8560 listening (TestAPI::add_config)
server localhost:8561 listening (TestDirective::perlloadmodule3)
server localhost:8562 listening (TestDirective::perlloadmodule4)
server localhost:8563 listening (TestDirective::perlloadmodule5)
server localhost:8564 listening (TestDirective::perlloadmodule6)
server localhost:8565 listening (TestHooks::push_handlers_anon)
t\apache\add_config.....................ok
t\apache\cgihandler.....................ok
t\apache\conftree.......................ok
t\apache\constants......................ok
t\apache\content_length_header..........ok
t\apache\daemon.........................ok
t\apache\discard_rbody..................ok
t\apache\post...........................ok
t\apache\read...........................ok
t\apache\read2..........................ok
t\apache\scanhdrs.......................ok
t\apache\scanhdrs2......................ok
t\apache\send_cgi_header................ok
t\apache\subprocess.....................ok
t\apache\util...........................ok
t\apache\write..........................ok
t\api\access............................ok
t\api\access2...........................ok
t\api\add_config........................ok
t\api\aplog.............................ok
t\api\command...........................ok
t\api\conn_rec..........................ok
t\api\conn_util.........................ok
t\api\content_encoding..................ok
t\api\custom_response...................ok
t\api\err_headers_out...................ok
t\api\in_out_filters....................ok
t\api\internal_redirect.................ok
t\api\internal_redirect_handler.........ok
t\api\lookup_misc.......................ok
t\api\lookup_uri........................ok
t\api\lookup_uri2.......................ok
t\api\module............................ok
t\api\process...........................ok
t\api\query.............................ok
t\api\request_rec.......................FAILED tests 44-55
	Failed 12/55 tests, 78.18% okay
t\api\request_subclass..................ok
t\api\request_util......................ok
t\api\response..........................ok
t\api\rflush............................ok
t\api\sendfile..........................ok
t\api\server_const......................ok
t\api\server_rec........................ok
t\api\server_util.......................ok
t\api\show..............................ok
t\api\slurp_filename....................ok
t\api\status............................ok
t\api\sub_request.......................ok
t\api\uri...............................ok
t\apr-ext\base64........................ok
t\apr-ext\brigade.......................ok
t\apr-ext\bucket........................ok
t\apr-ext\date..........................ok
t\apr-ext\error.........................ok
t\apr-ext\finfo.........................dubious
	Test returned status 2 (wstat 512, 0x200)
DIED. FAILED tests 1-27
	Failed 27/27 tests, 0.00% okay
t\apr-ext\os............................ok
t\apr-ext\pool..........................ok
t\apr-ext\status........................ok
t\apr-ext\string........................ok
t\apr-ext\table.........................ok
t\apr-ext\threadmutex...................ok
t\apr-ext\threadrwlock..................ok
t\apr-ext\uri...........................ok
t\apr-ext\util..........................ok
t\apr-ext\uuid..........................ok
t\apr\base64............................ok
t\apr\brigade...........................ok
t\apr\bucket............................ok
t\apr\constants.........................ok
t\apr\date..............................ok
t\apr\finfo.............................FAILED tests 2-28
	Failed 27/28 tests, 3.57% okay
t\apr\flatten...........................ok
t\apr\ipsubnet..........................ok
t\apr\os................................ok
t\apr\perlio............................ok
t\apr\pool..............................ok
t\apr\pool_lifetime.....................ok
t\apr\sockaddr..........................ok
t\apr\socket............................ok
t\apr\status............................ok
t\apr\string............................ok
t\apr\table.............................ok
t\apr\threadmutex.......................ok
t\apr\threadrwlock......................ok
t\apr\uri...............................ok
t\apr\util..............................ok
t\apr\uuid..............................ok
t\compat\apache.........................ok
t\compat\apache_file....................ok
t\compat\apache_module..................ok
t\compat\apache_table...................ok
t\compat\apache_uri.....................ok
t\compat\apache_util....................ok
t\compat\conn_authen....................ok
t\compat\conn_rec.......................ok
t\compat\request........................FAILED tests 13-22
	Failed 10/22 tests, 54.55% okay
t\compat\request_body...................ok
t\compat\send_fd........................ok
t\directive\cmdparms....................ok
t\directive\env.........................ok
t\directive\perl........................ok
t\directive\perldo......................ok
t\directive\perlloadmodule..............ok
t\directive\perlloadmodule2.............ok
t\directive\perlloadmodule3.............ok
t\directive\perlloadmodule4.............ok
t\directive\perlloadmodule5.............ok
t\directive\perlloadmodule6.............ok
t\directive\perlloadmodule7.............ok
t\directive\perlmodule..................ok
t\directive\perlrequire.................ok
t\directive\pod.........................ok
t\directive\setupenv....................ok
t\error\api.............................ok
t\error\runtime.........................ok
t\error\syntax..........................ok
t\filter\both_str_con_add...............ok
t\filter\both_str_native_remove.........skipped
        all skipped: cannot find module 'deflate'
t\filter\both_str_req_add...............ok
t\filter\both_str_req_mix...............skipped
        all skipped: cannot find module 'deflate'
t\filter\both_str_req_proxy.............skipped
        all skipped: cannot find module 'mod_proxy', cannot find
module 'proxy_http.c'
t\filter\in_autoload....................ok
t\filter\in_bbs_body....................ok
t\filter\in_bbs_consume.................ok
t\filter\in_bbs_inject_header...........ok
t\filter\in_bbs_msg.....................ok
t\filter\in_bbs_underrun................ok
t\filter\in_error.......................ok
t\filter\in_init_basic..................ok
t\filter\in_str_bin_data................ok
t\filter\in_str_consume.................ok
t\filter\in_str_declined................ok
t\filter\in_str_declined_read...........ok
t\filter\in_str_lc......................ok
t\filter\in_str_msg.....................ok
t\filter\in_str_sandwich................ok
t\filter\out_apache.....................ok
t\filter\out_bbs_basic..................ok
t\filter\out_bbs_ctx....................ok
t\filter\out_bbs_filebucket.............ok
t\filter\out_init_basic.................ok
t\filter\out_str_api....................ok
t\filter\out_str_buffer.................ok
t\filter\out_str_ctx....................ok
t\filter\out_str_declined...............ok
t\filter\out_str_eval...................ok
t\filter\out_str_lc.....................ok
t\filter\out_str_remove.................ok
t\filter\out_str_req_eos................ok
t\filter\out_str_req_mix................ok
t\filter\out_str_reverse................ok
t\filter\out_str_subreq_default.........ok
t\filter\out_str_subreq_modperl.........ok
t\filter\with_subrequest................ok
t\hooks\access..........................ok
t\hooks\authen_basic....................ok
t\hooks\authen_digest...................ok
t\hooks\authz...........................ok
t\hooks\cleanup.........................# writing file:
D:\perl\src\mod_perl-2.0.4-rc1\t\htdocs\hooks\cleanup
ok
t\hooks\cleanup2........................# writing file:
D:\perl\src\mod_perl-2.0.4-rc1\t\htdocs\hooks\cleanup2
ok
t\hooks\error...........................ok
t\hooks\fixup...........................ok
t\hooks\headerparser....................ok
t\hooks\hookrun.........................1..9
# Running under perl version 5.010000 for MSWin32
# Current time local: Mon Apr  7 09:34:17 2008
# Current time GMT:   Mon Apr  7 06:34:17 2008
# Using Test.pm version 1.25
# Using Apache/Test.pm version 1.31
ok
t\hooks\init............................ok
t\hooks\inlined_handlers................ok
t\hooks\push_handlers...................ok
t\hooks\push_handlers_anon..............ok
t\hooks\push_handlers_blessed...........ok
t\hooks\push_handlers_same_phase........ok
t\hooks\set_handlers....................ok
t\hooks\stacked_handlers................ok
t\hooks\stacked_handlers2...............ok
t\hooks\startup.........................ok
t\hooks\trans...........................FAILED tests 2-3
	Failed 2/3 tests, 33.33% okay
t\modperl\cookie........................ok
t\modperl\cookie2.......................ok
t\modperl\current_callback..............ok
t\modperl\dir_config....................ok
t\modperl\endav.........................ok
t\modperl\env...........................ok
        1/65 skipped: various reasons
t\modperl\exit..........................ok
t\modperl\getc..........................ok
t\modperl\io_nested_with_closed_stds....ok
t\modperl\io_with_closed_stds...........ok
t\modperl\local_env.....................skipped
        all skipped: local %ENV is still broken
t\modperl\merge.........................ok
t\modperl\merge2........................ok
t\modperl\merge3........................ok
t\modperl\method........................ok
t\modperl\methodname....................ok
t\modperl\methodobj.....................ok
t\modperl\perl..........................ok
t\modperl\perl_options..................ok
t\modperl\perl_options2.................skipped
        all skipped: PerlOptions None is broken
t\modperl\pnotes........................ok
t\modperl\pnotes2.......................ok
t\modperl\post_utf8.....................ok
t\modperl\print.........................ok
t\modperl\print_utf8....................ok
t\modperl\print_utf8_2..................ok
t\modperl\printf........................ok
t\modperl\readline......................ok
t\modperl\request_rec_perlio_api........ok
t\modperl\request_rec_tie_api...........skipped
        all skipped: perl 5.010000: PerlIO is used instead of TIEd IO
t\modperl\setauth.......................ok
t\modperl\setupenv......................ok
t\modperl\setupenv2.....................ok
t\modperl\status........................ok
t\modperl\subenv........................ok
t\modperl\taint.........................ok
t\modperl\util..........................ok
t\modules\apache_resource...............skipped
        all skipped: cannot find module 'BSD::Resource'
t\modules\apache_status.................dubious
	Test returned status 9 (wstat 2304, 0x900)
DIED. FAILED tests 9-15
	Failed 7/15 tests, 53.33% okay
t\modules\cgi...........................FAILED tests 1-5
	Failed 5/5 tests, 0.00% okay
t\modules\cgi2..........................FAILED tests 1-5
	Failed 5/5 tests, 0.00% okay
t\modules\cgipost.......................dubious
	Test returned status 9 (wstat 2304, 0x900)
DIED. FAILED tests 1-6
	Failed 6/6 tests, 0.00% okay
t\modules\cgipost2......................dubious
	Test returned status 9 (wstat 2304, 0x900)
DIED. FAILED tests 1-6
	Failed 6/6 tests, 0.00% okay
t\modules\cgiupload.....................FAILED tests 1-2
	Failed 2/2 tests, 0.00% okay
t\modules\cgiupload2....................FAILED tests 1-2
	Failed 2/2 tests, 0.00% okay
t\modules\include.......................FAILED tests 1, 3-6
	Failed 5/6 tests, 16.67% okay
t\modules\include2......................FAILED tests 1, 3-4
	Failed 3/4 tests, 25.00% okay
t\modules\include_subreq................dubious
	Test returned status 9 (wstat 2304, 0x900)
DIED. FAILED test 1
	Failed 1/1 tests, 0.00% okay
t\modules\proxy.........................skipped
        all skipped: cannot find module 'mod_proxy', cannot find
module 'proxy_http.c'
t\perl\api..............................dubious
	Test returned status 9 (wstat 2304, 0x900)
t\perl\hash_attack......................dubious
	Test returned status 9 (wstat 2304, 0x900)
DIED. FAILED test 1
	Failed 1/1 tests, 0.00% okay
t\perl\signals..........................dubious
	Test returned status 9 (wstat 2304, 0x900)
t\preconnection\note....................dubious
	Test returned status 9 (wstat 2304, 0x900)
DIED. FAILED test 1
	Failed 1/1 tests, 0.00% okay
t\protocol\echo_bbs.....................FAILED tests 2-4
	Failed 3/4 tests, 25.00% okay
t\protocol\echo_bbs2....................FAILED tests 2-3
	Failed 2/3 tests, 33.33% okay
t\protocol\echo_block...................FAILED tests 2-3
	Failed 2/3 tests, 33.33% okay
t\protocol\echo_filter..................FAILED tests 2-3
	Failed 2/3 tests, 33.33% okay
t\protocol\echo_nonblock................FAILED tests 2-3
	Failed 2/3 tests, 33.33% okay
t\protocol\echo_timeout.................FAILED tests 2-5
	Failed 4/5 tests, 20.00% okay
t\protocol\pseudo_http..................FAILED tests 2-8, 10-13
	Failed 11/13 tests, 15.38% okay
t\user\rewrite..........................dubious
	Test returned status 9 (wstat 2304, 0x900)
t\vhost\config..........................dubious
	Test returned status 9 (wstat 2304, 0x900)
t\vhost\log.............................dubious
	Test returned status 9 (wstat 2304, 0x900)
Failed Test                Stat Wstat Total Fail  List of Failed
-------------------------------------------------------------------------------
t\api\request_rec.t                      55   12  44-55
t\apr-ext\finfo.t             2   512    27   54  1-27
t\apr\finfo.t                            28   27  2-28
t\compat\request.t                       22   10  13-22
t\hooks\trans.t                           3    2  2-3
t\modules\apache_status.t     9  2304    15   14  9-15
t\modules\cgi.t                           5    5  1-5
t\modules\cgi2.t                          5    5  1-5
t\modules\cgipost.t           9  2304     6   12  1-6
t\modules\cgipost2.t          9  2304     6   12  1-6
t\modules\cgiupload.t                     2    2  1-2
t\modules\cgiupload2.t                    2    2  1-2
t\modules\include.t                       6    5  1 3-6
t\modules\include2.t                      4    3  1 3-4
t\modules\include_subreq.t    9  2304     1    2  1
t\perl\api.t                  9  2304    ??   ??  ??
t\perl\hash_attack.t          9  2304     1    2  1
t\perl\signals.t              9  2304    ??   ??  ??
t\preconnection\note.t        9  2304     1    2  1
t\protocol\echo_bbs.t                     4    3  2-4
t\protocol\echo_bbs2.t                    3    2  2-3
t\protocol\echo_block.t                   3    2  2-3
t\protocol\echo_filter.t                  3    2  2-3
t\protocol\echo_nonblock.t                3    2  2-3
t\protocol\echo_timeout.t                 5    4  2-5
t\protocol\pseudo_http.t                 13   11  2-8 10-13
t\user\rewrite.t              9  2304    ??   ??  ??
t\vhost\config.t              9  2304    ??   ??  ??
t\vhost\log.t                 9  2304    ??   ??  ??
8 tests and 1 subtest skipped.
Failed 29/238 test scripts. 148/2391 subtests failed.
Files=238, Tests=2391, 208 wallclock secs ( 0.00 cusr +  0.00 csys =  0.00 CPU)
Failed 29/238 test programs. 148/2391 subtests failed.
+--------------------------------------------------------+
| Please file a bug report: http://perl.apache.org/bugs/ |
+--------------------------------------------------------+

---------------------------------------------------------------------
To unsubscribe, e-mail: dev-unsubscribe@perl.apache.org
For additional commands, e-mail: dev-help@perl.apache.org


Mime
View raw message