perl-dev mailing list archives

Site index · List index
Message view « Date » · « Thread »
Top « Date » · « Thread »
From Dave Rolsky <auta...@urth.org>
Subject Re: method handlers broken in latest CVS?
Date Sat, 18 May 2002 19:17:04 GMT
On Sat, 18 May 2002, Doug MacEachern wrote:

> what about 'make test' ?

I actually hadn't run that yet, in my zeal to play with Mason & mod_perl 2
;)

But they pretty much all fail.

waiting for server to start: ok (waited 2 secs)
server localhost:8529 started
server localhost:8530 listening (TestDirective::perlmodule)
server localhost:8531 listening (TestDirective::perlrequire)
server localhost:8532 listening (TestProtocol::eliza)
server localhost:8533 listening (TestProtocol::echo)
server localhost:8534 listening (TestProtocol::echo_filter)
server localhost:8535 listening (TestFilter::input_msg)
apache/cgihandler........FAILED tests 1-2
	Failed 2/2 tests, 0.00% okay
apache/compat............FAILED tests 1-3
	Failed 3/3 tests, 0.00% okay
apache/compat2...........FAILED before any test output arrived
apache/conftree..........FAILED before any test output arrived
apache/constants.........ok
apache/post..............FAILED tests 1-2
	Failed 2/2 tests, 0.00% okay
apache/read..............dubious
	Test returned status 0 (wstat 13, 0xd)
DIED. FAILED test 1
	Failed 1/1 tests, 0.00% okay
apache/scanhdrs..........NOK 1Use of uninitialized value in string eq at
apache/scanhdrs.t line 16.
apache/scanhdrs..........dubious
	Test returned status 9 (wstat 2304, 0x900)
DIED. FAILED tests 1-4
	Failed 4/4 tests, 0.00% okay
apache/subprocess........FAILED before any test output arrived
apache/write.............FAILED before any test output arrived
api/access...............FAILED before any test output arrived
api/aplog................FAILED before any test output arrived
api/conn_rec.............FAILED before any test output arrived
api/lookup_uri...........FAILED before any test output arrived
api/lookup_uri2..........FAILED before any test output arrived
api/module...............FAILED before any test output arrived
api/r_subclass...........FAILED before any test output arrived
api/request_rec..........FAILED before any test output arrived
api/response.............FAILED before any test output arrived
api/rutil................FAILED before any test output arrived
api/send_fd..............FAILED tests 1-3
	Failed 3/3 tests, 0.00% okay
api/sendfile.............FAILED tests 1-3
	Failed 3/3 tests, 0.00% okay
api/server_rec...........FAILED before any test output arrived
api/server_util..........FAILED before any test output arrived
api/uri..................FAILED before any test output arrived
apr/base64...............FAILED before any test output arrived
apr/constants............ok
apr/date.................FAILED before any test output arrived
apr/netlib...............FAILED before any test output arrived
apr/perlio...............FAILED before any test output arrived
apr/pool.................FAILED before any test output arrived
apr/string...............FAILED before any test output arrived
apr/table................FAILED before any test output arrived
apr/util.................FAILED before any test output arrived
apr/uuid.................FAILED before any test output arrived
directive/env............FAILED before any test output arrived
directive/perlmodule.....FAILED test 1
	Failed 1/1 tests, 0.00% okay
directive/perlrequire....FAILED test 1
	Failed 1/1 tests, 0.00% okay
directive/setupenv.......FAILED tests 1-2
	Failed 2/3 tests, 33.33% okay
filter/api...............FAILED before any test output arrived
filter/buckets...........FAILED before any test output arrived
filter/input_body........FAILED tests 1-2
	Failed 2/2 tests, 0.00% okay
filter/input_msg.........FAILED before any test output arrived
filter/lc................ok
filter/reverse...........FAILED before any test output arrived
hooks/access.............FAILED tests 2-3
	Failed 2/4 tests, 50.00% okay
hooks/authen.............FAILED tests 2-3
	Failed 2/4 tests, 50.00% okay
hooks/authz..............FAILED tests 2-3
	Failed 2/4 tests, 50.00% okay
hooks/fixup..............FAILED before any test output arrived
hooks/headerparser.......FAILED before any test output arrived
hooks/init...............FAILED before any test output arrived
hooks/trans..............FAILED tests 1-3
	Failed 3/3 tests, 0.00% okay
modperl/dir_config.......FAILED before any test output arrived
modperl/endav............FAILED before any test output arrived
modperl/env..............FAILED before any test output arrived
modperl/exit.............FAILED before any test output arrived
modperl/getc.............FAILED tests 1-2
	Failed 2/2 tests, 0.00% okay
modperl/method...........FAILED before any test output arrived
modperl/methodname.......FAILED before any test output arrived
modperl/methodobj........FAILED before any test output arrived
modperl/pnotes...........FAILED before any test output arrived
modperl/print............FAILED before any test output arrived
modperl/printf...........FAILED before any test output arrived
modperl/readline.........FAILED tests 1-2
	Failed 2/2 tests, 0.00% okay
modperl/sameinterp.......NOK 1must pass an interpreter id to work with at
/home/autarch/modperl-2.0/Apache-Test/lib/Apache/TestRequest.pm line 466.
modperl/sameinterp.......dubious
	Test returned status 9 (wstat 2304, 0x900)
DIED. FAILED tests 1-12
	Failed 12/12 tests, 0.00% okay
modules/cgi..............FAILED tests 1-4
	Failed 4/5 tests, 20.00% okay
modules/cgiupload........FAILED tests 1-2
	Failed 2/2 tests, 0.00% okay
modules/include..........FAILED tests 1-6
	Failed 6/6 tests, 0.00% okay
protocol/echo............ok
protocol/echo_filter.....ok
protocol/eliza...........skipped: cannot find module 'Chatbot::Eliza'
Failed Test             Stat Wstat Total Fail  Failed  List of Failed
-------------------------------------------------------------------------------
apache/cgihandler.t                    2    2 100.00%  1-2
apache/compat.t                        3    3 100.00%  1-3
apache/compat2.t                      ??   ??       %  ??
apache/conftree.t                     ??   ??       %  ??
apache/post.t                          2    2 100.00%  1-2
apache/read.t              0    13     1    1 100.00%  1
apache/scanhdrs.t          9  2304     4    4 100.00%  1-4
apache/subprocess.t                   ??   ??       %  ??
apache/write.t                        ??   ??       %  ??
api/access.t                          ??   ??       %  ??
api/aplog.t                           ??   ??       %  ??
api/conn_rec.t                        ??   ??       %  ??
api/lookup_uri.t                      ??   ??       %  ??
api/lookup_uri2.t                     ??   ??       %  ??
api/module.t                          ??   ??       %  ??
api/r_subclass.t                      ??   ??       %  ??
api/request_rec.t                     ??   ??       %  ??
api/response.t                        ??   ??       %  ??
api/rutil.t                           ??   ??       %  ??
api/send_fd.t                          3    3 100.00%  1-3
api/sendfile.t                         3    3 100.00%  1-3
api/server_rec.t                      ??   ??       %  ??
api/server_util.t                     ??   ??       %  ??
api/uri.t                             ??   ??       %  ??
apr/base64.t                          ??   ??       %  ??
apr/date.t                            ??   ??       %  ??
apr/netlib.t                          ??   ??       %  ??
apr/perlio.t                          ??   ??       %  ??
apr/pool.t                            ??   ??       %  ??
apr/string.t                          ??   ??       %  ??
apr/table.t                           ??   ??       %  ??
apr/util.t                            ??   ??       %  ??
apr/uuid.t                            ??   ??       %  ??
directive/env.t                       ??   ??       %  ??
directive/perlmodule.t                 1    1 100.00%  1
directive/perlrequire.t                1    1 100.00%  1
directive/setupenv.t                   3    2  66.67%  1-2
filter/api.t                          ??   ??       %  ??
filter/buckets.t                      ??   ??       %  ??
filter/input_body.t                    2    2 100.00%  1-2
filter/input_msg.t                    ??   ??       %  ??
filter/reverse.t                      ??   ??       %  ??
hooks/access.t                         4    2  50.00%  2-3
hooks/authen.t                         4    2  50.00%  2-3
hooks/authz.t                          4    2  50.00%  2-3
hooks/fixup.t                         ??   ??       %  ??
hooks/headerparser.t                  ??   ??       %  ??
hooks/init.t                          ??   ??       %  ??
hooks/trans.t                          3    3 100.00%  1-3
modperl/dir_config.t                  ??   ??       %  ??
modperl/endav.t                       ??   ??       %  ??
modperl/env.t                         ??   ??       %  ??
modperl/exit.t                        ??   ??       %  ??
modperl/getc.t                         2    2 100.00%  1-2
modperl/method.t                      ??   ??       %  ??
modperl/methodname.t                  ??   ??       %  ??
modperl/methodobj.t                   ??   ??       %  ??
modperl/pnotes.t                      ??   ??       %  ??
Failed Test             Stat Wstat Total Fail  Failed  List of Failed
-------------------------------------------------------------------------------
modperl/print.t                       ??   ??       %  ??
modperl/printf.t                      ??   ??       %  ??
modperl/readline.t                     2    2 100.00%  1-2
modperl/sameinterp.t       9  2304    12   12 100.00%  1-12
modules/cgi.t                          5    4  80.00%  1-4
modules/cgiupload.t                    2    2 100.00%  1-2
modules/include.t                      6    6 100.00%  1-6
1 test skipped.
*** : server localhost:8529 shutdown
!!! : error running tests (please examine t/logs/error_log)
!!! : oh darn, server dumped core
!!! : for stacktrace, run: gdb /usr/local/apache2/bin/httpd -core
/home/autarch/modperl-2.0/t/coremake: *** [run_tests] Error 1

The logs have a bunch of segfaults

> my first guess is that this is largefiles related.  but normally if lfs is
> the problem, modperl will blow up before it has a chance to call into perl.
> but it could be that lfs flags are not getting stripped (or added back in
> somehow) when building the extension .so's.  does this turn up anything?
> % grep LARGEFILE WrapXS/Apache/RequestRec/Makefile

CCFLAGS = -DDEBIAN -fno-strict-aliasing -I/usr/local/include -D_LARGEFILE_SOURCE -D_FILE_OFFSET_BITS=64


-dave

/*==================
www.urth.org
we await the New Sun
==================*/


---------------------------------------------------------------------
To unsubscribe, e-mail: dev-unsubscribe@perl.apache.org
For additional commands, e-mail: dev-help@perl.apache.org


Mime
View raw message