pdfbox-dev mailing list archives

Site index · List index
Message view « Date » · « Thread »
Top « Date » · « Thread »
From Apache Jenkins Server <jenk...@builds.apache.org>
Subject Build failed in Jenkins: PDFBox-2.0.x #1799
Date Thu, 24 Oct 2019 07:07:38 GMT
See <https://builds.apache.org/job/PDFBox-2.0.x/1799/display/redirect>

Changes:


------------------------------------------
[...truncated 804.56 KB...]
[INFO] [checking org.apache.pdfbox.pdmodel.common.function.PDFunctionTypeIdentity]
[INFO] [wrote RegularFileObject[<https://builds.apache.org/job/PDFBox-2.0.x/ws/2.0/pdfbox/target/classes/org/apache/pdfbox/pdmodel/common/function/PDFunctionTypeIdentity.class]]>
[INFO] [checking org.apache.pdfbox.rendering.CIDType0Glyph2D]
[INFO] [wrote RegularFileObject[<https://builds.apache.org/job/PDFBox-2.0.x/ws/2.0/pdfbox/target/classes/org/apache/pdfbox/rendering/CIDType0Glyph2D.class]]>
[INFO] [checking org.apache.pdfbox.contentstream.operator.color.SetNonStrokingDeviceCMYKColor]
[INFO] [wrote RegularFileObject[<https://builds.apache.org/job/PDFBox-2.0.x/ws/2.0/pdfbox/target/classes/org/apache/pdfbox/contentstream/operator/color/SetNonStrokingDeviceCMYKColor.class]]>
[INFO] [checking org.apache.pdfbox.pdmodel.documentinterchange.taggedpdf.PDPrintFieldAttributeObject]
[INFO] [wrote RegularFileObject[<https://builds.apache.org/job/PDFBox-2.0.x/ws/2.0/pdfbox/target/classes/org/apache/pdfbox/pdmodel/documentinterchange/taggedpdf/PDPrintFieldAttributeObject.class]]>
[INFO] [checking org.apache.pdfbox.pdmodel.font.PDType1FontEmbedder]
[INFO] [loading ZipFileIndexFileObject[<https://builds.apache.org/job/PDFBox-2.0.x/ws/2.0/fontbox/target/fontbox-2.0.18-SNAPSHOT.jar(org/apache/fontbox/encoding/BuiltInEncoding.class)]]>
[INFO] [wrote RegularFileObject[<https://builds.apache.org/job/PDFBox-2.0.x/ws/2.0/pdfbox/target/classes/org/apache/pdfbox/pdmodel/font/PDType1FontEmbedder.class]]>
[INFO] [checking org.apache.pdfbox.pdmodel.documentinterchange.taggedpdf.PDArtifactMarkedContent]
[INFO] [wrote RegularFileObject[<https://builds.apache.org/job/PDFBox-2.0.x/ws/2.0/pdfbox/target/classes/org/apache/pdfbox/pdmodel/documentinterchange/taggedpdf/PDArtifactMarkedContent.class]]>
[INFO] [checking org.apache.pdfbox.pdmodel.interactive.form.PlainTextFormatter]
[INFO] [wrote RegularFileObject[<https://builds.apache.org/job/PDFBox-2.0.x/ws/2.0/pdfbox/target/classes/org/apache/pdfbox/pdmodel/interactive/form/PlainTextFormatter$TextAlign.class]]>
[INFO] [wrote RegularFileObject[<https://builds.apache.org/job/PDFBox-2.0.x/ws/2.0/pdfbox/target/classes/org/apache/pdfbox/pdmodel/interactive/form/PlainTextFormatter$Builder.class]]>
[INFO] [wrote RegularFileObject[<https://builds.apache.org/job/PDFBox-2.0.x/ws/2.0/pdfbox/target/classes/org/apache/pdfbox/pdmodel/interactive/form/PlainTextFormatter$1.class]]>
[INFO] [wrote RegularFileObject[<https://builds.apache.org/job/PDFBox-2.0.x/ws/2.0/pdfbox/target/classes/org/apache/pdfbox/pdmodel/interactive/form/PlainTextFormatter.class]]>
[INFO] [checking org.apache.pdfbox.pdmodel.graphics.shading.AxialShadingPaint]
[INFO] [wrote RegularFileObject[<https://builds.apache.org/job/PDFBox-2.0.x/ws/2.0/pdfbox/target/classes/org/apache/pdfbox/pdmodel/graphics/shading/AxialShadingPaint.class]]>
[INFO] [checking org.apache.pdfbox.pdmodel.interactive.action.PDActionImportData]
[INFO] [wrote RegularFileObject[<https://builds.apache.org/job/PDFBox-2.0.x/ws/2.0/pdfbox/target/classes/org/apache/pdfbox/pdmodel/interactive/action/PDActionImportData.class]]>
[INFO] [checking org.apache.pdfbox.contentstream.operator.text.SetTextLeading]
[INFO] [wrote RegularFileObject[<https://builds.apache.org/job/PDFBox-2.0.x/ws/2.0/pdfbox/target/classes/org/apache/pdfbox/contentstream/operator/text/SetTextLeading.class]]>
[INFO] [checking org.apache.pdfbox.contentstream.operator.text.SetTextHorizontalScaling]
[INFO] [wrote RegularFileObject[<https://builds.apache.org/job/PDFBox-2.0.x/ws/2.0/pdfbox/target/classes/org/apache/pdfbox/contentstream/operator/text/SetTextHorizontalScaling.class]]>
[INFO] [checking org.apache.pdfbox.pdmodel.encryption.SaslPrep]
[INFO] [wrote RegularFileObject[<https://builds.apache.org/job/PDFBox-2.0.x/ws/2.0/pdfbox/target/classes/org/apache/pdfbox/pdmodel/encryption/SaslPrep.class]]>
[INFO] [checking org.apache.pdfbox.pdmodel.DefaultResourceCache]
[INFO] [wrote RegularFileObject[<https://builds.apache.org/job/PDFBox-2.0.x/ws/2.0/pdfbox/target/classes/org/apache/pdfbox/pdmodel/DefaultResourceCache.class]]>
[INFO] [checking org.apache.pdfbox.cos.COSOutputStream]
[INFO] [wrote RegularFileObject[<https://builds.apache.org/job/PDFBox-2.0.x/ws/2.0/pdfbox/target/classes/org/apache/pdfbox/cos/COSOutputStream.class]]>
[INFO] [checking org.apache.pdfbox.util.filetypedetector.FileTypeDetector]
[INFO] [wrote RegularFileObject[<https://builds.apache.org/job/PDFBox-2.0.x/ws/2.0/pdfbox/target/classes/org/apache/pdfbox/util/filetypedetector/FileTypeDetector.class]]>
[INFO] [checking org.apache.pdfbox.pdmodel.common.function.type4.InstructionSequenceBuilder]
[INFO] [wrote RegularFileObject[<https://builds.apache.org/job/PDFBox-2.0.x/ws/2.0/pdfbox/target/classes/org/apache/pdfbox/pdmodel/common/function/type4/InstructionSequenceBuilder.class]]>
[INFO] [checking org.apache.pdfbox.pdmodel.common.function.type4.BitwiseOperators]
[INFO] [wrote RegularFileObject[<https://builds.apache.org/job/PDFBox-2.0.x/ws/2.0/pdfbox/target/classes/org/apache/pdfbox/pdmodel/common/function/type4/BitwiseOperators$AbstractLogicalOperator.class]]>
[INFO] [wrote RegularFileObject[<https://builds.apache.org/job/PDFBox-2.0.x/ws/2.0/pdfbox/target/classes/org/apache/pdfbox/pdmodel/common/function/type4/BitwiseOperators$And.class]]>
[INFO] [wrote RegularFileObject[<https://builds.apache.org/job/PDFBox-2.0.x/ws/2.0/pdfbox/target/classes/org/apache/pdfbox/pdmodel/common/function/type4/BitwiseOperators$Bitshift.class]]>
[INFO] [wrote RegularFileObject[<https://builds.apache.org/job/PDFBox-2.0.x/ws/2.0/pdfbox/target/classes/org/apache/pdfbox/pdmodel/common/function/type4/BitwiseOperators$False.class]]>
[INFO] [wrote RegularFileObject[<https://builds.apache.org/job/PDFBox-2.0.x/ws/2.0/pdfbox/target/classes/org/apache/pdfbox/pdmodel/common/function/type4/BitwiseOperators$Not.class]]>
[INFO] [wrote RegularFileObject[<https://builds.apache.org/job/PDFBox-2.0.x/ws/2.0/pdfbox/target/classes/org/apache/pdfbox/pdmodel/common/function/type4/BitwiseOperators$Or.class]]>
[INFO] [wrote RegularFileObject[<https://builds.apache.org/job/PDFBox-2.0.x/ws/2.0/pdfbox/target/classes/org/apache/pdfbox/pdmodel/common/function/type4/BitwiseOperators$True.class]]>
[INFO] [wrote RegularFileObject[<https://builds.apache.org/job/PDFBox-2.0.x/ws/2.0/pdfbox/target/classes/org/apache/pdfbox/pdmodel/common/function/type4/BitwiseOperators$Xor.class]]>
[INFO] [wrote RegularFileObject[<https://builds.apache.org/job/PDFBox-2.0.x/ws/2.0/pdfbox/target/classes/org/apache/pdfbox/pdmodel/common/function/type4/BitwiseOperators$1.class]]>
[INFO] [wrote RegularFileObject[<https://builds.apache.org/job/PDFBox-2.0.x/ws/2.0/pdfbox/target/classes/org/apache/pdfbox/pdmodel/common/function/type4/BitwiseOperators.class]]>
[INFO] [checking org.apache.pdfbox.pdmodel.graphics.blend.BlendComposite]
[INFO] [wrote RegularFileObject[<https://builds.apache.org/job/PDFBox-2.0.x/ws/2.0/pdfbox/target/classes/org/apache/pdfbox/pdmodel/graphics/blend/BlendComposite$BlendCompositeContext.class]]>
[INFO] [wrote RegularFileObject[<https://builds.apache.org/job/PDFBox-2.0.x/ws/2.0/pdfbox/target/classes/org/apache/pdfbox/pdmodel/graphics/blend/BlendComposite.class]]>
[INFO] [checking org.apache.pdfbox.contentstream.operator.text.NextLine]
[INFO] [wrote RegularFileObject[<https://builds.apache.org/job/PDFBox-2.0.x/ws/2.0/pdfbox/target/classes/org/apache/pdfbox/contentstream/operator/text/NextLine.class]]>
[INFO] [checking org.apache.pdfbox.pdmodel.graphics.color.PDLab]
[INFO] [wrote RegularFileObject[<https://builds.apache.org/job/PDFBox-2.0.x/ws/2.0/pdfbox/target/classes/org/apache/pdfbox/pdmodel/graphics/color/PDLab.class]]>
[INFO] [checking org.apache.pdfbox.text.TextPositionComparator]
[INFO] [wrote RegularFileObject[<https://builds.apache.org/job/PDFBox-2.0.x/ws/2.0/pdfbox/target/classes/org/apache/pdfbox/text/TextPositionComparator.class]]>
[INFO] [checking org.apache.pdfbox.pdmodel.documentinterchange.logicalstructure.PDParentTreeValue]
[INFO] [wrote RegularFileObject[<https://builds.apache.org/job/PDFBox-2.0.x/ws/2.0/pdfbox/target/classes/org/apache/pdfbox/pdmodel/documentinterchange/logicalstructure/PDParentTreeValue.class]]>
[INFO] [total 6795ms]
[INFO] 
[INFO] --- download-maven-plugin:1.3.0:wget (PDFBOX-1031-1) @ pdfbox ---
[INFO] 
[INFO] --- download-maven-plugin:1.3.0:wget (PDFBOX-1031-2) @ pdfbox ---
[INFO] 
[INFO] --- download-maven-plugin:1.3.0:wget (PDFBOX-1065-1) @ pdfbox ---
[INFO] 
[INFO] --- download-maven-plugin:1.3.0:wget (PDFBOX-1065-2) @ pdfbox ---
[INFO] 
[INFO] --- download-maven-plugin:1.3.0:wget (PDFBOX-1100-1) @ pdfbox ---
[INFO] 
[INFO] --- download-maven-plugin:1.3.0:wget (PDFBOX-1100-2) @ pdfbox ---
[INFO] 
[INFO] --- download-maven-plugin:1.3.0:wget (PDFBOX-3208) @ pdfbox ---
[INFO] 
[INFO] --- download-maven-plugin:1.3.0:wget (PDFBOX-3656) @ pdfbox ---
[INFO] 
[INFO] --- download-maven-plugin:1.3.0:wget (PDFBOX-3682) @ pdfbox ---
[INFO] 
[INFO] --- download-maven-plugin:1.3.0:wget (PDFBOX-3940) @ pdfbox ---
[INFO] 
[INFO] --- download-maven-plugin:1.3.0:wget (PDFBOX-3783) @ pdfbox ---
[INFO] 
[INFO] --- download-maven-plugin:1.3.0:wget (PDFBOX-3785) @ pdfbox ---
[INFO] 
[INFO] --- download-maven-plugin:1.3.0:wget (PDFBOX-3947) @ pdfbox ---
[INFO] 
[INFO] --- download-maven-plugin:1.3.0:wget (PDFBOX-3948) @ pdfbox ---
[INFO] 
[INFO] --- download-maven-plugin:1.3.0:wget (PDFBOX-3949) @ pdfbox ---
[INFO] 
[INFO] --- download-maven-plugin:1.3.0:wget (PDFBOX-3950) @ pdfbox ---
[INFO] 
[INFO] --- download-maven-plugin:1.3.0:wget (PDFBOX-3951) @ pdfbox ---
[INFO] 
[INFO] --- download-maven-plugin:1.3.0:wget (PDFBOX-3964) @ pdfbox ---
[INFO] 
[INFO] --- download-maven-plugin:1.3.0:wget (PDFBOX-3977) @ pdfbox ---
[INFO] 
[INFO] --- download-maven-plugin:1.3.0:wget (Genko) @ pdfbox ---
[INFO] 
[INFO] --- download-maven-plugin:1.3.0:wget (PDFBOX-3999) @ pdfbox ---
[INFO] 
[INFO] --- download-maven-plugin:1.3.0:wget (PDFBOX-4106) @ pdfbox ---
[WARNING] Could not get content
org.apache.maven.wagon.ResourceDoesNotExistException: File https://ipafont.ipa.go.jp/old/ipafont/ipag00303.php
does not exist
    at org.apache.maven.wagon.providers.http.wagon.shared.AbstractHttpClientWagon.fillInputData
(AbstractHttpClientWagon.java:1152)
    at org.apache.maven.wagon.providers.http.wagon.shared.AbstractHttpClientWagon.fillInputData
(AbstractHttpClientWagon.java:1094)
    at org.apache.maven.wagon.StreamWagon.getInputStream (StreamWagon.java:126)
    at org.apache.maven.wagon.StreamWagon.getIfNewer (StreamWagon.java:88)
    at org.apache.maven.wagon.StreamWagon.get (StreamWagon.java:61)
    at com.googlecode.download.maven.plugin.internal.WGet.doGet (WGet.java:377)
    at com.googlecode.download.maven.plugin.internal.WGet.execute (WGet.java:282)
    at org.apache.maven.plugin.DefaultBuildPluginManager.executeMojo (DefaultBuildPluginManager.java:137)
    at org.apache.maven.lifecycle.internal.MojoExecutor.execute (MojoExecutor.java:210)
    at org.apache.maven.lifecycle.internal.MojoExecutor.execute (MojoExecutor.java:156)
    at org.apache.maven.lifecycle.internal.MojoExecutor.execute (MojoExecutor.java:148)
    at org.apache.maven.lifecycle.internal.LifecycleModuleBuilder.buildProject (LifecycleModuleBuilder.java:117)
    at org.apache.maven.lifecycle.internal.LifecycleModuleBuilder.buildProject (LifecycleModuleBuilder.java:81)
    at org.apache.maven.lifecycle.internal.builder.singlethreaded.SingleThreadedBuilder.build
(SingleThreadedBuilder.java:56)
    at org.apache.maven.lifecycle.internal.LifecycleStarter.execute (LifecycleStarter.java:128)
    at org.apache.maven.DefaultMaven.doExecute (DefaultMaven.java:305)
    at org.apache.maven.DefaultMaven.doExecute (DefaultMaven.java:192)
    at org.apache.maven.DefaultMaven.execute (DefaultMaven.java:105)
    at org.jvnet.hudson.maven3.launcher.Maven35Launcher.main (Maven35Launcher.java:130)
    at sun.reflect.NativeMethodAccessorImpl.invoke0 (Native Method)
    at sun.reflect.NativeMethodAccessorImpl.invoke (NativeMethodAccessorImpl.java:62)
    at sun.reflect.DelegatingMethodAccessorImpl.invoke (DelegatingMethodAccessorImpl.java:43)
    at java.lang.reflect.Method.invoke (Method.java:498)
    at org.codehaus.plexus.classworlds.launcher.Launcher.launchEnhanced (Launcher.java:282)
    at org.codehaus.plexus.classworlds.launcher.Launcher.launch (Launcher.java:225)
    at jenkins.maven3.agent.Maven35Main.launch (Maven35Main.java:178)
    at sun.reflect.NativeMethodAccessorImpl.invoke0 (Native Method)
    at sun.reflect.NativeMethodAccessorImpl.invoke (NativeMethodAccessorImpl.java:62)
    at sun.reflect.DelegatingMethodAccessorImpl.invoke (DelegatingMethodAccessorImpl.java:43)
    at java.lang.reflect.Method.invoke (Method.java:498)
    at hudson.maven.Maven3Builder.call (Maven3Builder.java:139)
    at hudson.maven.Maven3Builder.call (Maven3Builder.java:70)
    at hudson.remoting.UserRequest.perform (UserRequest.java:212)
    at hudson.remoting.UserRequest.perform (UserRequest.java:54)
    at hudson.remoting.Request$2.run (Request.java:369)
    at hudson.remoting.InterceptingExecutorService$1.call (InterceptingExecutorService.java:72)
    at java.util.concurrent.FutureTask.run (FutureTask.java:266)
    at java.util.concurrent.ThreadPoolExecutor.runWorker (ThreadPoolExecutor.java:1149)
    at java.util.concurrent.ThreadPoolExecutor$Worker.run (ThreadPoolExecutor.java:624)
    at java.lang.Thread.run (Thread.java:748)
[WARNING] Retrying (1 more)
[WARNING] Could not get content
org.apache.maven.wagon.ResourceDoesNotExistException: File https://ipafont.ipa.go.jp/old/ipafont/ipag00303.php
does not exist
    at org.apache.maven.wagon.providers.http.wagon.shared.AbstractHttpClientWagon.fillInputData
(AbstractHttpClientWagon.java:1152)
    at org.apache.maven.wagon.providers.http.wagon.shared.AbstractHttpClientWagon.fillInputData
(AbstractHttpClientWagon.java:1094)
    at org.apache.maven.wagon.StreamWagon.getInputStream (StreamWagon.java:126)
    at org.apache.maven.wagon.StreamWagon.getIfNewer (StreamWagon.java:88)
    at org.apache.maven.wagon.StreamWagon.get (StreamWagon.java:61)
    at com.googlecode.download.maven.plugin.internal.WGet.doGet (WGet.java:377)
    at com.googlecode.download.maven.plugin.internal.WGet.execute (WGet.java:282)
    at org.apache.maven.plugin.DefaultBuildPluginManager.executeMojo (DefaultBuildPluginManager.java:137)
    at org.apache.maven.lifecycle.internal.MojoExecutor.execute (MojoExecutor.java:210)
    at org.apache.maven.lifecycle.internal.MojoExecutor.execute (MojoExecutor.java:156)
    at org.apache.maven.lifecycle.internal.MojoExecutor.execute (MojoExecutor.java:148)
    at org.apache.maven.lifecycle.internal.LifecycleModuleBuilder.buildProject (LifecycleModuleBuilder.java:117)
    at org.apache.maven.lifecycle.internal.LifecycleModuleBuilder.buildProject (LifecycleModuleBuilder.java:81)
    at org.apache.maven.lifecycle.internal.builder.singlethreaded.SingleThreadedBuilder.build
(SingleThreadedBuilder.java:56)
    at org.apache.maven.lifecycle.internal.LifecycleStarter.execute (LifecycleStarter.java:128)
    at org.apache.maven.DefaultMaven.doExecute (DefaultMaven.java:305)
    at org.apache.maven.DefaultMaven.doExecute (DefaultMaven.java:192)
    at org.apache.maven.DefaultMaven.execute (DefaultMaven.java:105)
    at org.jvnet.hudson.maven3.launcher.Maven35Launcher.main (Maven35Launcher.java:130)
    at sun.reflect.NativeMethodAccessorImpl.invoke0 (Native Method)
    at sun.reflect.NativeMethodAccessorImpl.invoke (NativeMethodAccessorImpl.java:62)
    at sun.reflect.DelegatingMethodAccessorImpl.invoke (DelegatingMethodAccessorImpl.java:43)
    at java.lang.reflect.Method.invoke (Method.java:498)
    at org.codehaus.plexus.classworlds.launcher.Launcher.launchEnhanced (Launcher.java:282)
    at org.codehaus.plexus.classworlds.launcher.Launcher.launch (Launcher.java:225)
    at jenkins.maven3.agent.Maven35Main.launch (Maven35Main.java:178)
    at sun.reflect.NativeMethodAccessorImpl.invoke0 (Native Method)
    at sun.reflect.NativeMethodAccessorImpl.invoke (NativeMethodAccessorImpl.java:62)
    at sun.reflect.DelegatingMethodAccessorImpl.invoke (DelegatingMethodAccessorImpl.java:43)
    at java.lang.reflect.Method.invoke (Method.java:498)
    at hudson.maven.Maven3Builder.call (Maven3Builder.java:139)
    at hudson.maven.Maven3Builder.call (Maven3Builder.java:70)
    at hudson.remoting.UserRequest.perform (UserRequest.java:212)
    at hudson.remoting.UserRequest.perform (UserRequest.java:54)
    at hudson.remoting.Request$2.run (Request.java:369)
    at hudson.remoting.InterceptingExecutorService$1.call (InterceptingExecutorService.java:72)
    at java.util.concurrent.FutureTask.run (FutureTask.java:266)
    at java.util.concurrent.ThreadPoolExecutor.runWorker (ThreadPoolExecutor.java:1149)
    at java.util.concurrent.ThreadPoolExecutor$Worker.run (ThreadPoolExecutor.java:624)
    at java.lang.Thread.run (Thread.java:748)
[INFO] ------------------------------------------------------------------------
[INFO] Reactor Summary for PDFBox reactor 2.0.18-SNAPSHOT:
[INFO] 
[INFO] PDFBox parent ...................................... SUCCESS [06:44 min]
[INFO] Apache FontBox ..................................... SUCCESS [05:30 min]
[INFO] Apache XmpBox ...................................... SUCCESS [02:27 min]
[INFO] Apache PDFBox ...................................... FAILURE [01:59 min]
[INFO] Apache Preflight ................................... SKIPPED
[INFO] Apache Preflight application ....................... SKIPPED
[INFO] Apache PDFBox Debugger ............................. SKIPPED
[INFO] Apache PDFBox tools ................................ SKIPPED
[INFO] Apache PDFBox application .......................... SKIPPED
[INFO] Apache PDFBox Debugger application ................. SKIPPED
[INFO] Apache PDFBox examples ............................. SKIPPED
[INFO] PDFBox reactor ..................................... SKIPPED
[INFO] ------------------------------------------------------------------------
[INFO] BUILD FAILURE
[INFO] ------------------------------------------------------------------------
[INFO] Total time:  17:22 min
[INFO] Finished at: 2019-10-24T07:07:10Z
[INFO] ------------------------------------------------------------------------
Waiting for Jenkins to finish collecting data
[ERROR] Failed to execute goal com.googlecode.maven-download-plugin:download-maven-plugin:1.3.0:wget
(PDFBOX-4106) on project pdfbox: IO Error: Could not get content -> [Help 1]
[ERROR] 
[ERROR] To see the full stack trace of the errors, re-run Maven with the -e switch.
[ERROR] Re-run Maven using the -X switch to enable full debug logging.
[ERROR] 
[ERROR] For more information about the errors and possible solutions, please read the following
articles:
[ERROR] [Help 1] http://cwiki.apache.org/confluence/display/MAVEN/MojoExecutionException
[ERROR] 
[ERROR] After correcting the problems, you can resume the build with the command
[ERROR]   mvn <goals> -rf :pdfbox
[JENKINS] Archiving <https://builds.apache.org/job/PDFBox-2.0.x/ws/2.0/xmpbox/pom.xml>
to org.apache.pdfbox/xmpbox/2.0.18-SNAPSHOT/xmpbox-2.0.18-SNAPSHOT.pom
[JENKINS] Archiving <https://builds.apache.org/job/PDFBox-2.0.x/ws/2.0/xmpbox/target/xmpbox-2.0.18-SNAPSHOT.jar>
to org.apache.pdfbox/xmpbox/2.0.18-20191024.070331-68/xmpbox-2.0.18-20191024.070331-68.jar
[JENKINS] Archiving <https://builds.apache.org/job/PDFBox-2.0.x/ws/2.0/tools/pom.xml>
to org.apache.pdfbox/pdfbox-tools/2.0.18-SNAPSHOT/pdfbox-tools-2.0.18-SNAPSHOT.pom
[JENKINS] Archiving <https://builds.apache.org/job/PDFBox-2.0.x/ws/2.0/debugger/pom.xml>
to org.apache.pdfbox/pdfbox-debugger/2.0.18-SNAPSHOT/pdfbox-debugger-2.0.18-SNAPSHOT.pom
[JENKINS] Archiving <https://builds.apache.org/job/PDFBox-2.0.x/ws/2.0/preflight-app/pom.xml>
to org.apache.pdfbox/preflight-app/2.0.18-SNAPSHOT/preflight-app-2.0.18-SNAPSHOT.pom
[JENKINS] Archiving <https://builds.apache.org/job/PDFBox-2.0.x/ws/2.0/app/pom.xml>
to org.apache.pdfbox/pdfbox-app/2.0.18-SNAPSHOT/pdfbox-app-2.0.18-SNAPSHOT.pom
[JENKINS] Archiving <https://builds.apache.org/job/PDFBox-2.0.x/ws/2.0/examples/pom.xml>
to org.apache.pdfbox/pdfbox-examples/2.0.18-SNAPSHOT/pdfbox-examples-2.0.18-SNAPSHOT.pom
[JENKINS] Archiving <https://builds.apache.org/job/PDFBox-2.0.x/ws/2.0/preflight/pom.xml>
to org.apache.pdfbox/preflight/2.0.18-SNAPSHOT/preflight-2.0.18-SNAPSHOT.pom
[JENKINS] Archiving <https://builds.apache.org/job/PDFBox-2.0.x/ws/2.0/pom.xml> to org.apache.pdfbox/pdfbox-reactor/2.0.18-SNAPSHOT/pdfbox-reactor-2.0.18-SNAPSHOT.pom
[JENKINS] Archiving <https://builds.apache.org/job/PDFBox-2.0.x/ws/2.0/parent/pom.xml>
to org.apache.pdfbox/pdfbox-parent/2.0.18-SNAPSHOT/pdfbox-parent-2.0.18-SNAPSHOT.pom
[JENKINS] Archiving <https://builds.apache.org/job/PDFBox-2.0.x/ws/2.0/pdfbox/pom.xml>
to org.apache.pdfbox/pdfbox/2.0.18-SNAPSHOT/pdfbox-2.0.18-SNAPSHOT.pom
[JENKINS] Archiving <https://builds.apache.org/job/PDFBox-2.0.x/ws/2.0/debugger-app/pom.xml>
to org.apache.pdfbox/debugger-app/2.0.18-SNAPSHOT/debugger-app-2.0.18-SNAPSHOT.pom
[JENKINS] Archiving <https://builds.apache.org/job/PDFBox-2.0.x/ws/2.0/fontbox/pom.xml>
to org.apache.pdfbox/fontbox/2.0.18-SNAPSHOT/fontbox-2.0.18-SNAPSHOT.pom
[JENKINS] Archiving <https://builds.apache.org/job/PDFBox-2.0.x/ws/2.0/fontbox/target/fontbox-2.0.18-SNAPSHOT.jar>
to org.apache.pdfbox/fontbox/2.0.18-20191024.065909-68/fontbox-2.0.18-20191024.065909-68.jar
[Fast Archiver] Compressed 1.49 MB of artifacts by 39.8% relative to #1797
No mail will be sent out, as 'PDFBox-2.0.x » Apache PDFBox examples #1799' does not have
a result yet. Please make sure you set a proper result in case of pipeline/build scripts.
No mail will be sent out, as 'PDFBox-2.0.x » PDFBox parent #1799' does not have a result
yet. Please make sure you set a proper result in case of pipeline/build scripts.
Sending e-mails to: dev@pdfbox.apache.org
No mail will be sent out, as 'PDFBox-2.0.x » Apache PDFBox Debugger application #1799'
does not have a result yet. Please make sure you set a proper result in case of pipeline/build
scripts.
No mail will be sent out, as 'PDFBox-2.0.x » Apache FontBox #1799' does not have a result
yet. Please make sure you set a proper result in case of pipeline/build scripts.
No mail will be sent out, as 'PDFBox-2.0.x » Apache XmpBox #1799' does not have a result
yet. Please make sure you set a proper result in case of pipeline/build scripts.
No mail will be sent out, as 'PDFBox-2.0.x » Apache PDFBox tools #1799' does not have a
result yet. Please make sure you set a proper result in case of pipeline/build scripts.
No mail will be sent out, as 'PDFBox-2.0.x » Apache PDFBox Debugger #1799' does not have
a result yet. Please make sure you set a proper result in case of pipeline/build scripts.
No mail will be sent out, as 'PDFBox-2.0.x » Apache Preflight application #1799' does not
have a result yet. Please make sure you set a proper result in case of pipeline/build scripts.
No mail will be sent out, as 'PDFBox-2.0.x » Apache PDFBox application #1799' does not
have a result yet. Please make sure you set a proper result in case of pipeline/build scripts.
No mail will be sent out, as 'PDFBox-2.0.x » Apache Preflight #1799' does not have a result
yet. Please make sure you set a proper result in case of pipeline/build scripts.
No mail will be sent out, as 'PDFBox-2.0.x » PDFBox reactor #1799' does not have a result
yet. Please make sure you set a proper result in case of pipeline/build scripts.
channel stopped
Archiving artifacts

---------------------------------------------------------------------
To unsubscribe, e-mail: dev-unsubscribe@pdfbox.apache.org
For additional commands, e-mail: dev-help@pdfbox.apache.org


Mime
View raw message