pdfbox-dev mailing list archives

Site index · List index
Message view « Date » · « Thread »
Top « Date » · « Thread »
From Apache Jenkins Server <jenk...@builds.apache.org>
Subject Build failed in Jenkins: PDFBox-2.0.x #1772
Date Wed, 02 Oct 2019 20:11:06 GMT
See <https://builds.apache.org/job/PDFBox-2.0.x/1772/display/redirect>

Changes:


------------------------------------------
Started by an SCM change
Running as SYSTEM
[EnvInject] - Loading node environment variables.
Building remotely on H24 (ubuntu xenial) in workspace <https://builds.apache.org/job/PDFBox-2.0.x/ws/>
Cleaning up <https://builds.apache.org/job/PDFBox-2.0.x/ws/2.0>
Deleting <https://builds.apache.org/job/PDFBox-2.0.x/ws/2.0/app/target>
Deleting <https://builds.apache.org/job/PDFBox-2.0.x/ws/2.0/parent/target>
Deleting <https://builds.apache.org/job/PDFBox-2.0.x/ws/2.0/debugger-app/target>
Deleting <https://builds.apache.org/job/PDFBox-2.0.x/ws/2.0/debugger/target>
Deleting <https://builds.apache.org/job/PDFBox-2.0.x/ws/2.0/xmpbox/target>
Deleting <https://builds.apache.org/job/PDFBox-2.0.x/ws/2.0/tools/target>
Deleting <https://builds.apache.org/job/PDFBox-2.0.x/ws/2.0/preflight/target>
Deleting <https://builds.apache.org/job/PDFBox-2.0.x/ws/2.0/target>
Deleting <https://builds.apache.org/job/PDFBox-2.0.x/ws/2.0/examples/target>
Deleting <https://builds.apache.org/job/PDFBox-2.0.x/ws/2.0/fontbox/target>
Deleting <https://builds.apache.org/job/PDFBox-2.0.x/ws/2.0/pdfbox/target>
Deleting <https://builds.apache.org/job/PDFBox-2.0.x/ws/2.0/preflight-app/target>
Updating http://svn.apache.org/repos/asf/pdfbox/branches/2.0 at revision '2019-10-02T20:10:21.817
+0000'
U         fontbox/src/main/java/org/apache/fontbox/cmap/CMapParser.java
U         fontbox/src/main/java/org/apache/fontbox/util/autodetect/FontFileFinder.java
U         fontbox/pom.xml
U         app/pom.xml
U         pdfbox/src/test/java/org/apache/pdfbox/rendering/TestPDFToImage.java
U         pdfbox/src/main/java/org/apache/pdfbox/pdmodel/PDDocument.java
U         pdfbox/src/main/java/org/apache/pdfbox/pdmodel/graphics/state/PDExtendedGraphicsState.java
U         pdfbox/src/main/java/org/apache/pdfbox/pdmodel/graphics/color/PDICCBased.java
U         pdfbox/src/main/java/org/apache/pdfbox/pdmodel/font/PDType0Font.java
U         pdfbox/src/main/java/org/apache/pdfbox/text/PDFTextStripperByArea.java
U         pdfbox/src/main/java/org/apache/pdfbox/contentstream/operator/text/SetFontAndSize.java
U         pdfbox/src/main/java/org/apache/pdfbox/io/ScratchFile.java
U         pdfbox/src/main/java/org/apache/pdfbox/rendering/PageDrawer.java
U         pdfbox/pom.xml
U         debugger/src/main/java/org/apache/pdfbox/debugger/streampane/Stream.java
AU        debugger/src/main/java/org/apache/pdfbox/debugger/ui/LogDialog.java
U         debugger/src/main/java/org/apache/pdfbox/debugger/ui/ReaderBottomPanel.java
AU        debugger/src/main/java/org/apache/pdfbox/debugger/ui/DebugLog.java
U         debugger/src/main/java/org/apache/pdfbox/debugger/PDFDebugger.java
U         debugger/pom.xml
U         RELEASE-NOTES.txt
U         preflight/pom.xml
U         parent/pom.xml
U         pom.xml
U         tools/src/test/java/org/apache/pdfbox/tools/imageio/TestImageIOUtils.java
U         tools/src/main/java/org/apache/pdfbox/tools/PDFToImage.java
U         tools/src/main/java/org/apache/pdfbox/tools/imageio/ImageIOUtil.java
U         tools/pom.xml
U         debugger-app/pom.xml
U         preflight-app/pom.xml
U         xmpbox/pom.xml
U         examples/src/main/java/org/apache/pdfbox/examples/signature/validation/CertInformationHelper.java
U         examples/src/main/java/org/apache/pdfbox/examples/signature/cert/CRLVerifier.java
U         examples/src/main/java/org/apache/pdfbox/examples/signature/cert/CertificateVerifier.java
U         examples/src/main/java/org/apache/pdfbox/examples/signature/CreateSignatureBase.java
U         examples/pom.xml
At revision 1867898

org.tmatesoft.svn.core.SVNException: svn: E130003: Parser configuration problem: namespace
reporting is not enabled
	at org.tmatesoft.svn.core.internal.wc.SVNErrorManager.error(SVNErrorManager.java:70)
	at org.tmatesoft.svn.core.internal.wc.SVNErrorManager.error(SVNErrorManager.java:57)
	at org.tmatesoft.svn.core.internal.io.dav.http.HTTPConnection.request(HTTPConnection.java:760)
	at org.tmatesoft.svn.core.internal.io.dav.http.HTTPConnection.request(HTTPConnection.java:352)
	at org.tmatesoft.svn.core.internal.io.dav.http.HTTPConnection.request(HTTPConnection.java:340)
	at org.tmatesoft.svn.core.internal.io.dav.DAVConnection.performHttpRequest(DAVConnection.java:910)
	at org.tmatesoft.svn.core.internal.io.dav.DAVConnection.doReport(DAVConnection.java:363)
	at org.tmatesoft.svn.core.internal.io.dav.DAVConnection.doReport(DAVConnection.java:353)
	at org.tmatesoft.svn.core.internal.io.dav.DAVRepository.logImpl(DAVRepository.java:1003)
	at org.tmatesoft.svn.core.io.SVNRepository.log(SVNRepository.java:1041)
	at org.tmatesoft.svn.core.internal.wc2.remote.SvnRemoteLog.run(SvnRemoteLog.java:181)
	at org.tmatesoft.svn.core.internal.wc2.remote.SvnRemoteLog.run(SvnRemoteLog.java:35)
	at org.tmatesoft.svn.core.internal.wc2.SvnOperationRunner.run(SvnOperationRunner.java:21)
	at org.tmatesoft.svn.core.wc2.SvnOperationFactory.run(SvnOperationFactory.java:1239)
	at org.tmatesoft.svn.core.wc2.SvnOperation.run(SvnOperation.java:294)
	at org.tmatesoft.svn.core.wc.SVNLogClient.doLog(SVNLogClient.java:968)
	at org.tmatesoft.svn.core.wc.SVNLogClient.doLog(SVNLogClient.java:873)
	at hudson.scm.SubversionChangeLogBuilder.buildModule(SubversionChangeLogBuilder.java:189)
Caused: java.io.IOException: revision check failed on http://svn.apache.org/repos/asf/pdfbox/branches/2.0
	at hudson.scm.SubversionChangeLogBuilder.buildModule(SubversionChangeLogBuilder.java:203)
	at hudson.scm.SubversionChangeLogBuilder.run(SubversionChangeLogBuilder.java:123)
	at hudson.scm.SubversionSCM.calcChangeLog(SubversionSCM.java:756)
	at hudson.scm.SubversionSCM.checkout(SubversionSCM.java:897)
	at hudson.scm.SCM.checkout(SCM.java:504)
	at hudson.model.AbstractProject.checkout(AbstractProject.java:1208)
	at hudson.model.AbstractBuild$AbstractBuildExecution.defaultCheckout(AbstractBuild.java:574)
	at jenkins.scm.SCMCheckoutStrategy.checkout(SCMCheckoutStrategy.java:86)
	at hudson.model.AbstractBuild$AbstractBuildExecution.run(AbstractBuild.java:499)
	at hudson.model.Run.execute(Run.java:1815)
	at hudson.maven.MavenModuleSetBuild.run(MavenModuleSetBuild.java:543)
	at hudson.model.ResourceController.execute(ResourceController.java:97)
	at hudson.model.Executor.run(Executor.java:429)
Retrying after 10 seconds
Cleaning up <https://builds.apache.org/job/PDFBox-2.0.x/ws/2.0>
Updating http://svn.apache.org/repos/asf/pdfbox/branches/2.0 at revision '2019-10-02T20:10:21.817
+0000'
At revision 1867898

org.tmatesoft.svn.core.SVNException: svn: E130003: Parser configuration problem: namespace
reporting is not enabled
	at org.tmatesoft.svn.core.internal.wc.SVNErrorManager.error(SVNErrorManager.java:70)
	at org.tmatesoft.svn.core.internal.wc.SVNErrorManager.error(SVNErrorManager.java:57)
	at org.tmatesoft.svn.core.internal.io.dav.http.HTTPConnection.request(HTTPConnection.java:760)
	at org.tmatesoft.svn.core.internal.io.dav.http.HTTPConnection.request(HTTPConnection.java:352)
	at org.tmatesoft.svn.core.internal.io.dav.http.HTTPConnection.request(HTTPConnection.java:340)
	at org.tmatesoft.svn.core.internal.io.dav.DAVConnection.performHttpRequest(DAVConnection.java:910)
	at org.tmatesoft.svn.core.internal.io.dav.DAVConnection.doReport(DAVConnection.java:363)
	at org.tmatesoft.svn.core.internal.io.dav.DAVConnection.doReport(DAVConnection.java:353)
	at org.tmatesoft.svn.core.internal.io.dav.DAVRepository.logImpl(DAVRepository.java:1003)
	at org.tmatesoft.svn.core.io.SVNRepository.log(SVNRepository.java:1041)
	at org.tmatesoft.svn.core.internal.wc2.remote.SvnRemoteLog.run(SvnRemoteLog.java:181)
	at org.tmatesoft.svn.core.internal.wc2.remote.SvnRemoteLog.run(SvnRemoteLog.java:35)
	at org.tmatesoft.svn.core.internal.wc2.SvnOperationRunner.run(SvnOperationRunner.java:21)
	at org.tmatesoft.svn.core.wc2.SvnOperationFactory.run(SvnOperationFactory.java:1239)
	at org.tmatesoft.svn.core.wc2.SvnOperation.run(SvnOperation.java:294)
	at org.tmatesoft.svn.core.wc.SVNLogClient.doLog(SVNLogClient.java:968)
	at org.tmatesoft.svn.core.wc.SVNLogClient.doLog(SVNLogClient.java:873)
	at hudson.scm.SubversionChangeLogBuilder.buildModule(SubversionChangeLogBuilder.java:189)
Caused: java.io.IOException: revision check failed on http://svn.apache.org/repos/asf/pdfbox/branches/2.0
	at hudson.scm.SubversionChangeLogBuilder.buildModule(SubversionChangeLogBuilder.java:203)
	at hudson.scm.SubversionChangeLogBuilder.run(SubversionChangeLogBuilder.java:123)
	at hudson.scm.SubversionSCM.calcChangeLog(SubversionSCM.java:756)
	at hudson.scm.SubversionSCM.checkout(SubversionSCM.java:897)
	at hudson.scm.SCM.checkout(SCM.java:504)
	at hudson.model.AbstractProject.checkout(AbstractProject.java:1208)
	at hudson.model.AbstractBuild$AbstractBuildExecution.defaultCheckout(AbstractBuild.java:574)
	at jenkins.scm.SCMCheckoutStrategy.checkout(SCMCheckoutStrategy.java:86)
	at hudson.model.AbstractBuild$AbstractBuildExecution.run(AbstractBuild.java:499)
	at hudson.model.Run.execute(Run.java:1815)
	at hudson.maven.MavenModuleSetBuild.run(MavenModuleSetBuild.java:543)
	at hudson.model.ResourceController.execute(ResourceController.java:97)
	at hudson.model.Executor.run(Executor.java:429)
Retrying after 10 seconds
Cleaning up <https://builds.apache.org/job/PDFBox-2.0.x/ws/2.0>
Updating http://svn.apache.org/repos/asf/pdfbox/branches/2.0 at revision '2019-10-02T20:10:21.817
+0000'
At revision 1867898

org.tmatesoft.svn.core.SVNException: svn: E130003: Parser configuration problem: namespace
reporting is not enabled
	at org.tmatesoft.svn.core.internal.wc.SVNErrorManager.error(SVNErrorManager.java:70)
	at org.tmatesoft.svn.core.internal.wc.SVNErrorManager.error(SVNErrorManager.java:57)
	at org.tmatesoft.svn.core.internal.io.dav.http.HTTPConnection.request(HTTPConnection.java:760)
	at org.tmatesoft.svn.core.internal.io.dav.http.HTTPConnection.request(HTTPConnection.java:352)
	at org.tmatesoft.svn.core.internal.io.dav.http.HTTPConnection.request(HTTPConnection.java:340)
	at org.tmatesoft.svn.core.internal.io.dav.DAVConnection.performHttpRequest(DAVConnection.java:910)
	at org.tmatesoft.svn.core.internal.io.dav.DAVConnection.doReport(DAVConnection.java:363)
	at org.tmatesoft.svn.core.internal.io.dav.DAVConnection.doReport(DAVConnection.java:353)
	at org.tmatesoft.svn.core.internal.io.dav.DAVRepository.logImpl(DAVRepository.java:1003)
	at org.tmatesoft.svn.core.io.SVNRepository.log(SVNRepository.java:1041)
	at org.tmatesoft.svn.core.internal.wc2.remote.SvnRemoteLog.run(SvnRemoteLog.java:181)
	at org.tmatesoft.svn.core.internal.wc2.remote.SvnRemoteLog.run(SvnRemoteLog.java:35)
	at org.tmatesoft.svn.core.internal.wc2.SvnOperationRunner.run(SvnOperationRunner.java:21)
	at org.tmatesoft.svn.core.wc2.SvnOperationFactory.run(SvnOperationFactory.java:1239)
	at org.tmatesoft.svn.core.wc2.SvnOperation.run(SvnOperation.java:294)
	at org.tmatesoft.svn.core.wc.SVNLogClient.doLog(SVNLogClient.java:968)
	at org.tmatesoft.svn.core.wc.SVNLogClient.doLog(SVNLogClient.java:873)
	at hudson.scm.SubversionChangeLogBuilder.buildModule(SubversionChangeLogBuilder.java:189)
Caused: java.io.IOException: revision check failed on http://svn.apache.org/repos/asf/pdfbox/branches/2.0
	at hudson.scm.SubversionChangeLogBuilder.buildModule(SubversionChangeLogBuilder.java:203)
	at hudson.scm.SubversionChangeLogBuilder.run(SubversionChangeLogBuilder.java:123)
	at hudson.scm.SubversionSCM.calcChangeLog(SubversionSCM.java:756)
	at hudson.scm.SubversionSCM.checkout(SubversionSCM.java:897)
	at hudson.scm.SCM.checkout(SCM.java:504)
	at hudson.model.AbstractProject.checkout(AbstractProject.java:1208)
	at hudson.model.AbstractBuild$AbstractBuildExecution.defaultCheckout(AbstractBuild.java:574)
	at jenkins.scm.SCMCheckoutStrategy.checkout(SCMCheckoutStrategy.java:86)
	at hudson.model.AbstractBuild$AbstractBuildExecution.run(AbstractBuild.java:499)
	at hudson.model.Run.execute(Run.java:1815)
	at hudson.maven.MavenModuleSetBuild.run(MavenModuleSetBuild.java:543)
	at hudson.model.ResourceController.execute(ResourceController.java:97)
	at hudson.model.Executor.run(Executor.java:429)
Archiving artifacts

---------------------------------------------------------------------
To unsubscribe, e-mail: dev-unsubscribe@pdfbox.apache.org
For additional commands, e-mail: dev-help@pdfbox.apache.org


Mime
View raw message