pdfbox-dev mailing list archives

Site index · List index
Message view « Date » · « Thread »
Top « Date » · « Thread »
From Apache Jenkins Server <jenk...@builds.apache.org>
Subject Build failed in Jenkins: PDFBox-2.0.x #1789
Date Sun, 13 Oct 2019 09:34:08 GMT
See <https://builds.apache.org/job/PDFBox-2.0.x/1789/display/redirect?page=changes>

Changes:

[msahyoun] PDFBOX-4669: new method getCOSArray; deprecate toList as this will not return a
 List but the COSArray


------------------------------------------
Started by an SCM change
Running as SYSTEM
[EnvInject] - Loading node environment variables.
Building remotely on H38 (ubuntu xenial) in workspace <https://builds.apache.org/job/PDFBox-2.0.x/ws/>
Cleaning up <https://builds.apache.org/job/PDFBox-2.0.x/ws/2.0>
Deleting <https://builds.apache.org/job/PDFBox-2.0.x/ws/2.0/app/target>
Deleting <https://builds.apache.org/job/PDFBox-2.0.x/ws/2.0/parent/target>
Deleting <https://builds.apache.org/job/PDFBox-2.0.x/ws/2.0/debugger-app/target>
Deleting <https://builds.apache.org/job/PDFBox-2.0.x/ws/2.0/debugger/target>
Deleting <https://builds.apache.org/job/PDFBox-2.0.x/ws/2.0/xmpbox/target>
Deleting <https://builds.apache.org/job/PDFBox-2.0.x/ws/2.0/tools/target>
Deleting <https://builds.apache.org/job/PDFBox-2.0.x/ws/2.0/preflight/target>
Deleting <https://builds.apache.org/job/PDFBox-2.0.x/ws/2.0/target>
Deleting <https://builds.apache.org/job/PDFBox-2.0.x/ws/2.0/examples/target>
Deleting <https://builds.apache.org/job/PDFBox-2.0.x/ws/2.0/fontbox/target>
Deleting <https://builds.apache.org/job/PDFBox-2.0.x/ws/2.0/pdfbox/target>
Deleting <https://builds.apache.org/job/PDFBox-2.0.x/ws/2.0/preflight-app/target>
Updating http://svn.apache.org/repos/asf/pdfbox/branches/2.0 at revision '2019-10-13T09:29:08.549
+0000'
U         pdfbox/src/main/java/org/apache/pdfbox/pdmodel/common/COSArrayList.java
At revision 1868385

Parsing POMs
Established TCP socket on 33422
maven35-agent.jar already up to date
maven35-interceptor.jar already up to date
maven3-interceptor-commons.jar already up to date
[2.0] $ /home/jenkins/tools/java/latest1.8/bin/java -Xmx1g -cp /home/jenkins/jenkins-slave/maven35-agent.jar:/home/jenkins/tools/maven/apache-maven-3.6.0/boot/plexus-classworlds-2.5.2.jar:/home/jenkins/tools/maven/apache-maven-3.6.0/conf/logging
jenkins.maven3.agent.Maven35Main /home/jenkins/tools/maven/apache-maven-3.6.0 /home/jenkins/jenkins-slave/remoting.jar
/home/jenkins/jenkins-slave/maven35-interceptor.jar /home/jenkins/jenkins-slave/maven3-interceptor-commons.jar
33422
<===[JENKINS REMOTING CAPACITY]===>   channel started
Executing Maven:  -B -f <https://builds.apache.org/job/PDFBox-2.0.x/ws/2.0/pom.xml>
-Dmaven.repo.local=<https://builds.apache.org/job/PDFBox-2.0.x/ws/.repository> clean
deploy -Ppedantic -Dmaven.source.skip=true
[INFO] Scanning for projects...
[INFO] ------------------------------------------------------------------------
[INFO] Reactor Build Order:
[INFO] 
[INFO] PDFBox parent                                                      [pom]
[INFO] Apache FontBox                                                  [bundle]
[INFO] Apache XmpBox                                                   [bundle]
[INFO] Apache PDFBox                                                   [bundle]
[INFO] Apache Preflight                                                [bundle]
[INFO] Apache Preflight application                                    [bundle]
[INFO] Apache PDFBox Debugger                                             [jar]
[INFO] Apache PDFBox tools                                                [jar]
[INFO] Apache PDFBox application                                       [bundle]
[INFO] Apache PDFBox Debugger application                              [bundle]
[INFO] Apache PDFBox examples                                             [jar]
[INFO] PDFBox reactor                                                     [pom]
[INFO] 
[INFO] ------------------< org.apache.pdfbox:pdfbox-parent >-------------------
[INFO] Building PDFBox parent 2.0.18-SNAPSHOT                            [1/12]
[INFO] --------------------------------[ pom ]---------------------------------
[INFO] 
[INFO] --- maven-clean-plugin:3.0.0:clean (default-clean) @ pdfbox-parent ---
[WARNING] Attempt to (de-)serialize anonymous class hudson.plugins.analysis.core.HealthAwareReporter$2;
see: https://jenkins.io/redirect/serialization-of-anonymous-classes/
[WARNING] Attempt to (de-)serialize anonymous class hudson.plugins.analysis.core.HealthAwareReporter$3;
see: https://jenkins.io/redirect/serialization-of-anonymous-classes/
[TASKS] Scanning folder '<https://builds.apache.org/job/PDFBox-2.0.x/ws/2.0/parent'>
for files matching the pattern '**/*.java' - excludes: 
[TASKS] Found 0 files to scan for tasks
Found 0 open tasks.
[WARNING] Attempt to (de-)serialize anonymous class hudson.plugins.analysis.core.HealthAwareReporter$1;
see: https://jenkins.io/redirect/serialization-of-anonymous-classes/
[TASKS] Computing warning deltas based on reference build #1788
[INFO] 
[INFO] --- maven-enforcer-plugin:1.4.1:enforce (default) @ pdfbox-parent ---
[INFO] 
[INFO] --- maven-enforcer-plugin:1.4.1:enforce (enforce-maven-version) @ pdfbox-parent ---
[INFO] 
[INFO] --- maven-remote-resources-plugin:1.5:process (process-resource-bundles) @ pdfbox-parent
---
[INFO] 
[INFO] --- animal-sniffer-maven-plugin:1.17:check (check-java-version) @ pdfbox-parent ---
[INFO] Checking unresolved references to org.codehaus.mojo.signature:java16:1.0
[INFO] 
[INFO] --- maven-site-plugin:3.7:attach-descriptor (attach-descriptor) @ pdfbox-parent ---
[INFO] No site descriptor found: nothing to attach.
[INFO] 
[INFO] >>> maven-source-plugin:3.0.1:jar (attach-sources) > generate-sources @
pdfbox-parent >>>
[INFO] 
[INFO] --- maven-enforcer-plugin:1.4.1:enforce (default) @ pdfbox-parent ---
[INFO] 
[INFO] --- maven-enforcer-plugin:1.4.1:enforce (enforce-maven-version) @ pdfbox-parent ---
[WARNING] Failed to getClass for org.apache.maven.plugins.source.SourceJarMojo
[INFO] 
[INFO] <<< maven-source-plugin:3.0.1:jar (attach-sources) < generate-sources @
pdfbox-parent <<<
[INFO] 
[INFO] 
[INFO] --- maven-source-plugin:3.0.1:jar (attach-sources) @ pdfbox-parent ---
[INFO] Skipping source per configuration.
[INFO] 
[INFO] --- apache-rat-plugin:0.12:check (default) @ pdfbox-parent ---
[INFO] Enabled default license matchers.
[INFO] Will parse SCM ignores for exclusions...
[INFO] Finished adding exclusions from SCM ignore files.
[INFO] 61 implicit excludes (use -debug for more details).
[INFO] Exclude: release.properties
[INFO] 1 resources included (use -debug for more details)
[INFO] Rat check: Summary over all files. Unapproved: 0, unknown: 0, generated: 0, approved:
1 licenses.
[INFO] 
[INFO] --- dependency-check-maven:5.2.2:check (default) @ pdfbox-parent ---
[INFO] Checking for updates
[INFO] Download Started for NVD CVE - Modified
[INFO] Download Complete for NVD CVE - Modified  (894 ms)
[INFO] Processing Started for NVD CVE - Modified
[INFO] Processing Complete for NVD CVE - Modified  (9411 ms)
[INFO] Begin database maintenance
[INFO] End database maintenance (6346 ms)
[INFO] Skipping RetireJS update since last update was within 24 hours.
[INFO] Begin database defrag
[INFO] End database defrag (9098 ms)
[INFO] Check for updates complete (26546 ms)
[INFO] 

Dependency-Check is an open source tool performing a best effort analysis of 3rd party dependencies;
false positives and false negatives may exist in the analysis performed by the tool. Use of
the tool and the reporting provided constitutes acceptance for use in an AS IS condition,
and there are NO warranties, implied or otherwise, with regard to the analysis or its use.
Any use of the tool and the reporting provided is at the user?s risk. In no event shall the
copyright holder or OWASP be held liable for any damages whatsoever arising out of or in connection
with the use of this tool, the analysis performed, or the resulting report.


[INFO] Analysis Started
[INFO] Finished File Name Analyzer (0 seconds)
[INFO] Finished Dependency Merging Analyzer (0 seconds)
[INFO] Finished Version Filter Analyzer (0 seconds)
[INFO] Finished Hint Analyzer (0 seconds)
[INFO] Created CPE Index (2 seconds)
[INFO] Finished CPE Analyzer (2 seconds)
[INFO] Finished False Positive Analyzer (0 seconds)
[INFO] Finished NVD CVE Analyzer (0 seconds)
[INFO] Finished Sonatype OSS Index Analyzer (0 seconds)
[INFO] Finished Vulnerability Suppression Analyzer (0 seconds)
[INFO] Finished Dependency Bundling Analyzer (0 seconds)
[INFO] Analysis Complete (2 seconds)
[INFO] 
[INFO] --- maven-install-plugin:2.5.2:install (default-install) @ pdfbox-parent ---
[INFO] Installing <https://builds.apache.org/job/PDFBox-2.0.x/ws/2.0/parent/pom.xml>
to <https://builds.apache.org/job/PDFBox-2.0.x/ws/.repository/org/apache/pdfbox/pdfbox-parent/2.0.18-SNAPSHOT/pdfbox-parent-2.0.18-SNAPSHOT.pom>
[INFO] 
[INFO] --- maven-deploy-plugin:2.8.2:deploy (default-deploy) @ pdfbox-parent ---
[INFO] Downloading from apache.snapshots.https: https://repository.apache.org/content/repositories/snapshots/org/apache/pdfbox/pdfbox-parent/2.0.18-SNAPSHOT/maven-metadata.xml
[WARNING] Could not transfer metadata org.apache.pdfbox:pdfbox-parent:2.0.18-SNAPSHOT/maven-metadata.xml
from/to apache.snapshots.https (https://repository.apache.org/content/repositories/snapshots):
Connect to repository.apache.org:443 [repository.apache.org/207.244.88.140] failed: Connection
timed out (Connection timed out)
[INFO] ------------------------------------------------------------------------
[INFO] Reactor Summary for PDFBox reactor 2.0.18-SNAPSHOT:
[INFO] 
[INFO] PDFBox parent ...................................... FAILURE [03:46 min]
[INFO] Apache FontBox ..................................... SKIPPED
[INFO] Apache XmpBox ...................................... SKIPPED
[INFO] Apache PDFBox ...................................... SKIPPED
[INFO] Apache Preflight ................................... SKIPPED
[INFO] Apache Preflight application ....................... SKIPPED
[INFO] Apache PDFBox Debugger ............................. SKIPPED
[INFO] Apache PDFBox tools ................................ SKIPPED
[INFO] Apache PDFBox application .......................... SKIPPED
[INFO] Apache PDFBox Debugger application ................. SKIPPED
[INFO] Apache PDFBox examples ............................. SKIPPED
[INFO] PDFBox reactor ..................................... SKIPPED
[INFO] ------------------------------------------------------------------------
[INFO] BUILD FAILURE
[INFO] ------------------------------------------------------------------------
[INFO] Total time:  04:02 min
[INFO] Finished at: 2019-10-13T09:33:40Z
[INFO] ------------------------------------------------------------------------
Waiting for Jenkins to finish collecting data
[ERROR] Failed to execute goal org.apache.maven.plugins:maven-deploy-plugin:2.8.2:deploy (default-deploy)
on project pdfbox-parent: Failed to retrieve remote metadata org.apache.pdfbox:pdfbox-parent:2.0.18-SNAPSHOT/maven-metadata.xml:
Could not transfer metadata org.apache.pdfbox:pdfbox-parent:2.0.18-SNAPSHOT/maven-metadata.xml
from/to apache.snapshots.https (https://repository.apache.org/content/repositories/snapshots):
Connect to repository.apache.org:443 [repository.apache.org/207.244.88.140] failed: Connection
timed out (Connection timed out) -> [Help 1]
[ERROR] 
[ERROR] To see the full stack trace of the errors, re-run Maven with the -e switch.
[ERROR] Re-run Maven using the -X switch to enable full debug logging.
[ERROR] 
[ERROR] For more information about the errors and possible solutions, please read the following
articles:
[ERROR] [Help 1] http://cwiki.apache.org/confluence/display/MAVEN/MojoExecutionException
[JENKINS] Archiving <https://builds.apache.org/job/PDFBox-2.0.x/ws/2.0/xmpbox/pom.xml>
to org.apache.pdfbox/xmpbox/2.0.18-SNAPSHOT/xmpbox-2.0.18-SNAPSHOT.pom
[JENKINS] Archiving <https://builds.apache.org/job/PDFBox-2.0.x/ws/2.0/tools/pom.xml>
to org.apache.pdfbox/pdfbox-tools/2.0.18-SNAPSHOT/pdfbox-tools-2.0.18-SNAPSHOT.pom
[JENKINS] Archiving <https://builds.apache.org/job/PDFBox-2.0.x/ws/2.0/debugger/pom.xml>
to org.apache.pdfbox/pdfbox-debugger/2.0.18-SNAPSHOT/pdfbox-debugger-2.0.18-SNAPSHOT.pom
[JENKINS] Archiving <https://builds.apache.org/job/PDFBox-2.0.x/ws/2.0/preflight-app/pom.xml>
to org.apache.pdfbox/preflight-app/2.0.18-SNAPSHOT/preflight-app-2.0.18-SNAPSHOT.pom
[JENKINS] Archiving <https://builds.apache.org/job/PDFBox-2.0.x/ws/2.0/app/pom.xml>
to org.apache.pdfbox/pdfbox-app/2.0.18-SNAPSHOT/pdfbox-app-2.0.18-SNAPSHOT.pom
[JENKINS] Archiving <https://builds.apache.org/job/PDFBox-2.0.x/ws/2.0/examples/pom.xml>
to org.apache.pdfbox/pdfbox-examples/2.0.18-SNAPSHOT/pdfbox-examples-2.0.18-SNAPSHOT.pom
[JENKINS] Archiving <https://builds.apache.org/job/PDFBox-2.0.x/ws/2.0/preflight/pom.xml>
to org.apache.pdfbox/preflight/2.0.18-SNAPSHOT/preflight-2.0.18-SNAPSHOT.pom
[JENKINS] Archiving <https://builds.apache.org/job/PDFBox-2.0.x/ws/2.0/pom.xml> to org.apache.pdfbox/pdfbox-reactor/2.0.18-SNAPSHOT/pdfbox-reactor-2.0.18-SNAPSHOT.pom
[JENKINS] Archiving <https://builds.apache.org/job/PDFBox-2.0.x/ws/2.0/parent/pom.xml>
to org.apache.pdfbox/pdfbox-parent/2.0.18-SNAPSHOT/pdfbox-parent-2.0.18-SNAPSHOT.pom
[JENKINS] Archiving <https://builds.apache.org/job/PDFBox-2.0.x/ws/2.0/pdfbox/pom.xml>
to org.apache.pdfbox/pdfbox/2.0.18-SNAPSHOT/pdfbox-2.0.18-SNAPSHOT.pom
[JENKINS] Archiving <https://builds.apache.org/job/PDFBox-2.0.x/ws/2.0/debugger-app/pom.xml>
to org.apache.pdfbox/debugger-app/2.0.18-SNAPSHOT/debugger-app-2.0.18-SNAPSHOT.pom
[JENKINS] Archiving <https://builds.apache.org/job/PDFBox-2.0.x/ws/2.0/fontbox/pom.xml>
to org.apache.pdfbox/fontbox/2.0.18-SNAPSHOT/fontbox-2.0.18-SNAPSHOT.pom
No mail will be sent out, as 'PDFBox-2.0.x » Apache PDFBox examples #1789' does not have
a result yet. Please make sure you set a proper result in case of pipeline/build scripts.
Sending e-mails to: dev@pdfbox.apache.org
No mail will be sent out, as 'PDFBox-2.0.x » Apache PDFBox #1789' does not have a result
yet. Please make sure you set a proper result in case of pipeline/build scripts.
No mail will be sent out, as 'PDFBox-2.0.x » Apache PDFBox Debugger application #1789'
does not have a result yet. Please make sure you set a proper result in case of pipeline/build
scripts.
No mail will be sent out, as 'PDFBox-2.0.x » Apache FontBox #1789' does not have a result
yet. Please make sure you set a proper result in case of pipeline/build scripts.
No mail will be sent out, as 'PDFBox-2.0.x » Apache XmpBox #1789' does not have a result
yet. Please make sure you set a proper result in case of pipeline/build scripts.
No mail will be sent out, as 'PDFBox-2.0.x » Apache PDFBox tools #1789' does not have a
result yet. Please make sure you set a proper result in case of pipeline/build scripts.
No mail will be sent out, as 'PDFBox-2.0.x » Apache PDFBox Debugger #1789' does not have
a result yet. Please make sure you set a proper result in case of pipeline/build scripts.
No mail will be sent out, as 'PDFBox-2.0.x » Apache Preflight application #1789' does not
have a result yet. Please make sure you set a proper result in case of pipeline/build scripts.
No mail will be sent out, as 'PDFBox-2.0.x » Apache PDFBox application #1789' does not
have a result yet. Please make sure you set a proper result in case of pipeline/build scripts.
No mail will be sent out, as 'PDFBox-2.0.x » Apache Preflight #1789' does not have a result
yet. Please make sure you set a proper result in case of pipeline/build scripts.
No mail will be sent out, as 'PDFBox-2.0.x » PDFBox reactor #1789' does not have a result
yet. Please make sure you set a proper result in case of pipeline/build scripts.
channel stopped
Archiving artifacts

---------------------------------------------------------------------
To unsubscribe, e-mail: dev-unsubscribe@pdfbox.apache.org
For additional commands, e-mail: dev-help@pdfbox.apache.org


Mime
View raw message