pdfbox-dev mailing list archives

Site index · List index
Message view « Date » · « Thread »
Top « Date » · « Thread »
From Apache Jenkins Server <jenk...@builds.apache.org>
Subject Build failed in Jenkins: PDFBox-trunk #4889
Date Sun, 29 Sep 2019 19:07:54 GMT
See <https://builds.apache.org/job/PDFBox-trunk/4889/display/redirect?page=changes>

Changes:

[lehmi] PDFBOX-4661: support a maximum of 256 values to be more lenient

[tilman] PDFBOX-4071: remove pre-jdk8 assumptions because we're on jdk8

[tilman] PDFBOX-4071: remove pre-jdk8 assumptions because we're on jdk8

[tilman] PDFBOX-4659: remove jdk7 assumptions because we're on jdk8


------------------------------------------
[...truncated 20.51 KB...]
    at java.util.concurrent.ThreadPoolExecutor$Worker.run (ThreadPoolExecutor.java:624)
    at java.lang.Thread.run (Thread.java:748)
Caused by: javax.net.ssl.SSLHandshakeException: sun.security.validator.ValidatorException:
PKIX path building failed: sun.security.provider.certpath.SunCertPathBuilderException: unable
to find valid certification path to requested target
    at sun.security.ssl.Alerts.getSSLException (Alerts.java:192)
    at sun.security.ssl.SSLSocketImpl.fatal (SSLSocketImpl.java:1946)
    at sun.security.ssl.Handshaker.fatalSE (Handshaker.java:316)
    at sun.security.ssl.Handshaker.fatalSE (Handshaker.java:310)
    at sun.security.ssl.ClientHandshaker.serverCertificate (ClientHandshaker.java:1639)
    at sun.security.ssl.ClientHandshaker.processMessage (ClientHandshaker.java:223)
    at sun.security.ssl.Handshaker.processLoop (Handshaker.java:1037)
    at sun.security.ssl.Handshaker.process_record (Handshaker.java:965)
    at sun.security.ssl.SSLSocketImpl.readRecord (SSLSocketImpl.java:1064)
    at sun.security.ssl.SSLSocketImpl.performInitialHandshake (SSLSocketImpl.java:1367)
    at sun.security.ssl.SSLSocketImpl.startHandshake (SSLSocketImpl.java:1395)
    at sun.security.ssl.SSLSocketImpl.startHandshake (SSLSocketImpl.java:1379)
    at sun.net.www.protocol.https.HttpsClient.afterConnect (HttpsClient.java:559)
    at sun.net.www.protocol.https.AbstractDelegateHttpsURLConnection.connect (AbstractDelegateHttpsURLConnection.java:185)
    at sun.net.www.protocol.https.HttpsURLConnectionImpl.connect (HttpsURLConnectionImpl.java:162)
    at org.owasp.dependencycheck.utils.HttpResourceConnection.obtainConnection (HttpResourceConnection.java:178)
    at org.owasp.dependencycheck.utils.HttpResourceConnection.fetch (HttpResourceConnection.java:138)
    at org.owasp.dependencycheck.utils.Downloader.fetchContent (Downloader.java:110)
    at org.owasp.dependencycheck.data.update.NvdCveUpdater.getMetaFile (NvdCveUpdater.java:340)
    at org.owasp.dependencycheck.data.update.NvdCveUpdater.getUpdatesNeeded (NvdCveUpdater.java:385)
    at org.owasp.dependencycheck.data.update.NvdCveUpdater.update (NvdCveUpdater.java:122)
    at org.owasp.dependencycheck.Engine.doUpdates (Engine.java:922)
    at org.owasp.dependencycheck.Engine.initializeAndUpdateDatabase (Engine.java:723)
    at org.owasp.dependencycheck.Engine.analyzeDependencies (Engine.java:653)
    at org.owasp.dependencycheck.maven.BaseDependencyCheckMojo.runCheck (BaseDependencyCheckMojo.java:1403)
    at org.owasp.dependencycheck.maven.BaseDependencyCheckMojo.execute (BaseDependencyCheckMojo.java:802)
    at org.apache.maven.plugin.DefaultBuildPluginManager.executeMojo (DefaultBuildPluginManager.java:137)
    at org.apache.maven.lifecycle.internal.MojoExecutor.execute (MojoExecutor.java:210)
    at org.apache.maven.lifecycle.internal.MojoExecutor.execute (MojoExecutor.java:156)
    at org.apache.maven.lifecycle.internal.MojoExecutor.execute (MojoExecutor.java:148)
    at org.apache.maven.lifecycle.internal.LifecycleModuleBuilder.buildProject (LifecycleModuleBuilder.java:117)
    at org.apache.maven.lifecycle.internal.LifecycleModuleBuilder.buildProject (LifecycleModuleBuilder.java:81)
    at org.apache.maven.lifecycle.internal.builder.singlethreaded.SingleThreadedBuilder.build
(SingleThreadedBuilder.java:56)
    at org.apache.maven.lifecycle.internal.LifecycleStarter.execute (LifecycleStarter.java:128)
    at org.apache.maven.DefaultMaven.doExecute (DefaultMaven.java:305)
    at org.apache.maven.DefaultMaven.doExecute (DefaultMaven.java:192)
    at org.apache.maven.DefaultMaven.execute (DefaultMaven.java:105)
    at org.jvnet.hudson.maven3.launcher.Maven35Launcher.main (Maven35Launcher.java:130)
    at sun.reflect.NativeMethodAccessorImpl.invoke0 (Native Method)
    at sun.reflect.NativeMethodAccessorImpl.invoke (NativeMethodAccessorImpl.java:62)
    at sun.reflect.DelegatingMethodAccessorImpl.invoke (DelegatingMethodAccessorImpl.java:43)
    at java.lang.reflect.Method.invoke (Method.java:498)
    at org.codehaus.plexus.classworlds.launcher.Launcher.launchEnhanced (Launcher.java:289)
    at org.codehaus.plexus.classworlds.launcher.Launcher.launch (Launcher.java:229)
    at jenkins.maven3.agent.Maven35Main.launch (Maven35Main.java:178)
    at sun.reflect.NativeMethodAccessorImpl.invoke0 (Native Method)
    at sun.reflect.NativeMethodAccessorImpl.invoke (NativeMethodAccessorImpl.java:62)
    at sun.reflect.DelegatingMethodAccessorImpl.invoke (DelegatingMethodAccessorImpl.java:43)
    at java.lang.reflect.Method.invoke (Method.java:498)
    at hudson.maven.Maven3Builder.call (Maven3Builder.java:139)
    at hudson.maven.Maven3Builder.call (Maven3Builder.java:70)
    at hudson.remoting.UserRequest.perform (UserRequest.java:212)
    at hudson.remoting.UserRequest.perform (UserRequest.java:54)
    at hudson.remoting.Request$2.run (Request.java:369)
    at hudson.remoting.InterceptingExecutorService$1.call (InterceptingExecutorService.java:72)
    at java.util.concurrent.FutureTask.run (FutureTask.java:266)
    at java.util.concurrent.ThreadPoolExecutor.runWorker (ThreadPoolExecutor.java:1149)
    at java.util.concurrent.ThreadPoolExecutor$Worker.run (ThreadPoolExecutor.java:624)
    at java.lang.Thread.run (Thread.java:748)
Caused by: sun.security.validator.ValidatorException: PKIX path building failed: sun.security.provider.certpath.SunCertPathBuilderException:
unable to find valid certification path to requested target
    at sun.security.validator.PKIXValidator.doBuild (PKIXValidator.java:397)
    at sun.security.validator.PKIXValidator.engineValidate (PKIXValidator.java:302)
    at sun.security.validator.Validator.validate (Validator.java:262)
    at sun.security.ssl.X509TrustManagerImpl.validate (X509TrustManagerImpl.java:324)
    at sun.security.ssl.X509TrustManagerImpl.checkTrusted (X509TrustManagerImpl.java:229)
    at sun.security.ssl.X509TrustManagerImpl.checkServerTrusted (X509TrustManagerImpl.java:124)
    at sun.security.ssl.ClientHandshaker.serverCertificate (ClientHandshaker.java:1621)
    at sun.security.ssl.ClientHandshaker.processMessage (ClientHandshaker.java:223)
    at sun.security.ssl.Handshaker.processLoop (Handshaker.java:1037)
    at sun.security.ssl.Handshaker.process_record (Handshaker.java:965)
    at sun.security.ssl.SSLSocketImpl.readRecord (SSLSocketImpl.java:1064)
    at sun.security.ssl.SSLSocketImpl.performInitialHandshake (SSLSocketImpl.java:1367)
    at sun.security.ssl.SSLSocketImpl.startHandshake (SSLSocketImpl.java:1395)
    at sun.security.ssl.SSLSocketImpl.startHandshake (SSLSocketImpl.java:1379)
    at sun.net.www.protocol.https.HttpsClient.afterConnect (HttpsClient.java:559)
    at sun.net.www.protocol.https.AbstractDelegateHttpsURLConnection.connect (AbstractDelegateHttpsURLConnection.java:185)
    at sun.net.www.protocol.https.HttpsURLConnectionImpl.connect (HttpsURLConnectionImpl.java:162)
    at org.owasp.dependencycheck.utils.HttpResourceConnection.obtainConnection (HttpResourceConnection.java:178)
    at org.owasp.dependencycheck.utils.HttpResourceConnection.fetch (HttpResourceConnection.java:138)
    at org.owasp.dependencycheck.utils.Downloader.fetchContent (Downloader.java:110)
    at org.owasp.dependencycheck.data.update.NvdCveUpdater.getMetaFile (NvdCveUpdater.java:340)
    at org.owasp.dependencycheck.data.update.NvdCveUpdater.getUpdatesNeeded (NvdCveUpdater.java:385)
    at org.owasp.dependencycheck.data.update.NvdCveUpdater.update (NvdCveUpdater.java:122)
    at org.owasp.dependencycheck.Engine.doUpdates (Engine.java:922)
    at org.owasp.dependencycheck.Engine.initializeAndUpdateDatabase (Engine.java:723)
    at org.owasp.dependencycheck.Engine.analyzeDependencies (Engine.java:653)
    at org.owasp.dependencycheck.maven.BaseDependencyCheckMojo.runCheck (BaseDependencyCheckMojo.java:1403)
    at org.owasp.dependencycheck.maven.BaseDependencyCheckMojo.execute (BaseDependencyCheckMojo.java:802)
    at org.apache.maven.plugin.DefaultBuildPluginManager.executeMojo (DefaultBuildPluginManager.java:137)
    at org.apache.maven.lifecycle.internal.MojoExecutor.execute (MojoExecutor.java:210)
    at org.apache.maven.lifecycle.internal.MojoExecutor.execute (MojoExecutor.java:156)
    at org.apache.maven.lifecycle.internal.MojoExecutor.execute (MojoExecutor.java:148)
    at org.apache.maven.lifecycle.internal.LifecycleModuleBuilder.buildProject (LifecycleModuleBuilder.java:117)
    at org.apache.maven.lifecycle.internal.LifecycleModuleBuilder.buildProject (LifecycleModuleBuilder.java:81)
    at org.apache.maven.lifecycle.internal.builder.singlethreaded.SingleThreadedBuilder.build
(SingleThreadedBuilder.java:56)
    at org.apache.maven.lifecycle.internal.LifecycleStarter.execute (LifecycleStarter.java:128)
    at org.apache.maven.DefaultMaven.doExecute (DefaultMaven.java:305)
    at org.apache.maven.DefaultMaven.doExecute (DefaultMaven.java:192)
    at org.apache.maven.DefaultMaven.execute (DefaultMaven.java:105)
    at org.jvnet.hudson.maven3.launcher.Maven35Launcher.main (Maven35Launcher.java:130)
    at sun.reflect.NativeMethodAccessorImpl.invoke0 (Native Method)
    at sun.reflect.NativeMethodAccessorImpl.invoke (NativeMethodAccessorImpl.java:62)
    at sun.reflect.DelegatingMethodAccessorImpl.invoke (DelegatingMethodAccessorImpl.java:43)
    at java.lang.reflect.Method.invoke (Method.java:498)
    at org.codehaus.plexus.classworlds.launcher.Launcher.launchEnhanced (Launcher.java:289)
    at org.codehaus.plexus.classworlds.launcher.Launcher.launch (Launcher.java:229)
    at jenkins.maven3.agent.Maven35Main.launch (Maven35Main.java:178)
    at sun.reflect.NativeMethodAccessorImpl.invoke0 (Native Method)
    at sun.reflect.NativeMethodAccessorImpl.invoke (NativeMethodAccessorImpl.java:62)
    at sun.reflect.DelegatingMethodAccessorImpl.invoke (DelegatingMethodAccessorImpl.java:43)
    at java.lang.reflect.Method.invoke (Method.java:498)
    at hudson.maven.Maven3Builder.call (Maven3Builder.java:139)
    at hudson.maven.Maven3Builder.call (Maven3Builder.java:70)
    at hudson.remoting.UserRequest.perform (UserRequest.java:212)
    at hudson.remoting.UserRequest.perform (UserRequest.java:54)
    at hudson.remoting.Request$2.run (Request.java:369)
    at hudson.remoting.InterceptingExecutorService$1.call (InterceptingExecutorService.java:72)
    at java.util.concurrent.FutureTask.run (FutureTask.java:266)
    at java.util.concurrent.ThreadPoolExecutor.runWorker (ThreadPoolExecutor.java:1149)
    at java.util.concurrent.ThreadPoolExecutor$Worker.run (ThreadPoolExecutor.java:624)
    at java.lang.Thread.run (Thread.java:748)
Caused by: sun.security.provider.certpath.SunCertPathBuilderException: unable to find valid
certification path to requested target
    at sun.security.provider.certpath.SunCertPathBuilder.build (SunCertPathBuilder.java:141)
    at sun.security.provider.certpath.SunCertPathBuilder.engineBuild (SunCertPathBuilder.java:126)
    at java.security.cert.CertPathBuilder.build (CertPathBuilder.java:280)
    at sun.security.validator.PKIXValidator.doBuild (PKIXValidator.java:392)
    at sun.security.validator.PKIXValidator.engineValidate (PKIXValidator.java:302)
    at sun.security.validator.Validator.validate (Validator.java:262)
    at sun.security.ssl.X509TrustManagerImpl.validate (X509TrustManagerImpl.java:324)
    at sun.security.ssl.X509TrustManagerImpl.checkTrusted (X509TrustManagerImpl.java:229)
    at sun.security.ssl.X509TrustManagerImpl.checkServerTrusted (X509TrustManagerImpl.java:124)
    at sun.security.ssl.ClientHandshaker.serverCertificate (ClientHandshaker.java:1621)
    at sun.security.ssl.ClientHandshaker.processMessage (ClientHandshaker.java:223)
    at sun.security.ssl.Handshaker.processLoop (Handshaker.java:1037)
    at sun.security.ssl.Handshaker.process_record (Handshaker.java:965)
    at sun.security.ssl.SSLSocketImpl.readRecord (SSLSocketImpl.java:1064)
    at sun.security.ssl.SSLSocketImpl.performInitialHandshake (SSLSocketImpl.java:1367)
    at sun.security.ssl.SSLSocketImpl.startHandshake (SSLSocketImpl.java:1395)
    at sun.security.ssl.SSLSocketImpl.startHandshake (SSLSocketImpl.java:1379)
    at sun.net.www.protocol.https.HttpsClient.afterConnect (HttpsClient.java:559)
    at sun.net.www.protocol.https.AbstractDelegateHttpsURLConnection.connect (AbstractDelegateHttpsURLConnection.java:185)
    at sun.net.www.protocol.https.HttpsURLConnectionImpl.connect (HttpsURLConnectionImpl.java:162)
    at org.owasp.dependencycheck.utils.HttpResourceConnection.obtainConnection (HttpResourceConnection.java:178)
    at org.owasp.dependencycheck.utils.HttpResourceConnection.fetch (HttpResourceConnection.java:138)
    at org.owasp.dependencycheck.utils.Downloader.fetchContent (Downloader.java:110)
    at org.owasp.dependencycheck.data.update.NvdCveUpdater.getMetaFile (NvdCveUpdater.java:340)
    at org.owasp.dependencycheck.data.update.NvdCveUpdater.getUpdatesNeeded (NvdCveUpdater.java:385)
    at org.owasp.dependencycheck.data.update.NvdCveUpdater.update (NvdCveUpdater.java:122)
    at org.owasp.dependencycheck.Engine.doUpdates (Engine.java:922)
    at org.owasp.dependencycheck.Engine.initializeAndUpdateDatabase (Engine.java:723)
    at org.owasp.dependencycheck.Engine.analyzeDependencies (Engine.java:653)
    at org.owasp.dependencycheck.maven.BaseDependencyCheckMojo.runCheck (BaseDependencyCheckMojo.java:1403)
    at org.owasp.dependencycheck.maven.BaseDependencyCheckMojo.execute (BaseDependencyCheckMojo.java:802)
    at org.apache.maven.plugin.DefaultBuildPluginManager.executeMojo (DefaultBuildPluginManager.java:137)
    at org.apache.maven.lifecycle.internal.MojoExecutor.execute (MojoExecutor.java:210)
    at org.apache.maven.lifecycle.internal.MojoExecutor.execute (MojoExecutor.java:156)
    at org.apache.maven.lifecycle.internal.MojoExecutor.execute (MojoExecutor.java:148)
    at org.apache.maven.lifecycle.internal.LifecycleModuleBuilder.buildProject (LifecycleModuleBuilder.java:117)
    at org.apache.maven.lifecycle.internal.LifecycleModuleBuilder.buildProject (LifecycleModuleBuilder.java:81)
    at org.apache.maven.lifecycle.internal.builder.singlethreaded.SingleThreadedBuilder.build
(SingleThreadedBuilder.java:56)
    at org.apache.maven.lifecycle.internal.LifecycleStarter.execute (LifecycleStarter.java:128)
    at org.apache.maven.DefaultMaven.doExecute (DefaultMaven.java:305)
    at org.apache.maven.DefaultMaven.doExecute (DefaultMaven.java:192)
    at org.apache.maven.DefaultMaven.execute (DefaultMaven.java:105)
    at org.jvnet.hudson.maven3.launcher.Maven35Launcher.main (Maven35Launcher.java:130)
    at sun.reflect.NativeMethodAccessorImpl.invoke0 (Native Method)
    at sun.reflect.NativeMethodAccessorImpl.invoke (NativeMethodAccessorImpl.java:62)
    at sun.reflect.DelegatingMethodAccessorImpl.invoke (DelegatingMethodAccessorImpl.java:43)
    at java.lang.reflect.Method.invoke (Method.java:498)
    at org.codehaus.plexus.classworlds.launcher.Launcher.launchEnhanced (Launcher.java:289)
    at org.codehaus.plexus.classworlds.launcher.Launcher.launch (Launcher.java:229)
    at jenkins.maven3.agent.Maven35Main.launch (Maven35Main.java:178)
    at sun.reflect.NativeMethodAccessorImpl.invoke0 (Native Method)
    at sun.reflect.NativeMethodAccessorImpl.invoke (NativeMethodAccessorImpl.java:62)
    at sun.reflect.DelegatingMethodAccessorImpl.invoke (DelegatingMethodAccessorImpl.java:43)
    at java.lang.reflect.Method.invoke (Method.java:498)
    at hudson.maven.Maven3Builder.call (Maven3Builder.java:139)
    at hudson.maven.Maven3Builder.call (Maven3Builder.java:70)
    at hudson.remoting.UserRequest.perform (UserRequest.java:212)
    at hudson.remoting.UserRequest.perform (UserRequest.java:54)
    at hudson.remoting.Request$2.run (Request.java:369)
    at hudson.remoting.InterceptingExecutorService$1.call (InterceptingExecutorService.java:72)
    at java.util.concurrent.FutureTask.run (FutureTask.java:266)
    at java.util.concurrent.ThreadPoolExecutor.runWorker (ThreadPoolExecutor.java:1149)
    at java.util.concurrent.ThreadPoolExecutor$Worker.run (ThreadPoolExecutor.java:624)
    at java.lang.Thread.run (Thread.java:748)
[WARNING] Unable to update 1 or more Cached Web DataSource, using local data instead. Results
may not include recent vulnerabilities.
[ERROR] Unable to continue dependency-check analysis.
[INFO] ------------------------------------------------------------------------
[INFO] Reactor Summary for Apache PDFBox 3.0.0-SNAPSHOT:
[INFO] 
[INFO] PDFBox parent ...................................... FAILURE [01:17 min]
[INFO] Apache FontBox ..................................... SKIPPED
[INFO] Apache XmpBox ...................................... SKIPPED
[INFO] Apache PDFBox ...................................... SKIPPED
[INFO] Apache Preflight ................................... SKIPPED
[INFO] Apache Preflight application ....................... SKIPPED
[INFO] Apache PDFBox Debugger ............................. SKIPPED
[INFO] Apache PDFBox tools ................................ SKIPPED
[INFO] Apache PDFBox application .......................... SKIPPED
[INFO] Apache PDFBox Debugger application ................. SKIPPED
[INFO] Apache PDFBox examples ............................. SKIPPED
[INFO] Apache PDFBox ...................................... SKIPPED
[INFO] ------------------------------------------------------------------------
[INFO] BUILD FAILURE
[INFO] ------------------------------------------------------------------------
[INFO] Total time:  01:35 min
[INFO] Finished at: 2019-09-29T19:07:12Z
[INFO] ------------------------------------------------------------------------
Waiting for Jenkins to finish collecting data
[ERROR] Failed to execute goal org.owasp:dependency-check-maven:5.2.2:check (default) on project
pdfbox-parent: Fatal exception(s) analyzing PDFBox parent: One or more exceptions occurred
during analysis:
[ERROR] Unable to download meta file: https://nvd.nist.gov/feeds/json/cve/1.0/nvdcve-1.0-modified.meta
[ERROR] No documents exist
[ERROR] -> [Help 1]
[ERROR] 
[ERROR] To see the full stack trace of the errors, re-run Maven with the -e switch.
[ERROR] Re-run Maven using the -X switch to enable full debug logging.
[ERROR] 
[ERROR] For more information about the errors and possible solutions, please read the following
articles:
[ERROR] [Help 1] http://cwiki.apache.org/confluence/display/MAVEN/MojoExecutionException
[JENKINS] Archiving <https://builds.apache.org/job/PDFBox-trunk/ws/trunk/xmpbox/pom.xml>
to org.apache.pdfbox/xmpbox/3.0.0-SNAPSHOT/xmpbox-3.0.0-SNAPSHOT.pom
[JENKINS] Archiving <https://builds.apache.org/job/PDFBox-trunk/ws/trunk/tools/pom.xml>
to org.apache.pdfbox/pdfbox-tools/3.0.0-SNAPSHOT/pdfbox-tools-3.0.0-SNAPSHOT.pom
[JENKINS] Archiving <https://builds.apache.org/job/PDFBox-trunk/ws/trunk/debugger/pom.xml>
to org.apache.pdfbox/pdfbox-debugger/3.0.0-SNAPSHOT/pdfbox-debugger-3.0.0-SNAPSHOT.pom
[JENKINS] Archiving <https://builds.apache.org/job/PDFBox-trunk/ws/trunk/preflight-app/pom.xml>
to org.apache.pdfbox/preflight-app/3.0.0-SNAPSHOT/preflight-app-3.0.0-SNAPSHOT.pom
[JENKINS] Archiving <https://builds.apache.org/job/PDFBox-trunk/ws/trunk/app/pom.xml>
to org.apache.pdfbox/pdfbox-app/3.0.0-SNAPSHOT/pdfbox-app-3.0.0-SNAPSHOT.pom
[JENKINS] Archiving <https://builds.apache.org/job/PDFBox-trunk/ws/trunk/examples/pom.xml>
to org.apache.pdfbox/pdfbox-examples/3.0.0-SNAPSHOT/pdfbox-examples-3.0.0-SNAPSHOT.pom
[JENKINS] Archiving <https://builds.apache.org/job/PDFBox-trunk/ws/trunk/preflight/pom.xml>
to org.apache.pdfbox/preflight/3.0.0-SNAPSHOT/preflight-3.0.0-SNAPSHOT.pom
[JENKINS] Archiving <https://builds.apache.org/job/PDFBox-trunk/ws/trunk/pom.xml> to
org.apache.pdfbox/pdfbox-reactor/3.0.0-SNAPSHOT/pdfbox-reactor-3.0.0-SNAPSHOT.pom
[JENKINS] Archiving <https://builds.apache.org/job/PDFBox-trunk/ws/trunk/parent/pom.xml>
to org.apache.pdfbox/pdfbox-parent/3.0.0-SNAPSHOT/pdfbox-parent-3.0.0-SNAPSHOT.pom
[JENKINS] Archiving <https://builds.apache.org/job/PDFBox-trunk/ws/trunk/pdfbox/pom.xml>
to org.apache.pdfbox/pdfbox/3.0.0-SNAPSHOT/pdfbox-3.0.0-SNAPSHOT.pom
[JENKINS] Archiving <https://builds.apache.org/job/PDFBox-trunk/ws/trunk/debugger-app/pom.xml>
to org.apache.pdfbox/debugger-app/3.0.0-SNAPSHOT/debugger-app-3.0.0-SNAPSHOT.pom
[JENKINS] Archiving <https://builds.apache.org/job/PDFBox-trunk/ws/trunk/fontbox/pom.xml>
to org.apache.pdfbox/fontbox/3.0.0-SNAPSHOT/fontbox-3.0.0-SNAPSHOT.pom
No mail will be sent out, as 'PDFBox-trunk » Apache PDFBox examples #4889' does not have
a result yet. Please make sure you set a proper result in case of pipeline/build scripts.
Sending e-mails to: dev@pdfbox.apache.org
No mail will be sent out, as 'PDFBox-trunk » Apache PDFBox #4889' does not have a result
yet. Please make sure you set a proper result in case of pipeline/build scripts.
No mail will be sent out, as 'PDFBox-trunk » Apache PDFBox Debugger application #4889'
does not have a result yet. Please make sure you set a proper result in case of pipeline/build
scripts.
No mail will be sent out, as 'PDFBox-trunk » Apache FontBox #4889' does not have a result
yet. Please make sure you set a proper result in case of pipeline/build scripts.
No mail will be sent out, as 'PDFBox-trunk » Apache XmpBox #4889' does not have a result
yet. Please make sure you set a proper result in case of pipeline/build scripts.
No mail will be sent out, as 'PDFBox-trunk » Apache PDFBox tools #4889' does not have a
result yet. Please make sure you set a proper result in case of pipeline/build scripts.
No mail will be sent out, as 'PDFBox-trunk » Apache PDFBox Debugger #4889' does not have
a result yet. Please make sure you set a proper result in case of pipeline/build scripts.
No mail will be sent out, as 'PDFBox-trunk » Apache Preflight application #4889' does not
have a result yet. Please make sure you set a proper result in case of pipeline/build scripts.
No mail will be sent out, as 'PDFBox-trunk » Apache PDFBox application #4889' does not
have a result yet. Please make sure you set a proper result in case of pipeline/build scripts.
No mail will be sent out, as 'PDFBox-trunk » Apache Preflight #4889' does not have a result
yet. Please make sure you set a proper result in case of pipeline/build scripts.
No mail will be sent out, as 'PDFBox-trunk » Apache PDFBox #4889' does not have a result
yet. Please make sure you set a proper result in case of pipeline/build scripts.
channel stopped
Archiving artifacts

---------------------------------------------------------------------
To unsubscribe, e-mail: dev-unsubscribe@pdfbox.apache.org
For additional commands, e-mail: dev-help@pdfbox.apache.org


Mime
View raw message