pdfbox-dev mailing list archives

Site index · List index
Message view « Date » · « Thread »
Top « Date » · « Thread »
From Apache Jenkins Server <jenk...@builds.apache.org>
Subject Build failed in Jenkins: PDFBox-Trunk-jdk13 » PDFBox parent #931
Date Mon, 30 Sep 2019 07:33:10 GMT
See <https://builds.apache.org/job/PDFBox-Trunk-jdk13/org.apache.pdfbox$pdfbox-parent/931/display/redirect>

Changes:


------------------------------------------
[...truncated 14.50 KB...]
    at hudson.remoting.UserRequest.perform (UserRequest.java:54)
    at hudson.remoting.Request$2.run (Request.java:369)
    at hudson.remoting.InterceptingExecutorService$1.call (InterceptingExecutorService.java:72)
    at java.util.concurrent.FutureTask.run (FutureTask.java:264)
    at java.util.concurrent.ThreadPoolExecutor.runWorker (ThreadPoolExecutor.java:1128)
    at java.util.concurrent.ThreadPoolExecutor$Worker.run (ThreadPoolExecutor.java:628)
    at java.lang.Thread.run (Thread.java:830)
Caused by: org.owasp.dependencycheck.utils.DownloadFailedException: Error downloading file
https://nvd.nist.gov/feeds/json/cve/1.0/nvdcve-1.0-modified.meta; unable to connect.
    at org.owasp.dependencycheck.utils.HttpResourceConnection.obtainConnection (HttpResourceConnection.java:238)
    at org.owasp.dependencycheck.utils.HttpResourceConnection.fetch (HttpResourceConnection.java:138)
    at org.owasp.dependencycheck.utils.Downloader.fetchContent (Downloader.java:110)
    at org.owasp.dependencycheck.data.update.NvdCveUpdater.getMetaFile (NvdCveUpdater.java:340)
    at org.owasp.dependencycheck.data.update.NvdCveUpdater.getUpdatesNeeded (NvdCveUpdater.java:385)
    at org.owasp.dependencycheck.data.update.NvdCveUpdater.update (NvdCveUpdater.java:122)
    at org.owasp.dependencycheck.Engine.doUpdates (Engine.java:922)
    at org.owasp.dependencycheck.Engine.initializeAndUpdateDatabase (Engine.java:723)
    at org.owasp.dependencycheck.Engine.analyzeDependencies (Engine.java:653)
    at org.owasp.dependencycheck.maven.BaseDependencyCheckMojo.runCheck (BaseDependencyCheckMojo.java:1403)
    at org.owasp.dependencycheck.maven.BaseDependencyCheckMojo.execute (BaseDependencyCheckMojo.java:802)
    at org.apache.maven.plugin.DefaultBuildPluginManager.executeMojo (DefaultBuildPluginManager.java:137)
    at org.apache.maven.lifecycle.internal.MojoExecutor.execute (MojoExecutor.java:210)
    at org.apache.maven.lifecycle.internal.MojoExecutor.execute (MojoExecutor.java:156)
    at org.apache.maven.lifecycle.internal.MojoExecutor.execute (MojoExecutor.java:148)
    at org.apache.maven.lifecycle.internal.LifecycleModuleBuilder.buildProject (LifecycleModuleBuilder.java:117)
    at org.apache.maven.lifecycle.internal.LifecycleModuleBuilder.buildProject (LifecycleModuleBuilder.java:81)
    at org.apache.maven.lifecycle.internal.builder.singlethreaded.SingleThreadedBuilder.build
(SingleThreadedBuilder.java:56)
    at org.apache.maven.lifecycle.internal.LifecycleStarter.execute (LifecycleStarter.java:128)
    at org.apache.maven.DefaultMaven.doExecute (DefaultMaven.java:305)
    at org.apache.maven.DefaultMaven.doExecute (DefaultMaven.java:192)
    at org.apache.maven.DefaultMaven.execute (DefaultMaven.java:105)
    at org.jvnet.hudson.maven3.launcher.Maven35Launcher.main (Maven35Launcher.java:130)
    at jdk.internal.reflect.NativeMethodAccessorImpl.invoke0 (Native Method)
    at jdk.internal.reflect.NativeMethodAccessorImpl.invoke (NativeMethodAccessorImpl.java:62)
    at jdk.internal.reflect.DelegatingMethodAccessorImpl.invoke (DelegatingMethodAccessorImpl.java:43)
    at java.lang.reflect.Method.invoke (Method.java:567)
    at org.codehaus.plexus.classworlds.launcher.Launcher.launchEnhanced (Launcher.java:289)
    at org.codehaus.plexus.classworlds.launcher.Launcher.launch (Launcher.java:229)
    at jenkins.maven3.agent.Maven35Main.launch (Maven35Main.java:178)
    at jdk.internal.reflect.NativeMethodAccessorImpl.invoke0 (Native Method)
    at jdk.internal.reflect.NativeMethodAccessorImpl.invoke (NativeMethodAccessorImpl.java:62)
    at jdk.internal.reflect.DelegatingMethodAccessorImpl.invoke (DelegatingMethodAccessorImpl.java:43)
    at java.lang.reflect.Method.invoke (Method.java:567)
    at hudson.maven.Maven3Builder.call (Maven3Builder.java:139)
    at hudson.maven.Maven3Builder.call (Maven3Builder.java:70)
    at hudson.remoting.UserRequest.perform (UserRequest.java:212)
    at hudson.remoting.UserRequest.perform (UserRequest.java:54)
    at hudson.remoting.Request$2.run (Request.java:369)
    at hudson.remoting.InterceptingExecutorService$1.call (InterceptingExecutorService.java:72)
    at java.util.concurrent.FutureTask.run (FutureTask.java:264)
    at java.util.concurrent.ThreadPoolExecutor.runWorker (ThreadPoolExecutor.java:1128)
    at java.util.concurrent.ThreadPoolExecutor$Worker.run (ThreadPoolExecutor.java:628)
    at java.lang.Thread.run (Thread.java:830)
Caused by: javax.net.ssl.SSLHandshakeException: PKIX path building failed: sun.security.provider.certpath.SunCertPathBuilderException:
unable to find valid certification path to requested target
    at sun.security.ssl.Alert.createSSLException (Alert.java:131)
    at sun.security.ssl.TransportContext.fatal (TransportContext.java:324)
    at sun.security.ssl.TransportContext.fatal (TransportContext.java:267)
    at sun.security.ssl.TransportContext.fatal (TransportContext.java:262)
    at sun.security.ssl.CertificateMessage$T12CertificateConsumer.checkServerCerts (CertificateMessage.java:641)
    at sun.security.ssl.CertificateMessage$T12CertificateConsumer.onCertificate (CertificateMessage.java:460)
    at sun.security.ssl.CertificateMessage$T12CertificateConsumer.consume (CertificateMessage.java:360)
    at sun.security.ssl.SSLHandshake.consume (SSLHandshake.java:396)
    at sun.security.ssl.HandshakeContext.dispatch (HandshakeContext.java:444)
    at sun.security.ssl.HandshakeContext.dispatch (HandshakeContext.java:422)
    at sun.security.ssl.TransportContext.dispatch (TransportContext.java:181)
    at sun.security.ssl.SSLTransport.decode (SSLTransport.java:164)
    at sun.security.ssl.SSLSocketImpl.decode (SSLSocketImpl.java:1460)
    at sun.security.ssl.SSLSocketImpl.readHandshakeRecord (SSLSocketImpl.java:1368)
    at sun.security.ssl.SSLSocketImpl.startHandshake (SSLSocketImpl.java:437)
    at sun.net.www.protocol.https.HttpsClient.afterConnect (HttpsClient.java:567)
    at sun.net.www.protocol.https.AbstractDelegateHttpsURLConnection.connect (AbstractDelegateHttpsURLConnection.java:171)
    at sun.net.www.protocol.https.HttpsURLConnectionImpl.connect (HttpsURLConnectionImpl.java:142)
    at org.owasp.dependencycheck.utils.HttpResourceConnection.obtainConnection (HttpResourceConnection.java:178)
    at org.owasp.dependencycheck.utils.HttpResourceConnection.fetch (HttpResourceConnection.java:138)
    at org.owasp.dependencycheck.utils.Downloader.fetchContent (Downloader.java:110)
    at org.owasp.dependencycheck.data.update.NvdCveUpdater.getMetaFile (NvdCveUpdater.java:340)
    at org.owasp.dependencycheck.data.update.NvdCveUpdater.getUpdatesNeeded (NvdCveUpdater.java:385)
    at org.owasp.dependencycheck.data.update.NvdCveUpdater.update (NvdCveUpdater.java:122)
    at org.owasp.dependencycheck.Engine.doUpdates (Engine.java:922)
    at org.owasp.dependencycheck.Engine.initializeAndUpdateDatabase (Engine.java:723)
    at org.owasp.dependencycheck.Engine.analyzeDependencies (Engine.java:653)
    at org.owasp.dependencycheck.maven.BaseDependencyCheckMojo.runCheck (BaseDependencyCheckMojo.java:1403)
    at org.owasp.dependencycheck.maven.BaseDependencyCheckMojo.execute (BaseDependencyCheckMojo.java:802)
    at org.apache.maven.plugin.DefaultBuildPluginManager.executeMojo (DefaultBuildPluginManager.java:137)
    at org.apache.maven.lifecycle.internal.MojoExecutor.execute (MojoExecutor.java:210)
    at org.apache.maven.lifecycle.internal.MojoExecutor.execute (MojoExecutor.java:156)
    at org.apache.maven.lifecycle.internal.MojoExecutor.execute (MojoExecutor.java:148)
    at org.apache.maven.lifecycle.internal.LifecycleModuleBuilder.buildProject (LifecycleModuleBuilder.java:117)
    at org.apache.maven.lifecycle.internal.LifecycleModuleBuilder.buildProject (LifecycleModuleBuilder.java:81)
    at org.apache.maven.lifecycle.internal.builder.singlethreaded.SingleThreadedBuilder.build
(SingleThreadedBuilder.java:56)
    at org.apache.maven.lifecycle.internal.LifecycleStarter.execute (LifecycleStarter.java:128)
    at org.apache.maven.DefaultMaven.doExecute (DefaultMaven.java:305)
    at org.apache.maven.DefaultMaven.doExecute (DefaultMaven.java:192)
    at org.apache.maven.DefaultMaven.execute (DefaultMaven.java:105)
    at org.jvnet.hudson.maven3.launcher.Maven35Launcher.main (Maven35Launcher.java:130)
    at jdk.internal.reflect.NativeMethodAccessorImpl.invoke0 (Native Method)
    at jdk.internal.reflect.NativeMethodAccessorImpl.invoke (NativeMethodAccessorImpl.java:62)
    at jdk.internal.reflect.DelegatingMethodAccessorImpl.invoke (DelegatingMethodAccessorImpl.java:43)
    at java.lang.reflect.Method.invoke (Method.java:567)
    at org.codehaus.plexus.classworlds.launcher.Launcher.launchEnhanced (Launcher.java:289)
    at org.codehaus.plexus.classworlds.launcher.Launcher.launch (Launcher.java:229)
    at jenkins.maven3.agent.Maven35Main.launch (Maven35Main.java:178)
    at jdk.internal.reflect.NativeMethodAccessorImpl.invoke0 (Native Method)
    at jdk.internal.reflect.NativeMethodAccessorImpl.invoke (NativeMethodAccessorImpl.java:62)
    at jdk.internal.reflect.DelegatingMethodAccessorImpl.invoke (DelegatingMethodAccessorImpl.java:43)
    at java.lang.reflect.Method.invoke (Method.java:567)
    at hudson.maven.Maven3Builder.call (Maven3Builder.java:139)
    at hudson.maven.Maven3Builder.call (Maven3Builder.java:70)
    at hudson.remoting.UserRequest.perform (UserRequest.java:212)
    at hudson.remoting.UserRequest.perform (UserRequest.java:54)
    at hudson.remoting.Request$2.run (Request.java:369)
    at hudson.remoting.InterceptingExecutorService$1.call (InterceptingExecutorService.java:72)
    at java.util.concurrent.FutureTask.run (FutureTask.java:264)
    at java.util.concurrent.ThreadPoolExecutor.runWorker (ThreadPoolExecutor.java:1128)
    at java.util.concurrent.ThreadPoolExecutor$Worker.run (ThreadPoolExecutor.java:628)
    at java.lang.Thread.run (Thread.java:830)
Caused by: sun.security.validator.ValidatorException: PKIX path building failed: sun.security.provider.certpath.SunCertPathBuilderException:
unable to find valid certification path to requested target
    at sun.security.validator.PKIXValidator.doBuild (PKIXValidator.java:384)
    at sun.security.validator.PKIXValidator.engineValidate (PKIXValidator.java:289)
    at sun.security.validator.Validator.validate (Validator.java:264)
    at sun.security.ssl.X509TrustManagerImpl.checkTrusted (X509TrustManagerImpl.java:231)
    at sun.security.ssl.X509TrustManagerImpl.checkServerTrusted (X509TrustManagerImpl.java:132)
    at sun.security.ssl.CertificateMessage$T12CertificateConsumer.checkServerCerts (CertificateMessage.java:625)
    at sun.security.ssl.CertificateMessage$T12CertificateConsumer.onCertificate (CertificateMessage.java:460)
    at sun.security.ssl.CertificateMessage$T12CertificateConsumer.consume (CertificateMessage.java:360)
    at sun.security.ssl.SSLHandshake.consume (SSLHandshake.java:396)
    at sun.security.ssl.HandshakeContext.dispatch (HandshakeContext.java:444)
    at sun.security.ssl.HandshakeContext.dispatch (HandshakeContext.java:422)
    at sun.security.ssl.TransportContext.dispatch (TransportContext.java:181)
    at sun.security.ssl.SSLTransport.decode (SSLTransport.java:164)
    at sun.security.ssl.SSLSocketImpl.decode (SSLSocketImpl.java:1460)
    at sun.security.ssl.SSLSocketImpl.readHandshakeRecord (SSLSocketImpl.java:1368)
    at sun.security.ssl.SSLSocketImpl.startHandshake (SSLSocketImpl.java:437)
    at sun.net.www.protocol.https.HttpsClient.afterConnect (HttpsClient.java:567)
    at sun.net.www.protocol.https.AbstractDelegateHttpsURLConnection.connect (AbstractDelegateHttpsURLConnection.java:171)
    at sun.net.www.protocol.https.HttpsURLConnectionImpl.connect (HttpsURLConnectionImpl.java:142)
    at org.owasp.dependencycheck.utils.HttpResourceConnection.obtainConnection (HttpResourceConnection.java:178)
    at org.owasp.dependencycheck.utils.HttpResourceConnection.fetch (HttpResourceConnection.java:138)
    at org.owasp.dependencycheck.utils.Downloader.fetchContent (Downloader.java:110)
    at org.owasp.dependencycheck.data.update.NvdCveUpdater.getMetaFile (NvdCveUpdater.java:340)
    at org.owasp.dependencycheck.data.update.NvdCveUpdater.getUpdatesNeeded (NvdCveUpdater.java:385)
    at org.owasp.dependencycheck.data.update.NvdCveUpdater.update (NvdCveUpdater.java:122)
    at org.owasp.dependencycheck.Engine.doUpdates (Engine.java:922)
    at org.owasp.dependencycheck.Engine.initializeAndUpdateDatabase (Engine.java:723)
    at org.owasp.dependencycheck.Engine.analyzeDependencies (Engine.java:653)
    at org.owasp.dependencycheck.maven.BaseDependencyCheckMojo.runCheck (BaseDependencyCheckMojo.java:1403)
    at org.owasp.dependencycheck.maven.BaseDependencyCheckMojo.execute (BaseDependencyCheckMojo.java:802)
    at org.apache.maven.plugin.DefaultBuildPluginManager.executeMojo (DefaultBuildPluginManager.java:137)
    at org.apache.maven.lifecycle.internal.MojoExecutor.execute (MojoExecutor.java:210)
    at org.apache.maven.lifecycle.internal.MojoExecutor.execute (MojoExecutor.java:156)
    at org.apache.maven.lifecycle.internal.MojoExecutor.execute (MojoExecutor.java:148)
    at org.apache.maven.lifecycle.internal.LifecycleModuleBuilder.buildProject (LifecycleModuleBuilder.java:117)
    at org.apache.maven.lifecycle.internal.LifecycleModuleBuilder.buildProject (LifecycleModuleBuilder.java:81)
    at org.apache.maven.lifecycle.internal.builder.singlethreaded.SingleThreadedBuilder.build
(SingleThreadedBuilder.java:56)
    at org.apache.maven.lifecycle.internal.LifecycleStarter.execute (LifecycleStarter.java:128)
    at org.apache.maven.DefaultMaven.doExecute (DefaultMaven.java:305)
    at org.apache.maven.DefaultMaven.doExecute (DefaultMaven.java:192)
    at org.apache.maven.DefaultMaven.execute (DefaultMaven.java:105)
    at org.jvnet.hudson.maven3.launcher.Maven35Launcher.main (Maven35Launcher.java:130)
    at jdk.internal.reflect.NativeMethodAccessorImpl.invoke0 (Native Method)
    at jdk.internal.reflect.NativeMethodAccessorImpl.invoke (NativeMethodAccessorImpl.java:62)
    at jdk.internal.reflect.DelegatingMethodAccessorImpl.invoke (DelegatingMethodAccessorImpl.java:43)
    at java.lang.reflect.Method.invoke (Method.java:567)
    at org.codehaus.plexus.classworlds.launcher.Launcher.launchEnhanced (Launcher.java:289)
    at org.codehaus.plexus.classworlds.launcher.Launcher.launch (Launcher.java:229)
    at jenkins.maven3.agent.Maven35Main.launch (Maven35Main.java:178)
    at jdk.internal.reflect.NativeMethodAccessorImpl.invoke0 (Native Method)
    at jdk.internal.reflect.NativeMethodAccessorImpl.invoke (NativeMethodAccessorImpl.java:62)
    at jdk.internal.reflect.DelegatingMethodAccessorImpl.invoke (DelegatingMethodAccessorImpl.java:43)
    at java.lang.reflect.Method.invoke (Method.java:567)
    at hudson.maven.Maven3Builder.call (Maven3Builder.java:139)
    at hudson.maven.Maven3Builder.call (Maven3Builder.java:70)
    at hudson.remoting.UserRequest.perform (UserRequest.java:212)
    at hudson.remoting.UserRequest.perform (UserRequest.java:54)
    at hudson.remoting.Request$2.run (Request.java:369)
    at hudson.remoting.InterceptingExecutorService$1.call (InterceptingExecutorService.java:72)
    at java.util.concurrent.FutureTask.run (FutureTask.java:264)
    at java.util.concurrent.ThreadPoolExecutor.runWorker (ThreadPoolExecutor.java:1128)
    at java.util.concurrent.ThreadPoolExecutor$Worker.run (ThreadPoolExecutor.java:628)
    at java.lang.Thread.run (Thread.java:830)
Caused by: sun.security.provider.certpath.SunCertPathBuilderException: unable to find valid
certification path to requested target
    at sun.security.provider.certpath.SunCertPathBuilder.build (SunCertPathBuilder.java:141)
    at sun.security.provider.certpath.SunCertPathBuilder.engineBuild (SunCertPathBuilder.java:126)
    at java.security.cert.CertPathBuilder.build (CertPathBuilder.java:297)
    at sun.security.validator.PKIXValidator.doBuild (PKIXValidator.java:379)
    at sun.security.validator.PKIXValidator.engineValidate (PKIXValidator.java:289)
    at sun.security.validator.Validator.validate (Validator.java:264)
    at sun.security.ssl.X509TrustManagerImpl.checkTrusted (X509TrustManagerImpl.java:231)
    at sun.security.ssl.X509TrustManagerImpl.checkServerTrusted (X509TrustManagerImpl.java:132)
    at sun.security.ssl.CertificateMessage$T12CertificateConsumer.checkServerCerts (CertificateMessage.java:625)
    at sun.security.ssl.CertificateMessage$T12CertificateConsumer.onCertificate (CertificateMessage.java:460)
    at sun.security.ssl.CertificateMessage$T12CertificateConsumer.consume (CertificateMessage.java:360)
    at sun.security.ssl.SSLHandshake.consume (SSLHandshake.java:396)
    at sun.security.ssl.HandshakeContext.dispatch (HandshakeContext.java:444)
    at sun.security.ssl.HandshakeContext.dispatch (HandshakeContext.java:422)
    at sun.security.ssl.TransportContext.dispatch (TransportContext.java:181)
    at sun.security.ssl.SSLTransport.decode (SSLTransport.java:164)
    at sun.security.ssl.SSLSocketImpl.decode (SSLSocketImpl.java:1460)
    at sun.security.ssl.SSLSocketImpl.readHandshakeRecord (SSLSocketImpl.java:1368)
    at sun.security.ssl.SSLSocketImpl.startHandshake (SSLSocketImpl.java:437)
    at sun.net.www.protocol.https.HttpsClient.afterConnect (HttpsClient.java:567)
    at sun.net.www.protocol.https.AbstractDelegateHttpsURLConnection.connect (AbstractDelegateHttpsURLConnection.java:171)
    at sun.net.www.protocol.https.HttpsURLConnectionImpl.connect (HttpsURLConnectionImpl.java:142)
    at org.owasp.dependencycheck.utils.HttpResourceConnection.obtainConnection (HttpResourceConnection.java:178)
    at org.owasp.dependencycheck.utils.HttpResourceConnection.fetch (HttpResourceConnection.java:138)
    at org.owasp.dependencycheck.utils.Downloader.fetchContent (Downloader.java:110)
    at org.owasp.dependencycheck.data.update.NvdCveUpdater.getMetaFile (NvdCveUpdater.java:340)
    at org.owasp.dependencycheck.data.update.NvdCveUpdater.getUpdatesNeeded (NvdCveUpdater.java:385)
    at org.owasp.dependencycheck.data.update.NvdCveUpdater.update (NvdCveUpdater.java:122)
    at org.owasp.dependencycheck.Engine.doUpdates (Engine.java:922)
    at org.owasp.dependencycheck.Engine.initializeAndUpdateDatabase (Engine.java:723)
    at org.owasp.dependencycheck.Engine.analyzeDependencies (Engine.java:653)
    at org.owasp.dependencycheck.maven.BaseDependencyCheckMojo.runCheck (BaseDependencyCheckMojo.java:1403)
    at org.owasp.dependencycheck.maven.BaseDependencyCheckMojo.execute (BaseDependencyCheckMojo.java:802)
    at org.apache.maven.plugin.DefaultBuildPluginManager.executeMojo (DefaultBuildPluginManager.java:137)
    at org.apache.maven.lifecycle.internal.MojoExecutor.execute (MojoExecutor.java:210)
    at org.apache.maven.lifecycle.internal.MojoExecutor.execute (MojoExecutor.java:156)
    at org.apache.maven.lifecycle.internal.MojoExecutor.execute (MojoExecutor.java:148)
    at org.apache.maven.lifecycle.internal.LifecycleModuleBuilder.buildProject (LifecycleModuleBuilder.java:117)
    at org.apache.maven.lifecycle.internal.LifecycleModuleBuilder.buildProject (LifecycleModuleBuilder.java:81)
    at org.apache.maven.lifecycle.internal.builder.singlethreaded.SingleThreadedBuilder.build
(SingleThreadedBuilder.java:56)
    at org.apache.maven.lifecycle.internal.LifecycleStarter.execute (LifecycleStarter.java:128)
    at org.apache.maven.DefaultMaven.doExecute (DefaultMaven.java:305)
    at org.apache.maven.DefaultMaven.doExecute (DefaultMaven.java:192)
    at org.apache.maven.DefaultMaven.execute (DefaultMaven.java:105)
    at org.jvnet.hudson.maven3.launcher.Maven35Launcher.main (Maven35Launcher.java:130)
    at jdk.internal.reflect.NativeMethodAccessorImpl.invoke0 (Native Method)
    at jdk.internal.reflect.NativeMethodAccessorImpl.invoke (NativeMethodAccessorImpl.java:62)
    at jdk.internal.reflect.DelegatingMethodAccessorImpl.invoke (DelegatingMethodAccessorImpl.java:43)
    at java.lang.reflect.Method.invoke (Method.java:567)
    at org.codehaus.plexus.classworlds.launcher.Launcher.launchEnhanced (Launcher.java:289)
    at org.codehaus.plexus.classworlds.launcher.Launcher.launch (Launcher.java:229)
    at jenkins.maven3.agent.Maven35Main.launch (Maven35Main.java:178)
    at jdk.internal.reflect.NativeMethodAccessorImpl.invoke0 (Native Method)
    at jdk.internal.reflect.NativeMethodAccessorImpl.invoke (NativeMethodAccessorImpl.java:62)
    at jdk.internal.reflect.DelegatingMethodAccessorImpl.invoke (DelegatingMethodAccessorImpl.java:43)
    at java.lang.reflect.Method.invoke (Method.java:567)
    at hudson.maven.Maven3Builder.call (Maven3Builder.java:139)
    at hudson.maven.Maven3Builder.call (Maven3Builder.java:70)
    at hudson.remoting.UserRequest.perform (UserRequest.java:212)
    at hudson.remoting.UserRequest.perform (UserRequest.java:54)
    at hudson.remoting.Request$2.run (Request.java:369)
    at hudson.remoting.InterceptingExecutorService$1.call (InterceptingExecutorService.java:72)
    at java.util.concurrent.FutureTask.run (FutureTask.java:264)
    at java.util.concurrent.ThreadPoolExecutor.runWorker (ThreadPoolExecutor.java:1128)
    at java.util.concurrent.ThreadPoolExecutor$Worker.run (ThreadPoolExecutor.java:628)
    at java.lang.Thread.run (Thread.java:830)
[INFO] Skipping RetireJS update since last update was within 24 hours.
[WARNING] Unable to update 1 or more Cached Web DataSource, using local data instead. Results
may not include recent vulnerabilities.
[ERROR] Unable to continue dependency-check analysis.

---------------------------------------------------------------------
To unsubscribe, e-mail: dev-unsubscribe@pdfbox.apache.org
For additional commands, e-mail: dev-help@pdfbox.apache.org


Mime
View raw message