pdfbox-dev mailing list archives

Site index · List index
Message view « Date » · « Thread »
Top « Date » · « Thread »
From Apache Jenkins Server <jenk...@builds.apache.org>
Subject Build failed in Jenkins: PDFBox-Trunk-jdk14 #377
Date Tue, 24 Sep 2019 11:24:41 GMT
See <https://builds.apache.org/job/PDFBox-Trunk-jdk14/377/display/redirect?page=changes>

Changes:

[tilman] PDFBOX-4071: set @FunctionalInterface

[tilman] PDFBOX-4071: use jdk8 lambda expressions

[tilman] PDFBOX-4071: use jdk8 lambda expressions

[tilman] PDFBOX-4071: remove unused import

------------------------------------------
[...truncated 8.67 KB...]
[INFO] Finished adding exclusions from SCM ignore files.
[INFO] 61 implicit excludes (use -debug for more details).
[INFO] Exclude: release.properties
[INFO] 1 resources included (use -debug for more details)
[INFO] Rat check: Summary over all files. Unapproved: 0, unknown: 0, generated: 0, approved:
1 licenses.
[INFO] 
[INFO] --- dependency-check-maven:5.2.1:check (default) @ pdfbox-parent ---
[INFO] Checking for updates
[ERROR] Unable to download meta file: https://nvd.nist.gov/feeds/json/cve/1.0/nvdcve-1.0-modified.meta
org.owasp.dependencycheck.data.update.exception.UpdateException: Unable to download meta file:
https://nvd.nist.gov/feeds/json/cve/1.0/nvdcve-1.0-modified.meta
    at org.owasp.dependencycheck.data.update.NvdCveUpdater.getMetaFile (NvdCveUpdater.java:347)
    at org.owasp.dependencycheck.data.update.NvdCveUpdater.getUpdatesNeeded (NvdCveUpdater.java:385)
    at org.owasp.dependencycheck.data.update.NvdCveUpdater.update (NvdCveUpdater.java:122)
    at org.owasp.dependencycheck.Engine.doUpdates (Engine.java:922)
    at org.owasp.dependencycheck.Engine.initializeAndUpdateDatabase (Engine.java:723)
    at org.owasp.dependencycheck.Engine.analyzeDependencies (Engine.java:653)
    at org.owasp.dependencycheck.maven.BaseDependencyCheckMojo.runCheck (BaseDependencyCheckMojo.java:1403)
    at org.owasp.dependencycheck.maven.BaseDependencyCheckMojo.execute (BaseDependencyCheckMojo.java:802)
    at org.apache.maven.plugin.DefaultBuildPluginManager.executeMojo (DefaultBuildPluginManager.java:137)
    at org.apache.maven.lifecycle.internal.MojoExecutor.execute (MojoExecutor.java:210)
    at org.apache.maven.lifecycle.internal.MojoExecutor.execute (MojoExecutor.java:156)
    at org.apache.maven.lifecycle.internal.MojoExecutor.execute (MojoExecutor.java:148)
    at org.apache.maven.lifecycle.internal.LifecycleModuleBuilder.buildProject (LifecycleModuleBuilder.java:117)
    at org.apache.maven.lifecycle.internal.LifecycleModuleBuilder.buildProject (LifecycleModuleBuilder.java:81)
    at org.apache.maven.lifecycle.internal.builder.singlethreaded.SingleThreadedBuilder.build
(SingleThreadedBuilder.java:56)
    at org.apache.maven.lifecycle.internal.LifecycleStarter.execute (LifecycleStarter.java:128)
    at org.apache.maven.DefaultMaven.doExecute (DefaultMaven.java:305)
    at org.apache.maven.DefaultMaven.doExecute (DefaultMaven.java:192)
    at org.apache.maven.DefaultMaven.execute (DefaultMaven.java:105)
    at org.jvnet.hudson.maven3.launcher.Maven35Launcher.main (Maven35Launcher.java:130)
    at jdk.internal.reflect.NativeMethodAccessorImpl.invoke0 (Native Method)
    at jdk.internal.reflect.NativeMethodAccessorImpl.invoke (NativeMethodAccessorImpl.java:62)
    at jdk.internal.reflect.DelegatingMethodAccessorImpl.invoke (DelegatingMethodAccessorImpl.java:43)
    at java.lang.reflect.Method.invoke (Method.java:565)
    at org.codehaus.plexus.classworlds.launcher.Launcher.launchEnhanced (Launcher.java:289)
    at org.codehaus.plexus.classworlds.launcher.Launcher.launch (Launcher.java:229)
    at jenkins.maven3.agent.Maven35Main.launch (Maven35Main.java:176)
    at jdk.internal.reflect.NativeMethodAccessorImpl.invoke0 (Native Method)
    at jdk.internal.reflect.NativeMethodAccessorImpl.invoke (NativeMethodAccessorImpl.java:62)
    at jdk.internal.reflect.DelegatingMethodAccessorImpl.invoke (DelegatingMethodAccessorImpl.java:43)
    at java.lang.reflect.Method.invoke (Method.java:565)
    at hudson.maven.Maven3Builder.call (Maven3Builder.java:139)
    at hudson.maven.Maven3Builder.call (Maven3Builder.java:70)
    at hudson.remoting.UserRequest.perform (UserRequest.java:212)
    at hudson.remoting.UserRequest.perform (UserRequest.java:54)
    at hudson.remoting.Request$2.run (Request.java:369)
    at hudson.remoting.InterceptingExecutorService$1.call (InterceptingExecutorService.java:72)
    at java.util.concurrent.FutureTask.run (FutureTask.java:264)
    at java.util.concurrent.ThreadPoolExecutor.runWorker (ThreadPoolExecutor.java:1128)
    at java.util.concurrent.ThreadPoolExecutor$Worker.run (ThreadPoolExecutor.java:628)
    at java.lang.Thread.run (Thread.java:830)
Caused by: org.owasp.dependencycheck.utils.DownloadFailedException: Download failed, unable
to retrieve 'https://nvd.nist.gov/feeds/json/cve/1.0/nvdcve-1.0-modified.meta'
    at org.owasp.dependencycheck.utils.Downloader.fetchContent (Downloader.java:115)
    at org.owasp.dependencycheck.data.update.NvdCveUpdater.getMetaFile (NvdCveUpdater.java:340)
    at org.owasp.dependencycheck.data.update.NvdCveUpdater.getUpdatesNeeded (NvdCveUpdater.java:385)
    at org.owasp.dependencycheck.data.update.NvdCveUpdater.update (NvdCveUpdater.java:122)
    at org.owasp.dependencycheck.Engine.doUpdates (Engine.java:922)
    at org.owasp.dependencycheck.Engine.initializeAndUpdateDatabase (Engine.java:723)
    at org.owasp.dependencycheck.Engine.analyzeDependencies (Engine.java:653)
    at org.owasp.dependencycheck.maven.BaseDependencyCheckMojo.runCheck (BaseDependencyCheckMojo.java:1403)
    at org.owasp.dependencycheck.maven.BaseDependencyCheckMojo.execute (BaseDependencyCheckMojo.java:802)
    at org.apache.maven.plugin.DefaultBuildPluginManager.executeMojo (DefaultBuildPluginManager.java:137)
    at org.apache.maven.lifecycle.internal.MojoExecutor.execute (MojoExecutor.java:210)
    at org.apache.maven.lifecycle.internal.MojoExecutor.execute (MojoExecutor.java:156)
    at org.apache.maven.lifecycle.internal.MojoExecutor.execute (MojoExecutor.java:148)
    at org.apache.maven.lifecycle.internal.LifecycleModuleBuilder.buildProject (LifecycleModuleBuilder.java:117)
    at org.apache.maven.lifecycle.internal.LifecycleModuleBuilder.buildProject (LifecycleModuleBuilder.java:81)
    at org.apache.maven.lifecycle.internal.builder.singlethreaded.SingleThreadedBuilder.build
(SingleThreadedBuilder.java:56)
    at org.apache.maven.lifecycle.internal.LifecycleStarter.execute (LifecycleStarter.java:128)
    at org.apache.maven.DefaultMaven.doExecute (DefaultMaven.java:305)
    at org.apache.maven.DefaultMaven.doExecute (DefaultMaven.java:192)
    at org.apache.maven.DefaultMaven.execute (DefaultMaven.java:105)
    at org.jvnet.hudson.maven3.launcher.Maven35Launcher.main (Maven35Launcher.java:130)
    at jdk.internal.reflect.NativeMethodAccessorImpl.invoke0 (Native Method)
    at jdk.internal.reflect.NativeMethodAccessorImpl.invoke (NativeMethodAccessorImpl.java:62)
    at jdk.internal.reflect.DelegatingMethodAccessorImpl.invoke (DelegatingMethodAccessorImpl.java:43)
    at java.lang.reflect.Method.invoke (Method.java:565)
    at org.codehaus.plexus.classworlds.launcher.Launcher.launchEnhanced (Launcher.java:289)
    at org.codehaus.plexus.classworlds.launcher.Launcher.launch (Launcher.java:229)
    at jenkins.maven3.agent.Maven35Main.launch (Maven35Main.java:176)
    at jdk.internal.reflect.NativeMethodAccessorImpl.invoke0 (Native Method)
    at jdk.internal.reflect.NativeMethodAccessorImpl.invoke (NativeMethodAccessorImpl.java:62)
    at jdk.internal.reflect.DelegatingMethodAccessorImpl.invoke (DelegatingMethodAccessorImpl.java:43)
    at java.lang.reflect.Method.invoke (Method.java:565)
    at hudson.maven.Maven3Builder.call (Maven3Builder.java:139)
    at hudson.maven.Maven3Builder.call (Maven3Builder.java:70)
    at hudson.remoting.UserRequest.perform (UserRequest.java:212)
    at hudson.remoting.UserRequest.perform (UserRequest.java:54)
    at hudson.remoting.Request$2.run (Request.java:369)
    at hudson.remoting.InterceptingExecutorService$1.call (InterceptingExecutorService.java:72)
    at java.util.concurrent.FutureTask.run (FutureTask.java:264)
    at java.util.concurrent.ThreadPoolExecutor.runWorker (ThreadPoolExecutor.java:1128)
    at java.util.concurrent.ThreadPoolExecutor$Worker.run (ThreadPoolExecutor.java:628)
    at java.lang.Thread.run (Thread.java:830)
Caused by: org.owasp.dependencycheck.utils.DownloadFailedException: Error downloading file
https://nvd.nist.gov/feeds/json/cve/1.0/nvdcve-1.0-modified.meta; unable to connect.
    at org.owasp.dependencycheck.utils.HttpResourceConnection.obtainConnection (HttpResourceConnection.java:238)
    at org.owasp.dependencycheck.utils.HttpResourceConnection.fetch (HttpResourceConnection.java:138)
    at org.owasp.dependencycheck.utils.Downloader.fetchContent (Downloader.java:110)
    at org.owasp.dependencycheck.data.update.NvdCveUpdater.getMetaFile (NvdCveUpdater.java:340)
    at org.owasp.dependencycheck.data.update.NvdCveUpdater.getUpdatesNeeded (NvdCveUpdater.java:385)
    at org.owasp.dependencycheck.data.update.NvdCveUpdater.update (NvdCveUpdater.java:122)
    at org.owasp.dependencycheck.Engine.doUpdates (Engine.java:922)
    at org.owasp.dependencycheck.Engine.initializeAndUpdateDatabase (Engine.java:723)
    at org.owasp.dependencycheck.Engine.analyzeDependencies (Engine.java:653)
    at org.owasp.dependencycheck.maven.BaseDependencyCheckMojo.runCheck (BaseDependencyCheckMojo.java:1403)
    at org.owasp.dependencycheck.maven.BaseDependencyCheckMojo.execute (BaseDependencyCheckMojo.java:802)
    at org.apache.maven.plugin.DefaultBuildPluginManager.executeMojo (DefaultBuildPluginManager.java:137)
    at org.apache.maven.lifecycle.internal.MojoExecutor.execute (MojoExecutor.java:210)
    at org.apache.maven.lifecycle.internal.MojoExecutor.execute (MojoExecutor.java:156)
    at org.apache.maven.lifecycle.internal.MojoExecutor.execute (MojoExecutor.java:148)
    at org.apache.maven.lifecycle.internal.LifecycleModuleBuilder.buildProject (LifecycleModuleBuilder.java:117)
    at org.apache.maven.lifecycle.internal.LifecycleModuleBuilder.buildProject (LifecycleModuleBuilder.java:81)
    at org.apache.maven.lifecycle.internal.builder.singlethreaded.SingleThreadedBuilder.build
(SingleThreadedBuilder.java:56)
    at org.apache.maven.lifecycle.internal.LifecycleStarter.execute (LifecycleStarter.java:128)
    at org.apache.maven.DefaultMaven.doExecute (DefaultMaven.java:305)
    at org.apache.maven.DefaultMaven.doExecute (DefaultMaven.java:192)
    at org.apache.maven.DefaultMaven.execute (DefaultMaven.java:105)
    at org.jvnet.hudson.maven3.launcher.Maven35Launcher.main (Maven35Launcher.java:130)
    at jdk.internal.reflect.NativeMethodAccessorImpl.invoke0 (Native Method)
    at jdk.internal.reflect.NativeMethodAccessorImpl.invoke (NativeMethodAccessorImpl.java:62)
    at jdk.internal.reflect.DelegatingMethodAccessorImpl.invoke (DelegatingMethodAccessorImpl.java:43)
    at java.lang.reflect.Method.invoke (Method.java:565)
    at org.codehaus.plexus.classworlds.launcher.Launcher.launchEnhanced (Launcher.java:289)
    at org.codehaus.plexus.classworlds.launcher.Launcher.launch (Launcher.java:229)
    at jenkins.maven3.agent.Maven35Main.launch (Maven35Main.java:176)
    at jdk.internal.reflect.NativeMethodAccessorImpl.invoke0 (Native Method)
    at jdk.internal.reflect.NativeMethodAccessorImpl.invoke (NativeMethodAccessorImpl.java:62)
    at jdk.internal.reflect.DelegatingMethodAccessorImpl.invoke (DelegatingMethodAccessorImpl.java:43)
    at java.lang.reflect.Method.invoke (Method.java:565)
    at hudson.maven.Maven3Builder.call (Maven3Builder.java:139)
    at hudson.maven.Maven3Builder.call (Maven3Builder.java:70)
    at hudson.remoting.UserRequest.perform (UserRequest.java:212)
    at hudson.remoting.UserRequest.perform (UserRequest.java:54)
    at hudson.remoting.Request$2.run (Request.java:369)
    at hudson.remoting.InterceptingExecutorService$1.call (InterceptingExecutorService.java:72)
    at java.util.concurrent.FutureTask.run (FutureTask.java:264)
    at java.util.concurrent.ThreadPoolExecutor.runWorker (ThreadPoolExecutor.java:1128)
    at java.util.concurrent.ThreadPoolExecutor$Worker.run (ThreadPoolExecutor.java:628)
    at java.lang.Thread.run (Thread.java:830)
Caused by: java.net.ConnectException: Connection refused
    at sun.nio.ch.Net.pollConnect (Native Method)
    at sun.nio.ch.Net.pollConnectNow (Net.java:579)
    at sun.nio.ch.NioSocketImpl.timedFinishConnect (NioSocketImpl.java:549)
    at sun.nio.ch.NioSocketImpl.connect (NioSocketImpl.java:597)
    at java.net.Socket.connect (Socket.java:585)
    at sun.net.NetworkClient.doConnect (NetworkClient.java:177)
    at sun.net.www.http.HttpClient.openServer (HttpClient.java:474)
    at sun.net.www.http.HttpClient.openServer (HttpClient.java:569)
    at sun.net.www.protocol.https.HttpsClient.<init> (HttpsClient.java:265)
    at sun.net.www.protocol.https.HttpsClient.New (HttpsClient.java:372)
    at sun.net.www.protocol.https.AbstractDelegateHttpsURLConnection.getNewHttpClient (AbstractDelegateHttpsURLConnection.java:177)
    at sun.net.www.protocol.http.HttpURLConnection.plainConnect0 (HttpURLConnection.java:1187)
    at sun.net.www.protocol.http.HttpURLConnection.plainConnect (HttpURLConnection.java:1081)
    at sun.net.www.protocol.https.AbstractDelegateHttpsURLConnection.connect (AbstractDelegateHttpsURLConnection.java:163)
    at sun.net.www.protocol.https.HttpsURLConnectionImpl.connect (HttpsURLConnectionImpl.java:142)
    at org.owasp.dependencycheck.utils.HttpResourceConnection.obtainConnection (HttpResourceConnection.java:178)
    at org.owasp.dependencycheck.utils.HttpResourceConnection.fetch (HttpResourceConnection.java:138)
    at org.owasp.dependencycheck.utils.Downloader.fetchContent (Downloader.java:110)
    at org.owasp.dependencycheck.data.update.NvdCveUpdater.getMetaFile (NvdCveUpdater.java:340)
    at org.owasp.dependencycheck.data.update.NvdCveUpdater.getUpdatesNeeded (NvdCveUpdater.java:385)
    at org.owasp.dependencycheck.data.update.NvdCveUpdater.update (NvdCveUpdater.java:122)
    at org.owasp.dependencycheck.Engine.doUpdates (Engine.java:922)
    at org.owasp.dependencycheck.Engine.initializeAndUpdateDatabase (Engine.java:723)
    at org.owasp.dependencycheck.Engine.analyzeDependencies (Engine.java:653)
    at org.owasp.dependencycheck.maven.BaseDependencyCheckMojo.runCheck (BaseDependencyCheckMojo.java:1403)
    at org.owasp.dependencycheck.maven.BaseDependencyCheckMojo.execute (BaseDependencyCheckMojo.java:802)
    at org.apache.maven.plugin.DefaultBuildPluginManager.executeMojo (DefaultBuildPluginManager.java:137)
    at org.apache.maven.lifecycle.internal.MojoExecutor.execute (MojoExecutor.java:210)
    at org.apache.maven.lifecycle.internal.MojoExecutor.execute (MojoExecutor.java:156)
    at org.apache.maven.lifecycle.internal.MojoExecutor.execute (MojoExecutor.java:148)
    at org.apache.maven.lifecycle.internal.LifecycleModuleBuilder.buildProject (LifecycleModuleBuilder.java:117)
    at org.apache.maven.lifecycle.internal.LifecycleModuleBuilder.buildProject (LifecycleModuleBuilder.java:81)
    at org.apache.maven.lifecycle.internal.builder.singlethreaded.SingleThreadedBuilder.build
(SingleThreadedBuilder.java:56)
    at org.apache.maven.lifecycle.internal.LifecycleStarter.execute (LifecycleStarter.java:128)
    at org.apache.maven.DefaultMaven.doExecute (DefaultMaven.java:305)
    at org.apache.maven.DefaultMaven.doExecute (DefaultMaven.java:192)
    at org.apache.maven.DefaultMaven.execute (DefaultMaven.java:105)
    at org.jvnet.hudson.maven3.launcher.Maven35Launcher.main (Maven35Launcher.java:130)
    at jdk.internal.reflect.NativeMethodAccessorImpl.invoke0 (Native Method)
    at jdk.internal.reflect.NativeMethodAccessorImpl.invoke (NativeMethodAccessorImpl.java:62)
    at jdk.internal.reflect.DelegatingMethodAccessorImpl.invoke (DelegatingMethodAccessorImpl.java:43)
    at java.lang.reflect.Method.invoke (Method.java:565)
    at org.codehaus.plexus.classworlds.launcher.Launcher.launchEnhanced (Launcher.java:289)
    at org.codehaus.plexus.classworlds.launcher.Launcher.launch (Launcher.java:229)
    at jenkins.maven3.agent.Maven35Main.launch (Maven35Main.java:176)
    at jdk.internal.reflect.NativeMethodAccessorImpl.invoke0 (Native Method)
    at jdk.internal.reflect.NativeMethodAccessorImpl.invoke (NativeMethodAccessorImpl.java:62)
    at jdk.internal.reflect.DelegatingMethodAccessorImpl.invoke (DelegatingMethodAccessorImpl.java:43)
    at java.lang.reflect.Method.invoke (Method.java:565)
    at hudson.maven.Maven3Builder.call (Maven3Builder.java:139)
    at hudson.maven.Maven3Builder.call (Maven3Builder.java:70)
    at hudson.remoting.UserRequest.perform (UserRequest.java:212)
    at hudson.remoting.UserRequest.perform (UserRequest.java:54)
    at hudson.remoting.Request$2.run (Request.java:369)
    at hudson.remoting.InterceptingExecutorService$1.call (InterceptingExecutorService.java:72)
    at java.util.concurrent.FutureTask.run (FutureTask.java:264)
    at java.util.concurrent.ThreadPoolExecutor.runWorker (ThreadPoolExecutor.java:1128)
    at java.util.concurrent.ThreadPoolExecutor$Worker.run (ThreadPoolExecutor.java:628)
    at java.lang.Thread.run (Thread.java:830)
[INFO] Skipping RetireJS update since last update was within 24 hours.
[WARNING] Unable to update 1 or more Cached Web DataSource, using local data instead. Results
may not include recent vulnerabilities.
[ERROR] Unable to continue dependency-check analysis.
[INFO] ------------------------------------------------------------------------
[INFO] Reactor Summary for Apache PDFBox 3.0.0-SNAPSHOT:
[INFO] 
[INFO] PDFBox parent ...................................... FAILURE [01:15 min]
[INFO] Apache FontBox ..................................... SKIPPED
[INFO] Apache XmpBox ...................................... SKIPPED
[INFO] Apache PDFBox ...................................... SKIPPED
[INFO] Apache Preflight ................................... SKIPPED
[INFO] Apache Preflight application ....................... SKIPPED
[INFO] Apache PDFBox Debugger ............................. SKIPPED
[INFO] Apache PDFBox tools ................................ SKIPPED
[INFO] Apache PDFBox application .......................... SKIPPED
[INFO] Apache PDFBox Debugger application ................. SKIPPED
[INFO] Apache PDFBox examples ............................. SKIPPED
[INFO] Apache PDFBox ...................................... SKIPPED
[INFO] ------------------------------------------------------------------------
[INFO] BUILD FAILURE
[INFO] ------------------------------------------------------------------------
[INFO] Total time:  01:32 min
[INFO] Finished at: 2019-09-24T11:24:43Z
[INFO] ------------------------------------------------------------------------
Waiting for Jenkins to finish collecting data
[ERROR] Failed to execute goal org.owasp:dependency-check-maven:5.2.1:check (default) on project
pdfbox-parent: Fatal exception(s) analyzing PDFBox parent: One or more exceptions occurred
during analysis:
[ERROR] Unable to download meta file: https://nvd.nist.gov/feeds/json/cve/1.0/nvdcve-1.0-modified.meta
[ERROR] No documents exist
[ERROR] -> [Help 1]
[ERROR] 
[ERROR] To see the full stack trace of the errors, re-run Maven with the -e switch.
[ERROR] Re-run Maven using the -X switch to enable full debug logging.
[ERROR] 
[ERROR] For more information about the errors and possible solutions, please read the following
articles:
[ERROR] [Help 1] http://cwiki.apache.org/confluence/display/MAVEN/MojoExecutionException
[JENKINS] Archiving <https://builds.apache.org/job/PDFBox-Trunk-jdk14/ws/trunk/xmpbox/pom.xml>
to org.apache.pdfbox/xmpbox/3.0.0-SNAPSHOT/xmpbox-3.0.0-SNAPSHOT.pom
[JENKINS] Archiving <https://builds.apache.org/job/PDFBox-Trunk-jdk14/ws/trunk/tools/pom.xml>
to org.apache.pdfbox/pdfbox-tools/3.0.0-SNAPSHOT/pdfbox-tools-3.0.0-SNAPSHOT.pom
[JENKINS] Archiving <https://builds.apache.org/job/PDFBox-Trunk-jdk14/ws/trunk/debugger/pom.xml>
to org.apache.pdfbox/pdfbox-debugger/3.0.0-SNAPSHOT/pdfbox-debugger-3.0.0-SNAPSHOT.pom
[JENKINS] Archiving <https://builds.apache.org/job/PDFBox-Trunk-jdk14/ws/trunk/preflight-app/pom.xml>
to org.apache.pdfbox/preflight-app/3.0.0-SNAPSHOT/preflight-app-3.0.0-SNAPSHOT.pom
[JENKINS] Archiving <https://builds.apache.org/job/PDFBox-Trunk-jdk14/ws/trunk/app/pom.xml>
to org.apache.pdfbox/pdfbox-app/3.0.0-SNAPSHOT/pdfbox-app-3.0.0-SNAPSHOT.pom
[JENKINS] Archiving <https://builds.apache.org/job/PDFBox-Trunk-jdk14/ws/trunk/examples/pom.xml>
to org.apache.pdfbox/pdfbox-examples/3.0.0-SNAPSHOT/pdfbox-examples-3.0.0-SNAPSHOT.pom
[JENKINS] Archiving <https://builds.apache.org/job/PDFBox-Trunk-jdk14/ws/trunk/preflight/pom.xml>
to org.apache.pdfbox/preflight/3.0.0-SNAPSHOT/preflight-3.0.0-SNAPSHOT.pom
[JENKINS] Archiving <https://builds.apache.org/job/PDFBox-Trunk-jdk14/ws/trunk/pom.xml>
to org.apache.pdfbox/pdfbox-reactor/3.0.0-SNAPSHOT/pdfbox-reactor-3.0.0-SNAPSHOT.pom
[JENKINS] Archiving <https://builds.apache.org/job/PDFBox-Trunk-jdk14/ws/trunk/parent/pom.xml>
to org.apache.pdfbox/pdfbox-parent/3.0.0-SNAPSHOT/pdfbox-parent-3.0.0-SNAPSHOT.pom
[JENKINS] Archiving <https://builds.apache.org/job/PDFBox-Trunk-jdk14/ws/trunk/pdfbox/pom.xml>
to org.apache.pdfbox/pdfbox/3.0.0-SNAPSHOT/pdfbox-3.0.0-SNAPSHOT.pom
[JENKINS] Archiving <https://builds.apache.org/job/PDFBox-Trunk-jdk14/ws/trunk/debugger-app/pom.xml>
to org.apache.pdfbox/debugger-app/3.0.0-SNAPSHOT/debugger-app-3.0.0-SNAPSHOT.pom
[JENKINS] Archiving <https://builds.apache.org/job/PDFBox-Trunk-jdk14/ws/trunk/fontbox/pom.xml>
to org.apache.pdfbox/fontbox/3.0.0-SNAPSHOT/fontbox-3.0.0-SNAPSHOT.pom
Sending e-mails to: dev@pdfbox.apache.org
channel stopped
Archiving artifacts

---------------------------------------------------------------------
To unsubscribe, e-mail: dev-unsubscribe@pdfbox.apache.org
For additional commands, e-mail: dev-help@pdfbox.apache.org


Mime
View raw message