pdfbox-dev mailing list archives

Site index · List index
Message view « Date » · « Thread »
Top « Date » · « Thread »
From Apache Jenkins Server <jenk...@builds.apache.org>
Subject Build failed in Jenkins: PDFBox-Trunk-jdk14 #360
Date Sun, 25 Aug 2019 05:03:38 GMT
See <https://builds.apache.org/job/PDFBox-Trunk-jdk14/360/display/redirect?page=changes>

Changes:

[tilman] PDFBOX-4071: revert commit per commented test code

[tilman] PDFBOX-4071: refactor

[tilman] PDFBOX-4071: improve logging

[tilman] PDFBOX-4071: improve logging

[tilman] PDFBOX-4071: refactor

[tilman] PDFBOX-4071: SonarQube fix

[tilman] PDFBOX-4071: use HashMap, key and values are never null (purely private field that
is not used outside)

[tilman] PDFBOX-4071: SonarQube fix

[tilman] PDFBOX-4071: SonarQube fix

[tilman] PDFBOX-4071: improve logging

[tilman] PDFBOX-4071: SonarQube fix ("confusing to have a class member with the same name");
improve logging; fix typo

[tilman] PDFBOX-4071: SonarQube fix: respect java code conventions

[tilman] PDFBOX-4071: SonarQube fix: respect java code conventions

[tilman] PDFBOX-4071: SonarQube fix: these UI classes won't be serialized

[tilman] PDFBOX-4071: SonarQube fix: these UI classes won't be serialized

[tilman] PDFBOX-4071: SonarQube fix: remove "transient" from field in class that isn't Serializable

[tilman] PDFBOX-4071: improve javadoc

[tilman] PDFBOX-4071: SonarQube fix

------------------------------------------
[...truncated 543.10 KB...]
[INFO] 
[INFO] --- maven-resources-plugin:3.1.0:testResources (default-testResources) @ xmpbox ---
[INFO] Using 'UTF-8' encoding to copy filtered resources.
[INFO] Copying 26 resources
[INFO] Copying 3 resources
[INFO] 
[INFO] --- maven-compiler-plugin:3.7.0:testCompile (default-testCompile) @ xmpbox ---
[INFO] Changes detected - recompiling the module!
[INFO] Compiling 34 source files to <https://builds.apache.org/job/PDFBox-Trunk-jdk14/ws/trunk/xmpbox/target/test-classes>
[WARNING] bootstrap class path not set in conjunction with -source 7
[WARNING] source value 7 is obsolete and will be removed in a future release
[WARNING] target value 7 is obsolete and will be removed in a future release
[WARNING] To suppress warnings about obsolete options, use -Xlint:-options.
[INFO] <https://builds.apache.org/job/PDFBox-Trunk-jdk14/ws/trunk/xmpbox/src/test/java/org/apache/xmpbox/schema/AbstractXMPSchemaTest.java>:
<https://builds.apache.org/job/PDFBox-Trunk-jdk14/ws/trunk/xmpbox/src/test/java/org/apache/xmpbox/schema/AbstractXMPSchemaTest.java>
uses unchecked or unsafe operations.
[INFO] <https://builds.apache.org/job/PDFBox-Trunk-jdk14/ws/trunk/xmpbox/src/test/java/org/apache/xmpbox/schema/AbstractXMPSchemaTest.java>:
Recompile with -Xlint:unchecked for details.
[INFO] 
[INFO] --- maven-surefire-plugin:2.22.0:test (default-test) @ xmpbox ---
[INFO] 
[INFO] -------------------------------------------------------
[INFO]  T E S T S
[INFO] -------------------------------------------------------
[INFO] Running org.apache.xmpbox.type.TestVersionType
[INFO] Tests run: 7, Failures: 0, Errors: 0, Skipped: 0, Time elapsed: 0.224 s - in org.apache.xmpbox.type.TestVersionType
[INFO] Running org.apache.xmpbox.type.TestLayerType
[INFO] Tests run: 14, Failures: 0, Errors: 0, Skipped: 0, Time elapsed: 0.06 s - in org.apache.xmpbox.type.TestLayerType
[INFO] Running org.apache.xmpbox.type.TestResourceRefType
[INFO] Tests run: 105, Failures: 0, Errors: 0, Skipped: 0, Time elapsed: 0.286 s - in org.apache.xmpbox.type.TestResourceRefType
[INFO] Running org.apache.xmpbox.type.TestThumbnailType
[INFO] Tests run: 28, Failures: 0, Errors: 0, Skipped: 0, Time elapsed: 0.042 s - in org.apache.xmpbox.type.TestThumbnailType
[INFO] Running org.apache.xmpbox.type.AttributeTest
[INFO] Tests run: 2, Failures: 0, Errors: 0, Skipped: 0, Time elapsed: 0.001 s - in org.apache.xmpbox.type.AttributeTest
[INFO] Running org.apache.xmpbox.type.TestAbstractStructuredType
[INFO] Tests run: 5, Failures: 0, Errors: 0, Skipped: 0, Time elapsed: 0.003 s - in org.apache.xmpbox.type.TestAbstractStructuredType
[INFO] Running org.apache.xmpbox.type.TestJobType
[INFO] Tests run: 21, Failures: 0, Errors: 0, Skipped: 0, Time elapsed: 0.031 s - in org.apache.xmpbox.type.TestJobType
[INFO] Running org.apache.xmpbox.type.TestDerivedType
[INFO] Tests run: 11, Failures: 0, Errors: 0, Skipped: 0, Time elapsed: 0.009 s - in org.apache.xmpbox.type.TestDerivedType
[INFO] Running org.apache.xmpbox.type.TestResourceEventType
[INFO] Tests run: 42, Failures: 0, Errors: 0, Skipped: 0, Time elapsed: 0.076 s - in org.apache.xmpbox.type.TestResourceEventType
[INFO] Running org.apache.xmpbox.type.TestSimpleMetadataProperties
[INFO] Tests run: 10, Failures: 0, Errors: 0, Skipped: 0, Time elapsed: 0.051 s - in org.apache.xmpbox.type.TestSimpleMetadataProperties
[INFO] Running org.apache.xmpbox.DateConverterTest
[INFO] Tests run: 2, Failures: 0, Errors: 0, Skipped: 0, Time elapsed: 0.014 s - in org.apache.xmpbox.DateConverterTest
[INFO] Running org.apache.xmpbox.schema.PhotoshopSchemaTest
[INFO] Tests run: 162, Failures: 0, Errors: 0, Skipped: 0, Time elapsed: 0.283 s - in org.apache.xmpbox.schema.PhotoshopSchemaTest
[INFO] Running org.apache.xmpbox.schema.XmpRightsSchemaTest
[INFO] Tests run: 10, Failures: 0, Errors: 0, Skipped: 0, Time elapsed: 0.002 s - in org.apache.xmpbox.schema.XmpRightsSchemaTest
[INFO] Running org.apache.xmpbox.schema.XMPBasicTest
[INFO] Tests run: 22, Failures: 0, Errors: 0, Skipped: 0, Time elapsed: 0.014 s - in org.apache.xmpbox.schema.XMPBasicTest
[INFO] Running org.apache.xmpbox.schema.AdobePDFTest
[INFO] Tests run: 12, Failures: 0, Errors: 0, Skipped: 0, Time elapsed: 0.004 s - in org.apache.xmpbox.schema.AdobePDFTest
[INFO] Running org.apache.xmpbox.schema.PDFAIdentificationOthersTest
[INFO] Tests run: 3, Failures: 0, Errors: 0, Skipped: 0, Time elapsed: 0 s - in org.apache.xmpbox.schema.PDFAIdentificationOthersTest
[INFO] Running org.apache.xmpbox.schema.BasicJobTicketSchemaTest
[INFO] Tests run: 3, Failures: 0, Errors: 0, Skipped: 0, Time elapsed: 0.138 s - in org.apache.xmpbox.schema.BasicJobTicketSchemaTest
[INFO] Running org.apache.xmpbox.schema.XMPSchemaTest
[INFO] Tests run: 12, Failures: 0, Errors: 0, Skipped: 0, Time elapsed: 0.005 s - in org.apache.xmpbox.schema.XMPSchemaTest
[INFO] Running org.apache.xmpbox.schema.DublinCoreTest
[INFO] Tests run: 108, Failures: 0, Errors: 0, Skipped: 0, Time elapsed: 0.159 s - in org.apache.xmpbox.schema.DublinCoreTest
[INFO] Running org.apache.xmpbox.schema.PDFAIdentificationTest
[INFO] Tests run: 6, Failures: 0, Errors: 0, Skipped: 0, Time elapsed: 0 s - in org.apache.xmpbox.schema.PDFAIdentificationTest
[INFO] Running org.apache.xmpbox.schema.TestExifXmp
[INFO] Tests run: 2, Failures: 0, Errors: 0, Skipped: 0, Time elapsed: 0.008 s - in org.apache.xmpbox.schema.TestExifXmp
[INFO] Running org.apache.xmpbox.schema.AdobePDFErrorsTest
[INFO] Tests run: 3, Failures: 0, Errors: 0, Skipped: 0, Time elapsed: 0.003 s - in org.apache.xmpbox.schema.AdobePDFErrorsTest
[INFO] Running org.apache.xmpbox.schema.XMPMediaManagementTest
[INFO] Tests run: 22, Failures: 0, Errors: 0, Skipped: 0, Time elapsed: 0.019 s - in org.apache.xmpbox.schema.XMPMediaManagementTest
[INFO] Running org.apache.xmpbox.parser.DeserializationTest
[INFO] Tests run: 18, Failures: 0, Errors: 0, Skipped: 0, Time elapsed: 0.076 s - in org.apache.xmpbox.parser.DeserializationTest
[INFO] Running org.apache.xmpbox.SaveMetadataHelperTest
[INFO] Tests run: 2, Failures: 0, Errors: 0, Skipped: 0, Time elapsed: 0 s - in org.apache.xmpbox.SaveMetadataHelperTest
[INFO] Running org.apache.xmpbox.TestXMPWithDefinedSchemas
[INFO] Tests run: 5, Failures: 0, Errors: 0, Skipped: 0, Time elapsed: 0.033 s - in org.apache.xmpbox.TestXMPWithDefinedSchemas
[INFO] Running org.apache.xmpbox.TestValidatePermitedMetadata
[INFO] Tests run: 167, Failures: 0, Errors: 0, Skipped: 0, Time elapsed: 0.105 s - in org.apache.xmpbox.TestValidatePermitedMetadata
[INFO] Running org.apache.xmpbox.XMPMetaDataTest
[INFO] Tests run: 5, Failures: 0, Errors: 0, Skipped: 0, Time elapsed: 0 s - in org.apache.xmpbox.XMPMetaDataTest
[INFO] Running org.apache.xmpbox.DoubleSameTypeSchemaTest
[INFO] Tests run: 1, Failures: 0, Errors: 0, Skipped: 0, Time elapsed: 0 s - in org.apache.xmpbox.DoubleSameTypeSchemaTest
[INFO] 
[INFO] Results:
[INFO] 
[INFO] Tests run: 810, Failures: 0, Errors: 0, Skipped: 0
[INFO] 
[JENKINS] Recording test results
[INFO] 
[INFO] --- animal-sniffer-maven-plugin:1.18:check (check-java-version) @ xmpbox ---
[INFO] Checking unresolved references to org.codehaus.mojo.signature:java17:1.0
[INFO] 
[INFO] >>> maven-bundle-plugin:2.5.4:bundle (default-bundle) > package @ xmpbox
>>>
[INFO] 
[INFO] --- maven-enforcer-plugin:1.4.1:enforce (default) @ xmpbox ---
[INFO] 
[INFO] --- maven-enforcer-plugin:1.4.1:enforce (enforce-maven-version) @ xmpbox ---
[INFO] 
[INFO] --- maven-remote-resources-plugin:1.5:process (process-resource-bundles) @ xmpbox ---
[INFO] 
[INFO] --- maven-resources-plugin:3.1.0:resources (default-resources) @ xmpbox ---
[INFO] Using 'UTF-8' encoding to copy filtered resources.
[INFO] skip non existing resourceDirectory <https://builds.apache.org/job/PDFBox-Trunk-jdk14/ws/trunk/xmpbox/src/main/resources>
[INFO] Copying 3 resources
[INFO] Copying 3 resources
[INFO] 
[INFO] --- maven-compiler-plugin:3.7.0:compile (default-compile) @ xmpbox ---
[INFO] Nothing to compile - all classes are up to date
[INFO] 
[INFO] --- maven-resources-plugin:3.1.0:testResources (default-testResources) @ xmpbox ---
[INFO] Using 'UTF-8' encoding to copy filtered resources.
[INFO] Copying 26 resources
[INFO] Copying 3 resources
[INFO] Copying 3 resources
[INFO] 
[INFO] --- maven-compiler-plugin:3.7.0:testCompile (default-testCompile) @ xmpbox ---
[INFO] Nothing to compile - all classes are up to date
[INFO] 
[INFO] --- maven-surefire-plugin:2.22.0:test (default-test) @ xmpbox ---
[INFO] Skipping execution of surefire because it has already been run for this configuration
[JENKINS] Recording test results
[INFO] 
[INFO] --- animal-sniffer-maven-plugin:1.18:check (check-java-version) @ xmpbox ---
[INFO] Checking unresolved references to org.codehaus.mojo.signature:java17:1.0
[INFO] 
[INFO] --- maven-site-plugin:3.7.1:attach-descriptor (attach-descriptor) @ xmpbox ---
[INFO] Skipping because packaging 'bundle' is not pom.
[INFO] 
[INFO] >>> maven-source-plugin:3.0.1:jar (attach-sources) > generate-sources @
xmpbox >>>
[INFO] 
[INFO] --- maven-enforcer-plugin:1.4.1:enforce (default) @ xmpbox ---
[INFO] 
[INFO] --- maven-enforcer-plugin:1.4.1:enforce (enforce-maven-version) @ xmpbox ---
[WARNING] Failed to getClass for org.apache.maven.plugins.source.SourceJarMojo
[INFO] 
[INFO] <<< maven-source-plugin:3.0.1:jar (attach-sources) < generate-sources @
xmpbox <<<
[INFO] 
[INFO] 
[INFO] --- maven-source-plugin:3.0.1:jar (attach-sources) @ xmpbox ---
[INFO] Building jar: <https://builds.apache.org/job/PDFBox-Trunk-jdk14/ws/trunk/xmpbox/target/xmpbox-3.0.0-SNAPSHOT-sources.jar>
[WARNING] Failed to getClass for org.apache.felix.bundleplugin.BundlePlugin
[INFO] 
[INFO] <<< maven-bundle-plugin:2.5.4:bundle (default-bundle) < package @ xmpbox
<<<
[INFO] 
[INFO] 
[INFO] --- maven-bundle-plugin:2.5.4:bundle (default-bundle) @ xmpbox ---
[INFO] 
[INFO] --- maven-site-plugin:3.7.1:attach-descriptor (attach-descriptor) @ xmpbox ---
[INFO] Skipping because packaging 'bundle' is not pom.
[INFO] 
[INFO] >>> maven-source-plugin:3.0.1:jar (attach-sources) > generate-sources @
xmpbox >>>
[INFO] 
[INFO] --- maven-enforcer-plugin:1.4.1:enforce (default) @ xmpbox ---
[INFO] 
[INFO] --- maven-enforcer-plugin:1.4.1:enforce (enforce-maven-version) @ xmpbox ---
[WARNING] Failed to getClass for org.apache.maven.plugins.source.SourceJarMojo
[INFO] 
[INFO] <<< maven-source-plugin:3.0.1:jar (attach-sources) < generate-sources @
xmpbox <<<
[INFO] 
[INFO] 
[INFO] --- maven-source-plugin:3.0.1:jar (attach-sources) @ xmpbox ---
[INFO] Building jar: <https://builds.apache.org/job/PDFBox-Trunk-jdk14/ws/trunk/xmpbox/target/xmpbox-3.0.0-SNAPSHOT-sources.jar>
[INFO] 
[INFO] --- apache-rat-plugin:0.12:check (default) @ xmpbox ---
[INFO] Enabled default license matchers.
[INFO] Will parse SCM ignores for exclusions...
[INFO] Finished adding exclusions from SCM ignore files.
[INFO] 61 implicit excludes (use -debug for more details).
[INFO] Exclude: release.properties
[INFO] 136 resources included (use -debug for more details)
[INFO] Rat check: Summary over all files. Unapproved: 0, unknown: 0, generated: 0, approved:
133 licenses.
[INFO] 
[INFO] --- dependency-check-maven:5.2.1:check (default) @ xmpbox ---
[INFO] Checking for updates
[INFO] Skipping NVD check since last check was within 4 hours.
[INFO] Skipping RetireJS update since last update was within 24 hours.
[INFO] Check for updates complete (2 ms)
[INFO] 

Dependency-Check is an open source tool performing a best effort analysis of 3rd party dependencies;
false positives and false negatives may exist in the analysis performed by the tool. Use of
the tool and the reporting provided constitutes acceptance for use in an AS IS condition,
and there are NO warranties, implied or otherwise, with regard to the analysis or its use.
Any use of the tool and the reporting provided is at the user?s risk. In no event shall the
copyright holder or OWASP be held liable for any damages whatsoever arising out of or in connection
with the use of this tool, the analysis performed, or the resulting report.


[INFO] Analysis Started
[INFO] Finished Archive Analyzer (0 seconds)
[INFO] Finished File Name Analyzer (0 seconds)
[INFO] Finished Jar Analyzer (0 seconds)
[INFO] Finished Dependency Merging Analyzer (0 seconds)
[INFO] Finished Version Filter Analyzer (0 seconds)
[INFO] Finished Hint Analyzer (0 seconds)
[INFO] Created CPE Index (1 seconds)
[INFO] Finished CPE Analyzer (2 seconds)
[INFO] Finished False Positive Analyzer (0 seconds)
[INFO] Finished NVD CVE Analyzer (0 seconds)
[WARNING] An error occurred while analyzing '<https://builds.apache.org/job/PDFBox-Trunk-jdk14/ws/.repository/commons-logging/commons-logging/1.2/commons-logging-1.2.jar'>
(Sonatype OSS Index Analyzer).
[INFO] Finished Sonatype OSS Index Analyzer (0 seconds)
[INFO] Finished Vulnerability Suppression Analyzer (0 seconds)
[INFO] Finished Dependency Bundling Analyzer (0 seconds)
[INFO] Analysis Complete (2 seconds)
[INFO] ------------------------------------------------------------------------
[INFO] Reactor Summary for Apache PDFBox 3.0.0-SNAPSHOT:
[INFO] 
[INFO] PDFBox parent ...................................... SUCCESS [05:15 min]
[INFO] Apache FontBox ..................................... SUCCESS [01:33 min]
[INFO] Apache XmpBox ...................................... FAILURE [ 31.911 s]
[INFO] Apache PDFBox ...................................... SKIPPED
[INFO] Apache Preflight ................................... SKIPPED
[INFO] Apache Preflight application ....................... SKIPPED
[INFO] Apache PDFBox Debugger ............................. SKIPPED
[INFO] Apache PDFBox tools ................................ SKIPPED
[INFO] Apache PDFBox application .......................... SKIPPED
[INFO] Apache PDFBox Debugger application ................. SKIPPED
[INFO] Apache PDFBox examples ............................. SKIPPED
[INFO] Apache PDFBox ...................................... SKIPPED
[INFO] ------------------------------------------------------------------------
[INFO] BUILD FAILURE
[INFO] ------------------------------------------------------------------------
[INFO] Total time:  07:47 min
[INFO] Finished at: 2019-08-25T05:03:09Z
[INFO] ------------------------------------------------------------------------
Waiting for Jenkins to finish collecting data
[ERROR] Failed to execute goal org.owasp:dependency-check-maven:5.2.1:check (default) on project
xmpbox: One or more exceptions occurred during dependency-check analysis: One or more exceptions
occurred during analysis:
[ERROR] Failed to request component-reports
[ERROR] -> [Help 1]
[ERROR] 
[ERROR] To see the full stack trace of the errors, re-run Maven with the -e switch.
[ERROR] Re-run Maven using the -X switch to enable full debug logging.
[ERROR] 
[ERROR] For more information about the errors and possible solutions, please read the following
articles:
[ERROR] [Help 1] http://cwiki.apache.org/confluence/display/MAVEN/MojoExecutionException
[ERROR] 
[ERROR] After correcting the problems, you can resume the build with the command
[ERROR]   mvn <goals> -rf :xmpbox
[JENKINS] Archiving <https://builds.apache.org/job/PDFBox-Trunk-jdk14/ws/trunk/xmpbox/pom.xml>
to org.apache.pdfbox/xmpbox/3.0.0-SNAPSHOT/xmpbox-3.0.0-SNAPSHOT.pom
[JENKINS] Archiving <https://builds.apache.org/job/PDFBox-Trunk-jdk14/ws/trunk/xmpbox/target/xmpbox-3.0.0-SNAPSHOT.jar>
to org.apache.pdfbox/xmpbox/3.0.0-SNAPSHOT/xmpbox-3.0.0-SNAPSHOT.jar
[JENKINS] Archiving <https://builds.apache.org/job/PDFBox-Trunk-jdk14/ws/trunk/xmpbox/target/xmpbox-3.0.0-SNAPSHOT-sources.jar>
to org.apache.pdfbox/xmpbox/3.0.0-SNAPSHOT/xmpbox-3.0.0-SNAPSHOT-sources.jar
[JENKINS] Archiving <https://builds.apache.org/job/PDFBox-Trunk-jdk14/ws/trunk/tools/pom.xml>
to org.apache.pdfbox/pdfbox-tools/3.0.0-SNAPSHOT/pdfbox-tools-3.0.0-SNAPSHOT.pom
[JENKINS] Archiving <https://builds.apache.org/job/PDFBox-Trunk-jdk14/ws/trunk/debugger/pom.xml>
to org.apache.pdfbox/pdfbox-debugger/3.0.0-SNAPSHOT/pdfbox-debugger-3.0.0-SNAPSHOT.pom
[JENKINS] Archiving <https://builds.apache.org/job/PDFBox-Trunk-jdk14/ws/trunk/preflight-app/pom.xml>
to org.apache.pdfbox/preflight-app/3.0.0-SNAPSHOT/preflight-app-3.0.0-SNAPSHOT.pom
[JENKINS] Archiving <https://builds.apache.org/job/PDFBox-Trunk-jdk14/ws/trunk/app/pom.xml>
to org.apache.pdfbox/pdfbox-app/3.0.0-SNAPSHOT/pdfbox-app-3.0.0-SNAPSHOT.pom
[JENKINS] Archiving <https://builds.apache.org/job/PDFBox-Trunk-jdk14/ws/trunk/examples/pom.xml>
to org.apache.pdfbox/pdfbox-examples/3.0.0-SNAPSHOT/pdfbox-examples-3.0.0-SNAPSHOT.pom
[JENKINS] Archiving <https://builds.apache.org/job/PDFBox-Trunk-jdk14/ws/trunk/preflight/pom.xml>
to org.apache.pdfbox/preflight/3.0.0-SNAPSHOT/preflight-3.0.0-SNAPSHOT.pom
[JENKINS] Archiving <https://builds.apache.org/job/PDFBox-Trunk-jdk14/ws/trunk/pom.xml>
to org.apache.pdfbox/pdfbox-reactor/3.0.0-SNAPSHOT/pdfbox-reactor-3.0.0-SNAPSHOT.pom
[JENKINS] Archiving <https://builds.apache.org/job/PDFBox-Trunk-jdk14/ws/trunk/parent/pom.xml>
to org.apache.pdfbox/pdfbox-parent/3.0.0-SNAPSHOT/pdfbox-parent-3.0.0-SNAPSHOT.pom
[JENKINS] Archiving <https://builds.apache.org/job/PDFBox-Trunk-jdk14/ws/trunk/pdfbox/pom.xml>
to org.apache.pdfbox/pdfbox/3.0.0-SNAPSHOT/pdfbox-3.0.0-SNAPSHOT.pom
[JENKINS] Archiving <https://builds.apache.org/job/PDFBox-Trunk-jdk14/ws/trunk/debugger-app/pom.xml>
to org.apache.pdfbox/debugger-app/3.0.0-SNAPSHOT/debugger-app-3.0.0-SNAPSHOT.pom
[JENKINS] Archiving <https://builds.apache.org/job/PDFBox-Trunk-jdk14/ws/trunk/fontbox/pom.xml>
to org.apache.pdfbox/fontbox/3.0.0-SNAPSHOT/fontbox-3.0.0-SNAPSHOT.pom
[JENKINS] Archiving <https://builds.apache.org/job/PDFBox-Trunk-jdk14/ws/trunk/fontbox/target/fontbox-3.0.0-SNAPSHOT.jar>
to org.apache.pdfbox/fontbox/3.0.0-SNAPSHOT/fontbox-3.0.0-SNAPSHOT.jar
[JENKINS] Archiving <https://builds.apache.org/job/PDFBox-Trunk-jdk14/ws/trunk/fontbox/target/fontbox-3.0.0-SNAPSHOT-sources.jar>
to org.apache.pdfbox/fontbox/3.0.0-SNAPSHOT/fontbox-3.0.0-SNAPSHOT-sources.jar
[Fast Archiver] Compressed 2.99 MB of artifacts by 37.6% relative to #359
Sending e-mails to: dev@pdfbox.apache.org
channel stopped
Archiving artifacts

---------------------------------------------------------------------
To unsubscribe, e-mail: dev-unsubscribe@pdfbox.apache.org
For additional commands, e-mail: dev-help@pdfbox.apache.org


Mime
View raw message