pdfbox-dev mailing list archives

Site index · List index
Message view « Date » · « Thread »
Top « Date » · « Thread »
From Apache Jenkins Server <jenk...@builds.apache.org>
Subject Build failed in Jenkins: PDFBox-2.0.x-jdk6 #134
Date Fri, 09 Aug 2019 03:22:15 GMT
See <https://builds.apache.org/job/PDFBox-2.0.x-jdk6/134/display/redirect>

------------------------------------------
[...truncated 271.86 KB...]
[INFO] Downloaded from central: https://repo.maven.apache.org/maven2/commons-codec/commons-codec/1.11/commons-codec-1.11.jar
(335 kB at 493 kB/s)
[INFO] Downloaded from central: https://repo.maven.apache.org/maven2/com/h2database/h2/1.4.196/h2-1.4.196.jar
(1.8 MB at 1.7 MB/s)
[INFO] Checking for updates
[INFO] NVD CVE requires several updates; this could take a couple of minutes.
[INFO] Download Started for NVD CVE - 2002
[INFO] Download Started for NVD CVE - 2003
[INFO] Download Complete for NVD CVE - 2003  (639 ms)
[INFO] Download Started for NVD CVE - 2004
[INFO] Processing Started for NVD CVE - 2003
[INFO] Download Complete for NVD CVE - 2002  (778 ms)
[INFO] Download Started for NVD CVE - 2005
[INFO] Processing Started for NVD CVE - 2002
[INFO] Download Complete for NVD CVE - 2004  (710 ms)
[INFO] Download Started for NVD CVE - 2006
[INFO] Processing Started for NVD CVE - 2004
[INFO] Download Complete for NVD CVE - 2005  (884 ms)
[INFO] Download Started for NVD CVE - 2007
[INFO] Processing Started for NVD CVE - 2005
[INFO] Download Complete for NVD CVE - 2006  (829 ms)
[INFO] Download Started for NVD CVE - 2008
[INFO] Processing Started for NVD CVE - 2006
[INFO] Download Complete for NVD CVE - 2008  (823 ms)
[INFO] Download Started for NVD CVE - 2009
[INFO] Processing Started for NVD CVE - 2008
[INFO] Download Complete for NVD CVE - 2007  (1924 ms)
[INFO] Download Started for NVD CVE - 2010
[INFO] Processing Started for NVD CVE - 2007
[INFO] Download Complete for NVD CVE - 2009  (851 ms)
[INFO] Download Started for NVD CVE - 2011
[INFO] Processing Started for NVD CVE - 2009
[INFO] Download Complete for NVD CVE - 2010  (864 ms)
[INFO] Download Started for NVD CVE - 2012
[INFO] Processing Started for NVD CVE - 2010
[INFO] Download Complete for NVD CVE - 2011  (1102 ms)
[INFO] Download Started for NVD CVE - 2013
[INFO] Processing Started for NVD CVE - 2011
[INFO] Download Complete for NVD CVE - 2012  (867 ms)
[INFO] Download Started for NVD CVE - 2014
[INFO] Processing Started for NVD CVE - 2012
[INFO] Download Complete for NVD CVE - 2013  (891 ms)
[INFO] Download Started for NVD CVE - 2015
[INFO] Processing Started for NVD CVE - 2013
[INFO] Download Complete for NVD CVE - 2014  (861 ms)
[INFO] Download Started for NVD CVE - 2016
[INFO] Processing Started for NVD CVE - 2014
[INFO] Download Complete for NVD CVE - 2015  (814 ms)
[INFO] Download Started for NVD CVE - 2017
[INFO] Processing Started for NVD CVE - 2015
[INFO] Download Complete for NVD CVE - 2016  (864 ms)
[INFO] Download Started for NVD CVE - 2018
[INFO] Processing Started for NVD CVE - 2016
[INFO] Download Complete for NVD CVE - 2017  (1098 ms)
[INFO] Download Started for NVD CVE - 2019
[INFO] Processing Started for NVD CVE - 2017
[INFO] Download Complete for NVD CVE - 2019  (888 ms)
[INFO] Download Complete for NVD CVE - 2018  (3725 ms)
[INFO] Processing Complete for NVD CVE - 2003  (24706 ms)
[INFO] Processing Started for NVD CVE - 2019
[INFO] Processing Complete for NVD CVE - 2004  (66388 ms)
[INFO] Processing Started for NVD CVE - 2018
[INFO] Processing Complete for NVD CVE - 2005  (149890 ms)
[INFO] Processing Complete for NVD CVE - 2009  (168708 ms)
[INFO] Processing Complete for NVD CVE - 2002  (179081 ms)
[INFO] Processing Complete for NVD CVE - 2011  (174877 ms)
[INFO] Processing Complete for NVD CVE - 2010  (176410 ms)
[INFO] Processing Complete for NVD CVE - 2012  (184044 ms)
[INFO] Processing Complete for NVD CVE - 2007  (186973 ms)
[INFO] Processing Complete for NVD CVE - 2013  (187057 ms)
[INFO] Processing Complete for NVD CVE - 2006  (191673 ms)
[INFO] Processing Complete for NVD CVE - 2008  (192966 ms)
[INFO] Processing Complete for NVD CVE - 2019  (174630 ms)
[INFO] Processing Complete for NVD CVE - 2015  (193841 ms)
[INFO] Processing Complete for NVD CVE - 2014  (197770 ms)
[INFO] Processing Complete for NVD CVE - 2016  (197700 ms)
[INFO] Processing Complete for NVD CVE - 2017  (202750 ms)
[INFO] Processing Complete for NVD CVE - 2018  (145963 ms)
[INFO] Download Started for NVD CVE - Modified
[INFO] Download Complete for NVD CVE - Modified  (668 ms)
[INFO] Processing Started for NVD CVE - Modified
[INFO] Processing Complete for NVD CVE - Modified  (2715 ms)
[INFO] Begin database maintenance
[INFO] End database maintenance (19948 ms)
[WARNING] A new version of dependency-check is available. Consider updating to version 5.2.1.
[INFO] Begin database defrag
[INFO] End database defrag (7423 ms)
[INFO] Check for updates complete (250546 ms)
[INFO] 

Dependency-Check is an open source tool performing a best effort analysis of 3rd party dependencies;
false positives and false negatives may exist in the analysis performed by the tool. Use of
the tool and the reporting provided constitutes acceptance for use in an AS IS condition,
and there are NO warranties, implied or otherwise, with regard to the analysis or its use.
Any use of the tool and the reporting provided is at the user?s risk. In no event shall the
copyright holder or OWASP be held liable for any damages whatsoever arising out of or in connection
with the use of this tool, the analysis performed, or the resulting report.


[INFO] Analysis Started
[INFO] Finished File Name Analyzer (0 seconds)
[INFO] Finished Dependency Merging Analyzer (0 seconds)
[INFO] Finished Version Filter Analyzer (0 seconds)
[INFO] Finished Hint Analyzer (0 seconds)
[INFO] Created CPE Index (2 seconds)
[INFO] Finished CPE Analyzer (2 seconds)
[INFO] Finished False Positive Analyzer (0 seconds)
[INFO] Finished NVD CVE Analyzer (0 seconds)
[INFO] Finished Sonatype OSS Index Analyzer (0 seconds)
[INFO] Finished Vulnerability Suppression Analyzer (0 seconds)
[INFO] Finished Dependency Bundling Analyzer (0 seconds)
[INFO] Analysis Complete (2 seconds)
[INFO] 
[INFO] --- maven-install-plugin:2.5.2:install (default-install) @ pdfbox-parent ---
[INFO] Downloading from central: https://repo.maven.apache.org/maven2/commons-codec/commons-codec/1.6/commons-codec-1.6.pom
[INFO] Downloaded from central: https://repo.maven.apache.org/maven2/commons-codec/commons-codec/1.6/commons-codec-1.6.pom
(11 kB at 620 kB/s)
[INFO] Downloading from central: https://repo.maven.apache.org/maven2/org/apache/commons/commons-parent/22/commons-parent-22.pom
[INFO] Downloaded from central: https://repo.maven.apache.org/maven2/org/apache/commons/commons-parent/22/commons-parent-22.pom
(42 kB at 2.6 MB/s)
[INFO] Downloading from central: https://repo.maven.apache.org/maven2/org/apache/maven/shared/maven-shared-utils/0.4/maven-shared-utils-0.4.pom
[INFO] Downloaded from central: https://repo.maven.apache.org/maven2/org/apache/maven/shared/maven-shared-utils/0.4/maven-shared-utils-0.4.pom
(4.0 kB at 311 kB/s)
[INFO] Downloading from central: https://repo.maven.apache.org/maven2/commons-codec/commons-codec/1.6/commons-codec-1.6.jar
[INFO] Downloading from central: https://repo.maven.apache.org/maven2/org/apache/maven/shared/maven-shared-utils/0.4/maven-shared-utils-0.4.jar
[INFO] Downloading from central: https://repo.maven.apache.org/maven2/org/codehaus/plexus/plexus-utils/3.0.15/plexus-utils-3.0.15.jar
[INFO] Downloaded from central: https://repo.maven.apache.org/maven2/commons-codec/commons-codec/1.6/commons-codec-1.6.jar
(233 kB at 8.6 MB/s)
[INFO] Downloaded from central: https://repo.maven.apache.org/maven2/org/apache/maven/shared/maven-shared-utils/0.4/maven-shared-utils-0.4.jar
(155 kB at 6.0 MB/s)
[INFO] Downloaded from central: https://repo.maven.apache.org/maven2/org/codehaus/plexus/plexus-utils/3.0.15/plexus-utils-3.0.15.jar
(239 kB at 8.2 MB/s)
[INFO] Installing <https://builds.apache.org/job/PDFBox-2.0.x-jdk6/ws/2.0/parent/pom.xml>
to <https://builds.apache.org/job/PDFBox-2.0.x-jdk6/ws/.repository/org/apache/pdfbox/pdfbox-parent/2.0.17-SNAPSHOT/pdfbox-parent-2.0.17-SNAPSHOT.pom>
[INFO] 
[INFO] ---------------------< org.apache.pdfbox:fontbox >----------------------
[INFO] Building Apache FontBox 2.0.17-SNAPSHOT                           [2/12]
[INFO] -------------------------------[ bundle ]-------------------------------
[INFO] Downloading from central: https://repo.maven.apache.org/maven2/org/apache/maven/plugins/maven-resources-plugin/3.0.2/maven-resources-plugin-3.0.2.pom
[INFO] Downloaded from central: https://repo.maven.apache.org/maven2/org/apache/maven/plugins/maven-resources-plugin/3.0.2/maven-resources-plugin-3.0.2.pom
(7.1 kB at 420 kB/s)
[INFO] Downloading from central: https://repo.maven.apache.org/maven2/org/apache/maven/plugins/maven-resources-plugin/3.0.2/maven-resources-plugin-3.0.2.jar
[INFO] Downloaded from central: https://repo.maven.apache.org/maven2/org/apache/maven/plugins/maven-resources-plugin/3.0.2/maven-resources-plugin-3.0.2.jar
(32 kB at 2.4 MB/s)
[INFO] Downloading from central: https://repo.maven.apache.org/maven2/org/apache/maven/plugins/maven-compiler-plugin/3.6.0/maven-compiler-plugin-3.6.0.pom
[INFO] Downloaded from central: https://repo.maven.apache.org/maven2/org/apache/maven/plugins/maven-compiler-plugin/3.6.0/maven-compiler-plugin-3.6.0.pom
(11 kB at 817 kB/s)
[INFO] Downloading from central: https://repo.maven.apache.org/maven2/org/apache/maven/plugins/maven-compiler-plugin/3.6.0/maven-compiler-plugin-3.6.0.jar
[INFO] Downloaded from central: https://repo.maven.apache.org/maven2/org/apache/maven/plugins/maven-compiler-plugin/3.6.0/maven-compiler-plugin-3.6.0.jar
(55 kB at 3.2 MB/s)
[INFO] Downloading from central: https://repo.maven.apache.org/maven2/com/googlecode/maven-download-plugin/download-maven-plugin/1.3.0/download-maven-plugin-1.3.0.pom
[INFO] Downloaded from central: https://repo.maven.apache.org/maven2/com/googlecode/maven-download-plugin/download-maven-plugin/1.3.0/download-maven-plugin-1.3.0.pom
(9.6 kB at 600 kB/s)
[INFO] Downloading from central: https://repo.maven.apache.org/maven2/com/googlecode/maven-download-plugin/download-maven-plugin/1.3.0/download-maven-plugin-1.3.0.jar
[INFO] Downloaded from central: https://repo.maven.apache.org/maven2/com/googlecode/maven-download-plugin/download-maven-plugin/1.3.0/download-maven-plugin-1.3.0.jar
(32 kB at 2.0 MB/s)
[INFO] Downloading from central: https://repo.maven.apache.org/maven2/org/apache/maven/plugins/maven-surefire-plugin/2.22.1/maven-surefire-plugin-2.22.1.pom
[INFO] Downloaded from central: https://repo.maven.apache.org/maven2/org/apache/maven/plugins/maven-surefire-plugin/2.22.1/maven-surefire-plugin-2.22.1.pom
(5.0 kB at 384 kB/s)
[INFO] Downloading from central: https://repo.maven.apache.org/maven2/org/apache/maven/surefire/surefire/2.22.1/surefire-2.22.1.pom
[INFO] Downloaded from central: https://repo.maven.apache.org/maven2/org/apache/maven/surefire/surefire/2.22.1/surefire-2.22.1.pom
(26 kB at 2.2 MB/s)
[INFO] Downloading from central: https://repo.maven.apache.org/maven2/org/apache/maven/plugins/maven-surefire-plugin/2.22.1/maven-surefire-plugin-2.22.1.jar
[INFO] Downloaded from central: https://repo.maven.apache.org/maven2/org/apache/maven/plugins/maven-surefire-plugin/2.22.1/maven-surefire-plugin-2.22.1.jar
(41 kB at 3.1 MB/s)
[INFO] Downloading from central: https://repo.maven.apache.org/maven2/junit/junit/4.12/junit-4.12.jar
[INFO] Downloaded from central: https://repo.maven.apache.org/maven2/junit/junit/4.12/junit-4.12.jar
(315 kB at 4.9 MB/s)
[INFO] 
[INFO] --- maven-clean-plugin:3.0.0:clean (default-clean) @ fontbox ---
[TASKS] Scanning folder '<https://builds.apache.org/job/PDFBox-2.0.x-jdk6/ws/2.0/fontbox'>
for files matching the pattern '**/*.java' - excludes: 
[TASKS] Found 113 files to scan for tasks
Found 14 open tasks.
[TASKS] Computing warning deltas based on reference build #131
[INFO] 
[INFO] --- maven-enforcer-plugin:1.4.1:enforce (default) @ fontbox ---
[INFO] 
[INFO] --- maven-enforcer-plugin:1.4.1:enforce (enforce-maven-version) @ fontbox ---
[INFO] 
[INFO] --- maven-remote-resources-plugin:1.5:process (process-resource-bundles) @ fontbox
---
[INFO] 
[INFO] --- maven-resources-plugin:3.0.2:resources (default-resources) @ fontbox ---
[INFO] Downloading from central: https://repo.maven.apache.org/maven2/org/apache/maven/shared/maven-filtering/3.1.1/maven-filtering-3.1.1.pom
[INFO] Downloaded from central: https://repo.maven.apache.org/maven2/org/apache/maven/shared/maven-filtering/3.1.1/maven-filtering-3.1.1.pom
(5.7 kB at 406 kB/s)
[INFO] Downloading from central: https://repo.maven.apache.org/maven2/org/codehaus/plexus/plexus-interpolation/1.24/plexus-interpolation-1.24.pom
[INFO] Downloaded from central: https://repo.maven.apache.org/maven2/org/codehaus/plexus/plexus-interpolation/1.24/plexus-interpolation-1.24.pom
(2.6 kB at 238 kB/s)
[INFO] Downloading from central: https://repo.maven.apache.org/maven2/org/apache/maven/shared/maven-filtering/3.1.1/maven-filtering-3.1.1.jar
[INFO] Downloading from central: https://repo.maven.apache.org/maven2/org/codehaus/plexus/plexus-interpolation/1.24/plexus-interpolation-1.24.jar
[INFO] Downloaded from central: https://repo.maven.apache.org/maven2/org/apache/maven/shared/maven-filtering/3.1.1/maven-filtering-3.1.1.jar
(51 kB at 3.4 MB/s)
[INFO] Downloaded from central: https://repo.maven.apache.org/maven2/org/codehaus/plexus/plexus-interpolation/1.24/plexus-interpolation-1.24.jar
(79 kB at 4.2 MB/s)
[INFO] Using 'UTF-8' encoding to copy filtered resources.
[INFO] Copying 92 resources
[INFO] Copying 3 resources
[INFO] 
[INFO] --- maven-compiler-plugin:3.6.0:compile (default-compile) @ fontbox ---
[INFO] Downloading from central: https://repo.maven.apache.org/maven2/org/apache/maven/shared/maven-shared-incremental/1.1/maven-shared-incremental-1.1.pom
[INFO] Downloaded from central: https://repo.maven.apache.org/maven2/org/apache/maven/shared/maven-shared-incremental/1.1/maven-shared-incremental-1.1.pom
(4.7 kB at 365 kB/s)
[INFO] Downloading from central: https://repo.maven.apache.org/maven2/org/apache/maven/shared/maven-shared-utils/0.1/maven-shared-utils-0.1.pom
[INFO] Downloaded from central: https://repo.maven.apache.org/maven2/org/apache/maven/shared/maven-shared-utils/0.1/maven-shared-utils-0.1.pom
(4.0 kB at 405 kB/s)
[INFO] Downloading from central: https://repo.maven.apache.org/maven2/org/ow2/asm/asm/6.0_ALPHA/asm-6.0_ALPHA.pom
[INFO] Downloaded from central: https://repo.maven.apache.org/maven2/org/ow2/asm/asm/6.0_ALPHA/asm-6.0_ALPHA.pom
(1.9 kB at 176 kB/s)
[INFO] Downloading from central: https://repo.maven.apache.org/maven2/org/ow2/asm/asm-parent/6.0_ALPHA/asm-parent-6.0_ALPHA.pom
[INFO] Downloaded from central: https://repo.maven.apache.org/maven2/org/ow2/asm/asm-parent/6.0_ALPHA/asm-parent-6.0_ALPHA.pom
(5.5 kB at 500 kB/s)
[INFO] Downloading from central: https://repo.maven.apache.org/maven2/org/ow2/ow2/1.3/ow2-1.3.pom
[INFO] Downloaded from central: https://repo.maven.apache.org/maven2/org/ow2/ow2/1.3/ow2-1.3.pom
(9.5 kB at 792 kB/s)
[INFO] Downloading from central: https://repo.maven.apache.org/maven2/org/codehaus/plexus/plexus-compiler-api/2.8.1/plexus-compiler-api-2.8.1.pom
[INFO] Downloaded from central: https://repo.maven.apache.org/maven2/org/codehaus/plexus/plexus-compiler-api/2.8.1/plexus-compiler-api-2.8.1.pom
(893 B at 89 kB/s)
[INFO] Downloading from central: https://repo.maven.apache.org/maven2/org/codehaus/plexus/plexus-compiler/2.8.1/plexus-compiler-2.8.1.pom
[INFO] Downloaded from central: https://repo.maven.apache.org/maven2/org/codehaus/plexus/plexus-compiler/2.8.1/plexus-compiler-2.8.1.pom
(5.0 kB at 455 kB/s)
[INFO] Downloading from central: https://repo.maven.apache.org/maven2/org/codehaus/plexus/plexus-compiler-manager/2.8.1/plexus-compiler-manager-2.8.1.pom
[INFO] Downloaded from central: https://repo.maven.apache.org/maven2/org/codehaus/plexus/plexus-compiler-manager/2.8.1/plexus-compiler-manager-2.8.1.pom
(713 B at 65 kB/s)
[INFO] Downloading from central: https://repo.maven.apache.org/maven2/org/codehaus/plexus/plexus-compiler-javac/2.8.1/plexus-compiler-javac-2.8.1.pom
[INFO] Downloaded from central: https://repo.maven.apache.org/maven2/org/codehaus/plexus/plexus-compiler-javac/2.8.1/plexus-compiler-javac-2.8.1.pom
(794 B at 72 kB/s)
[INFO] Downloading from central: https://repo.maven.apache.org/maven2/org/codehaus/plexus/plexus-compilers/2.8.1/plexus-compilers-2.8.1.pom
[INFO] Downloaded from central: https://repo.maven.apache.org/maven2/org/codehaus/plexus/plexus-compilers/2.8.1/plexus-compilers-2.8.1.pom
(1.4 kB at 126 kB/s)
[INFO] Downloading from central: https://repo.maven.apache.org/maven2/org/apache/maven/shared/maven-shared-incremental/1.1/maven-shared-incremental-1.1.jar
[INFO] Downloading from central: https://repo.maven.apache.org/maven2/org/ow2/asm/asm/6.0_ALPHA/asm-6.0_ALPHA.jar
[INFO] Downloading from central: https://repo.maven.apache.org/maven2/org/codehaus/plexus/plexus-compiler-api/2.8.1/plexus-compiler-api-2.8.1.jar
[INFO] Downloading from central: https://repo.maven.apache.org/maven2/org/codehaus/plexus/plexus-compiler-manager/2.8.1/plexus-compiler-manager-2.8.1.jar
[INFO] Downloading from central: https://repo.maven.apache.org/maven2/org/codehaus/plexus/plexus-compiler-javac/2.8.1/plexus-compiler-javac-2.8.1.jar
[INFO] Downloaded from central: https://repo.maven.apache.org/maven2/org/apache/maven/shared/maven-shared-incremental/1.1/maven-shared-incremental-1.1.jar
(14 kB at 967 kB/s)
[INFO] Downloaded from central: https://repo.maven.apache.org/maven2/org/codehaus/plexus/plexus-compiler-manager/2.8.1/plexus-compiler-manager-2.8.1.jar
(4.7 kB at 313 kB/s)
[INFO] Downloaded from central: https://repo.maven.apache.org/maven2/org/codehaus/plexus/plexus-compiler-javac/2.8.1/plexus-compiler-javac-2.8.1.jar
(20 kB at 1.3 MB/s)
[INFO] Downloaded from central: https://repo.maven.apache.org/maven2/org/ow2/asm/asm/6.0_ALPHA/asm-6.0_ALPHA.jar
(56 kB at 3.3 MB/s)
[INFO] Downloaded from central: https://repo.maven.apache.org/maven2/org/codehaus/plexus/plexus-compiler-api/2.8.1/plexus-compiler-api-2.8.1.jar
(26 kB at 1.5 MB/s)
[INFO] Changes detected - recompiling the module!
[INFO] Compiling 103 source files to <https://builds.apache.org/job/PDFBox-2.0.x-jdk6/ws/2.0/fontbox/target/classes>
[INFO] ------------------------------------------------------------------------
[INFO] Reactor Summary for PDFBox reactor 2.0.17-SNAPSHOT:
[INFO] 
[INFO] PDFBox parent ...................................... SUCCESS [05:42 min]
[INFO] Apache FontBox ..................................... FAILURE [ 14.014 s]
[INFO] Apache XmpBox ...................................... SKIPPED
[INFO] Apache PDFBox ...................................... SKIPPED
[INFO] Apache Preflight ................................... SKIPPED
[INFO] Apache Preflight application ....................... SKIPPED
[INFO] Apache PDFBox Debugger ............................. SKIPPED
[INFO] Apache PDFBox tools ................................ SKIPPED
[INFO] Apache PDFBox application .......................... SKIPPED
[INFO] Apache PDFBox Debugger application ................. SKIPPED
[INFO] Apache PDFBox examples ............................. SKIPPED
[INFO] PDFBox reactor ..................................... SKIPPED
[INFO] ------------------------------------------------------------------------
[INFO] BUILD FAILURE
[INFO] ------------------------------------------------------------------------
[INFO] Total time:  06:17 min
[INFO] Finished at: 2019-08-09T03:21:48Z
[INFO] ------------------------------------------------------------------------
Waiting for Jenkins to finish collecting data
[ERROR] Failed to execute goal org.apache.maven.plugins:maven-compiler-plugin:3.6.0:compile
(default-compile) on project fontbox: Compilation failure -> [Help 1]
[ERROR] 
[ERROR] To see the full stack trace of the errors, re-run Maven with the -e switch.
[ERROR] Re-run Maven using the -X switch to enable full debug logging.
[ERROR] 
[ERROR] For more information about the errors and possible solutions, please read the following
articles:
[ERROR] [Help 1] http://cwiki.apache.org/confluence/display/MAVEN/MojoFailureException
[ERROR] 
[ERROR] After correcting the problems, you can resume the build with the command
[ERROR]   mvn <goals> -rf :fontbox
[JENKINS] Archiving <https://builds.apache.org/job/PDFBox-2.0.x-jdk6/ws/2.0/xmpbox/pom.xml>
to org.apache.pdfbox/xmpbox/2.0.17-SNAPSHOT/xmpbox-2.0.17-SNAPSHOT.pom
[JENKINS] Archiving <https://builds.apache.org/job/PDFBox-2.0.x-jdk6/ws/2.0/tools/pom.xml>
to org.apache.pdfbox/pdfbox-tools/2.0.17-SNAPSHOT/pdfbox-tools-2.0.17-SNAPSHOT.pom
[JENKINS] Archiving <https://builds.apache.org/job/PDFBox-2.0.x-jdk6/ws/2.0/debugger/pom.xml>
to org.apache.pdfbox/pdfbox-debugger/2.0.17-SNAPSHOT/pdfbox-debugger-2.0.17-SNAPSHOT.pom
[JENKINS] Archiving <https://builds.apache.org/job/PDFBox-2.0.x-jdk6/ws/2.0/preflight-app/pom.xml>
to org.apache.pdfbox/preflight-app/2.0.17-SNAPSHOT/preflight-app-2.0.17-SNAPSHOT.pom
[JENKINS] Archiving <https://builds.apache.org/job/PDFBox-2.0.x-jdk6/ws/2.0/app/pom.xml>
to org.apache.pdfbox/pdfbox-app/2.0.17-SNAPSHOT/pdfbox-app-2.0.17-SNAPSHOT.pom
[JENKINS] Archiving <https://builds.apache.org/job/PDFBox-2.0.x-jdk6/ws/2.0/examples/pom.xml>
to org.apache.pdfbox/pdfbox-examples/2.0.17-SNAPSHOT/pdfbox-examples-2.0.17-SNAPSHOT.pom
[JENKINS] Archiving <https://builds.apache.org/job/PDFBox-2.0.x-jdk6/ws/2.0/preflight/pom.xml>
to org.apache.pdfbox/preflight/2.0.17-SNAPSHOT/preflight-2.0.17-SNAPSHOT.pom
[JENKINS] Archiving <https://builds.apache.org/job/PDFBox-2.0.x-jdk6/ws/2.0/pom.xml>
to org.apache.pdfbox/pdfbox-reactor/2.0.17-SNAPSHOT/pdfbox-reactor-2.0.17-SNAPSHOT.pom
[JENKINS] Archiving <https://builds.apache.org/job/PDFBox-2.0.x-jdk6/ws/2.0/parent/pom.xml>
to org.apache.pdfbox/pdfbox-parent/2.0.17-SNAPSHOT/pdfbox-parent-2.0.17-SNAPSHOT.pom
[JENKINS] Archiving <https://builds.apache.org/job/PDFBox-2.0.x-jdk6/ws/2.0/pdfbox/pom.xml>
to org.apache.pdfbox/pdfbox/2.0.17-SNAPSHOT/pdfbox-2.0.17-SNAPSHOT.pom
[JENKINS] Archiving <https://builds.apache.org/job/PDFBox-2.0.x-jdk6/ws/2.0/debugger-app/pom.xml>
to org.apache.pdfbox/debugger-app/2.0.17-SNAPSHOT/debugger-app-2.0.17-SNAPSHOT.pom
[JENKINS] Archiving <https://builds.apache.org/job/PDFBox-2.0.x-jdk6/ws/2.0/fontbox/pom.xml>
to org.apache.pdfbox/fontbox/2.0.17-SNAPSHOT/fontbox-2.0.17-SNAPSHOT.pom
Sending e-mails to: dev@pdfbox.apache.org
channel stopped
Archiving artifacts

---------------------------------------------------------------------
To unsubscribe, e-mail: dev-unsubscribe@pdfbox.apache.org
For additional commands, e-mail: dev-help@pdfbox.apache.org


Mime
View raw message