pdfbox-dev mailing list archives

Site index · List index
Message view « Date » · « Thread »
Top « Date » · « Thread »
From Apache Jenkins Server <jenk...@builds.apache.org>
Subject Build failed in Jenkins: PDFBox-sonar #765
Date Fri, 08 Mar 2019 03:51:39 GMT
See <https://builds.apache.org/job/PDFBox-sonar/765/display/redirect?page=changes>

Changes:

[tilman] PDFBOX-4436: make PDCryptFilterDictionary a COSObjectable

[tilman] PDFBOX-4436: use direct objects, as suggested by Till Weiss

------------------------------------------
[...truncated 170.92 KB...]
AU        fontbox/src/main/java/org/apache/fontbox/util/autodetect/OS400FontDirFinder.java
AU        fontbox/src/main/java/org/apache/fontbox/util/autodetect/NativeFontDirFinder.java
AU        fontbox/src/main/java/org/apache/fontbox/util/autodetect/WindowsFontDirFinder.java
AU        fontbox/src/main/java/org/apache/fontbox/util/Charsets.java
AU        fontbox/src/main/java/org/apache/fontbox/util/BoundingBox.java
AU        fontbox/src/main/java/org/apache/fontbox/util/package.html
A         fontbox/src/main/java/org/apache/fontbox/cff
A         fontbox/src/main/java/org/apache/fontbox/cff/CFFStandardEncoding.java
A         fontbox/src/main/java/org/apache/fontbox/cff/CFFExpertSubsetCharset.java
AU        fontbox/src/main/java/org/apache/fontbox/cff/Type1CharString.java
A         fontbox/src/main/java/org/apache/fontbox/cff/Type1FontUtil.java
AU        fontbox/src/main/java/org/apache/fontbox/cff/Type2CharString.java
A         fontbox/src/main/java/org/apache/fontbox/cff/DataInput.java
A         fontbox/src/main/java/org/apache/fontbox/cff/FDSelect.java
A         fontbox/src/main/java/org/apache/fontbox/cff/CIDKeyedType2CharString.java
A         fontbox/src/main/java/org/apache/fontbox/cff/DataOutput.java
A         fontbox/src/main/java/org/apache/fontbox/cff/CFFExpertEncoding.java
A         fontbox/src/main/java/org/apache/fontbox/cff/CFFExpertCharset.java
A         fontbox/src/main/java/org/apache/fontbox/cff/CharStringHandler.java
A         fontbox/src/main/java/org/apache/fontbox/cff/CharStringCommand.java
A         fontbox/src/main/java/org/apache/fontbox/cff/Type1CharStringParser.java
A         fontbox/src/main/java/org/apache/fontbox/cff/Type2CharStringParser.java
A         fontbox/src/main/java/org/apache/fontbox/cff/CFFCIDFont.java
A         fontbox/src/main/java/org/apache/fontbox/cff/CFFEncoding.java
A         fontbox/src/main/java/org/apache/fontbox/cff/CFFStandardString.java
A         fontbox/src/main/java/org/apache/fontbox/cff/CFFCharset.java
A         fontbox/src/main/java/org/apache/fontbox/cff/CFFDataInput.java
A         fontbox/src/main/java/org/apache/fontbox/cff/CFFType1Font.java
A         fontbox/src/main/java/org/apache/fontbox/cff/CFFOperator.java
A         fontbox/src/main/java/org/apache/fontbox/cff/CFFParser.java
A         fontbox/src/main/java/org/apache/fontbox/cff/package.html
A         fontbox/src/main/java/org/apache/fontbox/cff/CFFISOAdobeCharset.java
A         fontbox/src/main/java/org/apache/fontbox/cff/CFFFont.java
A         fontbox/src/main/java/org/apache/fontbox/cmap
AU        fontbox/src/main/java/org/apache/fontbox/cmap/CodespaceRange.java
AU        fontbox/src/main/java/org/apache/fontbox/cmap/CIDRange.java
AU        fontbox/src/main/java/org/apache/fontbox/cmap/CMapParser.java
AU        fontbox/src/main/java/org/apache/fontbox/cmap/package.html
AU        fontbox/src/main/java/org/apache/fontbox/cmap/CMap.java
A         fontbox/fontbox-checkstyle.xml
A         fontbox/pom.xml
AU        fontbox/README.txt
AU        pdfbox-checkstyle-5.xml
 U        .
At revision 1855015

Injecting SonarQube environment variables using the configuration: ASF Sonar Analysis
Parsing POMs
Established TCP socket on 36756
maven35-agent.jar already up to date
maven35-interceptor.jar already up to date
maven3-interceptor-commons.jar already up to date
[trunk] $ /home/jenkins/tools/java/latest1.8/bin/java -Xmx1g -cp /home/jenkins/jenkins-slave/maven35-agent.jar:/home/jenkins/tools/maven/apache-maven-3.5.0/boot/plexus-classworlds-2.5.2.jar:/home/jenkins/tools/maven/apache-maven-3.5.0/conf/logging
jenkins.maven3.agent.Maven35Main /home/jenkins/tools/maven/apache-maven-3.5.0 /home/jenkins/jenkins-slave/remoting.jar
/home/jenkins/jenkins-slave/maven35-interceptor.jar /home/jenkins/jenkins-slave/maven3-interceptor-commons.jar
36756
<===[JENKINS REMOTING CAPACITY]===>   channel started
Executing Maven:  -B -f <https://builds.apache.org/job/PDFBox-sonar/ws/trunk/pom.xml>
-Dmaven.repo.local=/home/jenkins/jenkins-slave/maven-repositories/0 compile sonar:sonar -Dsonar.host.url=https://builds.apache.org/analysis
-Dskip-bavaria=false
[INFO] Scanning for projects...
[INFO] ------------------------------------------------------------------------
[INFO] Reactor Build Order:
[INFO] 
[INFO] PDFBox parent
[INFO] Apache FontBox
[INFO] Apache XmpBox
[INFO] Apache PDFBox
[INFO] Apache Preflight
[INFO] Apache Preflight application
[INFO] Apache PDFBox Debugger
[INFO] Apache PDFBox tools
[INFO] Apache PDFBox application
[INFO] Apache PDFBox Debugger application
[INFO] Apache PDFBox examples
[INFO] Apache PDFBox
[INFO] Downloading: https://repo.maven.apache.org/maven2/org/codehaus/mojo/animal-sniffer-maven-plugin/1.17/animal-sniffer-maven-plugin-1.17.pom
[INFO] Downloaded: https://repo.maven.apache.org/maven2/org/codehaus/mojo/animal-sniffer-maven-plugin/1.17/animal-sniffer-maven-plugin-1.17.pom
(5.6 kB at 16 kB/s)
[INFO] Downloading: https://repo.maven.apache.org/maven2/org/codehaus/mojo/animal-sniffer-maven-plugin/1.17/animal-sniffer-maven-plugin-1.17.jar
[INFO] Downloaded: https://repo.maven.apache.org/maven2/org/codehaus/mojo/animal-sniffer-maven-plugin/1.17/animal-sniffer-maven-plugin-1.17.jar
(34 kB at 1.3 MB/s)
[INFO] 
[INFO] ------------------------------------------------------------------------
[INFO] Building PDFBox parent 3.0.0-SNAPSHOT
[INFO] ------------------------------------------------------------------------
[INFO] 
[INFO] --- maven-enforcer-plugin:1.4.1:enforce (default) @ pdfbox-parent ---
[INFO] 
[INFO] --- maven-enforcer-plugin:1.4.1:enforce (enforce-maven-version) @ pdfbox-parent ---
[INFO] 
[INFO] --- maven-remote-resources-plugin:1.5:process (process-resource-bundles) @ pdfbox-parent
---
[INFO] 
[INFO] ------------------------------------------------------------------------
[INFO] Building Apache FontBox 3.0.0-SNAPSHOT
[INFO] ------------------------------------------------------------------------
[INFO] 
[INFO] --- maven-enforcer-plugin:1.4.1:enforce (default) @ fontbox ---
[INFO] 
[INFO] --- maven-enforcer-plugin:1.4.1:enforce (enforce-maven-version) @ fontbox ---
[INFO] 
[INFO] --- maven-remote-resources-plugin:1.5:process (process-resource-bundles) @ fontbox
---
[INFO] 
[INFO] --- maven-resources-plugin:3.1.0:resources (default-resources) @ fontbox ---
[INFO] Using 'UTF-8' encoding to copy filtered resources.
[INFO] Copying 92 resources
[INFO] Copying 3 resources
[INFO] 
[INFO] --- maven-compiler-plugin:3.7.0:compile (default-compile) @ fontbox ---
[INFO] Changes detected - recompiling the module!
[INFO] Compiling 134 source files to <https://builds.apache.org/job/PDFBox-sonar/ws/trunk/fontbox/target/classes>
[WARNING] bootstrap class path not set in conjunction with -source 1.7
[INFO] <https://builds.apache.org/job/PDFBox-sonar/ws/trunk/fontbox/src/main/java/org/apache/fontbox/cff/CFFFont.java>:
Some input files use unchecked or unsafe operations.
[INFO] <https://builds.apache.org/job/PDFBox-sonar/ws/trunk/fontbox/src/main/java/org/apache/fontbox/cff/CFFFont.java>:
Recompile with -Xlint:unchecked for details.
[INFO] 
[INFO] ------------------------------------------------------------------------
[INFO] Building Apache XmpBox 3.0.0-SNAPSHOT
[INFO] ------------------------------------------------------------------------
[INFO] 
[INFO] --- maven-enforcer-plugin:1.4.1:enforce (default) @ xmpbox ---
[INFO] 
[INFO] --- maven-enforcer-plugin:1.4.1:enforce (enforce-maven-version) @ xmpbox ---
[INFO] 
[INFO] --- maven-remote-resources-plugin:1.5:process (process-resource-bundles) @ xmpbox ---
[INFO] 
[INFO] --- maven-resources-plugin:3.1.0:resources (default-resources) @ xmpbox ---
[INFO] Using 'UTF-8' encoding to copy filtered resources.
[INFO] skip non existing resourceDirectory <https://builds.apache.org/job/PDFBox-sonar/ws/trunk/xmpbox/src/main/resources>
[INFO] Copying 3 resources
[INFO] 
[INFO] --- maven-compiler-plugin:3.7.0:compile (default-compile) @ xmpbox ---
[INFO] Changes detected - recompiling the module!
[INFO] Compiling 72 source files to <https://builds.apache.org/job/PDFBox-sonar/ws/trunk/xmpbox/target/classes>
[WARNING] bootstrap class path not set in conjunction with -source 1.7
[INFO] 
[INFO] ------------------------------------------------------------------------
[INFO] Building Apache PDFBox 3.0.0-SNAPSHOT
[INFO] ------------------------------------------------------------------------
[INFO] Downloading: https://repo.maven.apache.org/maven2/org/bouncycastle/bcmail-jdk15on/1.61/bcmail-jdk15on-1.61.pom
[INFO] Downloaded: https://repo.maven.apache.org/maven2/org/bouncycastle/bcmail-jdk15on/1.61/bcmail-jdk15on-1.61.pom
(1.6 kB at 82 kB/s)
[INFO] Downloading: https://repo.maven.apache.org/maven2/org/bouncycastle/bcprov-jdk15on/1.61/bcprov-jdk15on-1.61.pom
[INFO] Downloaded: https://repo.maven.apache.org/maven2/org/bouncycastle/bcprov-jdk15on/1.61/bcprov-jdk15on-1.61.pom
(1.1 kB at 35 kB/s)
[INFO] Downloading: https://repo.maven.apache.org/maven2/org/bouncycastle/bcpkix-jdk15on/1.61/bcpkix-jdk15on-1.61.pom
[INFO] Downloaded: https://repo.maven.apache.org/maven2/org/bouncycastle/bcpkix-jdk15on/1.61/bcpkix-jdk15on-1.61.pom
(1.5 kB at 70 kB/s)
[INFO] Downloading: https://repo.maven.apache.org/maven2/com/github/jai-imageio/jai-imageio-jpeg2000/1.3.0/jai-imageio-jpeg2000-1.3.0.pom
[INFO] Downloaded: https://repo.maven.apache.org/maven2/com/github/jai-imageio/jai-imageio-jpeg2000/1.3.0/jai-imageio-jpeg2000-1.3.0.pom
(10 kB at 541 kB/s)
[INFO] Downloading: https://repo.maven.apache.org/maven2/org/bouncycastle/bcmail-jdk15on/1.61/bcmail-jdk15on-1.61.jar
[INFO] Downloading: https://repo.maven.apache.org/maven2/org/bouncycastle/bcpkix-jdk15on/1.61/bcpkix-jdk15on-1.61.jar
[INFO] Downloading: https://repo.maven.apache.org/maven2/org/bouncycastle/bcprov-jdk15on/1.61/bcprov-jdk15on-1.61.jar
[INFO] Downloaded: https://repo.maven.apache.org/maven2/org/bouncycastle/bcmail-jdk15on/1.61/bcmail-jdk15on-1.61.jar
(109 kB at 3.2 MB/s)
[INFO] Downloaded: https://repo.maven.apache.org/maven2/org/bouncycastle/bcpkix-jdk15on/1.61/bcpkix-jdk15on-1.61.jar
(866 kB at 3.4 MB/s)
[INFO] Downloaded: https://repo.maven.apache.org/maven2/org/bouncycastle/bcprov-jdk15on/1.61/bcprov-jdk15on-1.61.jar
(4.5 MB at 11 MB/s)
[INFO] 
[INFO] --- maven-enforcer-plugin:1.4.1:enforce (default) @ pdfbox ---
[INFO] 
[INFO] --- maven-enforcer-plugin:1.4.1:enforce (enforce-maven-version) @ pdfbox ---
[INFO] 
[INFO] --- maven-remote-resources-plugin:1.5:process (process-resource-bundles) @ pdfbox ---
[INFO] 
[INFO] --- maven-resources-plugin:3.1.0:resources (default-resources) @ pdfbox ---
[INFO] Using 'UTF-8' encoding to copy filtered resources.
[INFO] Copying 1 resource
[INFO] Copying 21 resources
[INFO] Copying 3 resources
[INFO] 
[INFO] --- maven-compiler-plugin:3.7.0:compile (default-compile) @ pdfbox ---
[INFO] Changes detected - recompiling the module!
[INFO] Compiling 601 source files to <https://builds.apache.org/job/PDFBox-sonar/ws/trunk/pdfbox/target/classes>
[INFO] <https://builds.apache.org/job/PDFBox-sonar/ws/trunk/pdfbox/src/main/java/org/apache/pdfbox/pdmodel/common/PDStream.java>:
Some input files use unchecked or unsafe operations.
[INFO] <https://builds.apache.org/job/PDFBox-sonar/ws/trunk/pdfbox/src/main/java/org/apache/pdfbox/pdmodel/common/PDStream.java>:
Recompile with -Xlint:unchecked for details.
[INFO] -------------------------------------------------------------
[WARNING] COMPILATION WARNING : 
[INFO] -------------------------------------------------------------
[WARNING] bootstrap class path not set in conjunction with -source 1.7
[WARNING] <https://builds.apache.org/job/PDFBox-sonar/ws/trunk/pdfbox/src/main/java/org/apache/pdfbox/pdmodel/font/PDFont.java>:[310,27]
getHeight(int) in org.apache.pdfbox.pdmodel.font.PDFontLike has been deprecated
[WARNING] <https://builds.apache.org/job/PDFBox-sonar/ws/trunk/pdfbox/src/main/java/org/apache/pdfbox/pdmodel/font/PDCIDFont.java>:[297,27]
getHeight(int) in org.apache.pdfbox.pdmodel.font.PDFontLike has been deprecated
[WARNING] <https://builds.apache.org/job/PDFBox-sonar/ws/trunk/pdfbox/src/main/java/org/apache/pdfbox/pdmodel/font/TrueTypeEmbedder.java>:[102,19]
getUnicodeCmap() in org.apache.fontbox.ttf.TrueTypeFont has been deprecated
[INFO] 4 warnings 
[INFO] -------------------------------------------------------------
[INFO] -------------------------------------------------------------
[ERROR] COMPILATION ERROR : 
[INFO] -------------------------------------------------------------
[ERROR] <https://builds.apache.org/job/PDFBox-sonar/ws/trunk/pdfbox/src/main/java/org/apache/pdfbox/pdmodel/encryption/PublicKeySecurityHandler.java>:[159,64]
cannot find symbol
  symbol:   method getCOSDictionary()
  location: variable defaultCryptFilterDictionary of type org.apache.pdfbox.pdmodel.encryption.PDCryptFilterDictionary
[ERROR] <https://builds.apache.org/job/PDFBox-sonar/ws/trunk/pdfbox/src/main/java/org/apache/pdfbox/pdmodel/encryption/PublicKeySecurityHandler.java>:[421,30]
cannot find symbol
  symbol:   method getCOSDictionary()
  location: variable cryptFilterDictionary of type org.apache.pdfbox.pdmodel.encryption.PDCryptFilterDictionary
[ERROR] <https://builds.apache.org/job/PDFBox-sonar/ws/trunk/pdfbox/src/main/java/org/apache/pdfbox/pdmodel/encryption/PublicKeySecurityHandler.java>:[425,30]
cannot find symbol
  symbol:   method getCOSDictionary()
  location: variable cryptFilterDictionary of type org.apache.pdfbox.pdmodel.encryption.PDCryptFilterDictionary
[INFO] 3 errors 
[INFO] -------------------------------------------------------------
[INFO] 
[INFO] ------------------------------------------------------------------------
[INFO] Skipping Apache PDFBox
[INFO] This project has been banned from the build due to previous failures.
[INFO] ------------------------------------------------------------------------
[INFO] ------------------------------------------------------------------------
[INFO] Reactor Summary:
[INFO] 
[INFO] PDFBox parent ...................................... SUCCESS [  5.577 s]
[INFO] Apache FontBox ..................................... SUCCESS [  6.412 s]
[INFO] Apache XmpBox ...................................... SUCCESS [  2.352 s]
[INFO] Apache PDFBox ...................................... FAILURE [  7.439 s]
[INFO] Apache Preflight ................................... SKIPPED
[INFO] Apache Preflight application ....................... SKIPPED
[INFO] Apache PDFBox Debugger ............................. SKIPPED
[INFO] Apache PDFBox tools ................................ SKIPPED
[INFO] Apache PDFBox application .......................... SKIPPED
[INFO] Apache PDFBox Debugger application ................. SKIPPED
[INFO] Apache PDFBox examples ............................. SKIPPED
[INFO] Apache PDFBox ...................................... SKIPPED
[INFO] ------------------------------------------------------------------------
[INFO] BUILD FAILURE
[INFO] ------------------------------------------------------------------------
[INFO] Total time: 54.677 s
[INFO] Finished at: 2019-03-08T03:51:14Z
[INFO] Final Memory: 40M/563M
[INFO] ------------------------------------------------------------------------
[ERROR] Failed to execute goal org.apache.maven.plugins:maven-compiler-plugin:3.7.0:compile
(default-compile) on project pdfbox: Compilation failure: Compilation failure:
[ERROR] <https://builds.apache.org/job/PDFBox-sonar/ws/trunk/pdfbox/src/main/java/org/apache/pdfbox/pdmodel/encryption/PublicKeySecurityHandler.java>:[159,64]
cannot find symbol
[ERROR] symbol:   method getCOSDictionary()
[ERROR] location: variable defaultCryptFilterDictionary of type org.apache.pdfbox.pdmodel.encryption.PDCryptFilterDictionary
[ERROR] <https://builds.apache.org/job/PDFBox-sonar/ws/trunk/pdfbox/src/main/java/org/apache/pdfbox/pdmodel/encryption/PublicKeySecurityHandler.java>:[421,30]
cannot find symbol
[ERROR] symbol:   method getCOSDictionary()
[ERROR] location: variable cryptFilterDictionary of type org.apache.pdfbox.pdmodel.encryption.PDCryptFilterDictionary
[ERROR] <https://builds.apache.org/job/PDFBox-sonar/ws/trunk/pdfbox/src/main/java/org/apache/pdfbox/pdmodel/encryption/PublicKeySecurityHandler.java>:[425,30]
cannot find symbol
[ERROR] symbol:   method getCOSDictionary()
[ERROR] location: variable cryptFilterDictionary of type org.apache.pdfbox.pdmodel.encryption.PDCryptFilterDictionary
[ERROR] -> [Help 1]
[ERROR] 
[ERROR] To see the full stack trace of the errors, re-run Maven with the -e switch.
[ERROR] Re-run Maven using the -X switch to enable full debug logging.
[ERROR] 
[ERROR] For more information about the errors and possible solutions, please read the following
articles:
[ERROR] [Help 1] http://cwiki.apache.org/confluence/display/MAVEN/MojoFailureException
[ERROR] 
[ERROR] After correcting the problems, you can resume the build with the command
[ERROR]   mvn <goals> -rf :pdfbox
[JENKINS] Archiving <https://builds.apache.org/job/PDFBox-sonar/ws/trunk/xmpbox/pom.xml>
to org.apache.pdfbox/xmpbox/3.0.0-SNAPSHOT/xmpbox-3.0.0-SNAPSHOT.pom
[JENKINS] Archiving <https://builds.apache.org/job/PDFBox-sonar/ws/trunk/tools/pom.xml>
to org.apache.pdfbox/pdfbox-tools/3.0.0-SNAPSHOT/pdfbox-tools-3.0.0-SNAPSHOT.pom
[JENKINS] Archiving <https://builds.apache.org/job/PDFBox-sonar/ws/trunk/debugger/pom.xml>
to org.apache.pdfbox/pdfbox-debugger/3.0.0-SNAPSHOT/pdfbox-debugger-3.0.0-SNAPSHOT.pom
[JENKINS] Archiving <https://builds.apache.org/job/PDFBox-sonar/ws/trunk/preflight-app/pom.xml>
to org.apache.pdfbox/preflight-app/3.0.0-SNAPSHOT/preflight-app-3.0.0-SNAPSHOT.pom
[JENKINS] Archiving <https://builds.apache.org/job/PDFBox-sonar/ws/trunk/app/pom.xml>
to org.apache.pdfbox/pdfbox-app/3.0.0-SNAPSHOT/pdfbox-app-3.0.0-SNAPSHOT.pom
[JENKINS] Archiving <https://builds.apache.org/job/PDFBox-sonar/ws/trunk/examples/pom.xml>
to org.apache.pdfbox/pdfbox-examples/3.0.0-SNAPSHOT/pdfbox-examples-3.0.0-SNAPSHOT.pom
[JENKINS] Archiving <https://builds.apache.org/job/PDFBox-sonar/ws/trunk/preflight/pom.xml>
to org.apache.pdfbox/preflight/3.0.0-SNAPSHOT/preflight-3.0.0-SNAPSHOT.pom
[JENKINS] Archiving <https://builds.apache.org/job/PDFBox-sonar/ws/trunk/pom.xml> to
org.apache.pdfbox/pdfbox-reactor/3.0.0-SNAPSHOT/pdfbox-reactor-3.0.0-SNAPSHOT.pom
[JENKINS] Archiving <https://builds.apache.org/job/PDFBox-sonar/ws/trunk/parent/pom.xml>
to org.apache.pdfbox/pdfbox-parent/3.0.0-SNAPSHOT/pdfbox-parent-3.0.0-SNAPSHOT.pom
[JENKINS] Archiving <https://builds.apache.org/job/PDFBox-sonar/ws/trunk/pdfbox/pom.xml>
to org.apache.pdfbox/pdfbox/3.0.0-SNAPSHOT/pdfbox-3.0.0-SNAPSHOT.pom
[Fast Archiver] Compressed 36.73 KB of artifacts by 87.1% relative to #764
[JENKINS] Archiving <https://builds.apache.org/job/PDFBox-sonar/ws/trunk/debugger-app/pom.xml>
to org.apache.pdfbox/debugger-app/3.0.0-SNAPSHOT/debugger-app-3.0.0-SNAPSHOT.pom
[JENKINS] Archiving <https://builds.apache.org/job/PDFBox-sonar/ws/trunk/fontbox/pom.xml>
to org.apache.pdfbox/fontbox/3.0.0-SNAPSHOT/fontbox-3.0.0-SNAPSHOT.pom
Sending e-mails to: dev@pdfbox.apache.org
channel stopped
WARN: Unable to locate 'report-task.txt' in the workspace. Did the SonarScanner succedeed?

---------------------------------------------------------------------
To unsubscribe, e-mail: dev-unsubscribe@pdfbox.apache.org
For additional commands, e-mail: dev-help@pdfbox.apache.org


Mime
View raw message