pdfbox-dev mailing list archives

Site index · List index
Message view « Date » · « Thread »
Top « Date » · « Thread »
From Apache Jenkins Server <jenk...@builds.apache.org>
Subject Build failed in Jenkins: PDFBox-Trunk-jdk9 #704
Date Thu, 27 Dec 2018 15:27:58 GMT
See <https://builds.apache.org/job/PDFBox-Trunk-jdk9/704/display/redirect>

------------------------------------------
Started by an SCM change
[EnvInject] - Loading node environment variables.
Building remotely on H21 (ubuntu xenial) in workspace <https://builds.apache.org/job/PDFBox-Trunk-jdk9/ws/>
Cleaning up <https://builds.apache.org/job/PDFBox-Trunk-jdk9/ws/trunk>
Deleting <https://builds.apache.org/job/PDFBox-Trunk-jdk9/ws/trunk/app/target>
Deleting <https://builds.apache.org/job/PDFBox-Trunk-jdk9/ws/trunk/parent/target>
Deleting <https://builds.apache.org/job/PDFBox-Trunk-jdk9/ws/trunk/debugger-app/target>
Deleting <https://builds.apache.org/job/PDFBox-Trunk-jdk9/ws/trunk/debugger/target>
Deleting <https://builds.apache.org/job/PDFBox-Trunk-jdk9/ws/trunk/xmpbox/target>
Deleting <https://builds.apache.org/job/PDFBox-Trunk-jdk9/ws/trunk/tools/target>
Deleting <https://builds.apache.org/job/PDFBox-Trunk-jdk9/ws/trunk/preflight/target>
Deleting <https://builds.apache.org/job/PDFBox-Trunk-jdk9/ws/trunk/target>
Deleting <https://builds.apache.org/job/PDFBox-Trunk-jdk9/ws/trunk/examples/target>
Deleting <https://builds.apache.org/job/PDFBox-Trunk-jdk9/ws/trunk/fontbox/target>
Deleting <https://builds.apache.org/job/PDFBox-Trunk-jdk9/ws/trunk/pdfbox/target>
Deleting <https://builds.apache.org/job/PDFBox-Trunk-jdk9/ws/trunk/preflight-app/target>
Updating http://svn.apache.org/repos/asf/pdfbox/trunk at revision '2018-12-27T15:27:12.343
+0000'
U         pdfbox/src/main/java/org/apache/pdfbox/multipdf/PDFMergerUtility.java
U         pdfbox/src/main/java/org/apache/pdfbox/pdmodel/PDDocumentCatalog.java
At revision 1849800

org.tmatesoft.svn.core.SVNException: svn: E130003: Parser configuration problem: namespace
reporting is not enabled
	at org.tmatesoft.svn.core.internal.wc.SVNErrorManager.error(SVNErrorManager.java:70)
	at org.tmatesoft.svn.core.internal.wc.SVNErrorManager.error(SVNErrorManager.java:57)
	at org.tmatesoft.svn.core.internal.io.dav.http.HTTPConnection.request(HTTPConnection.java:760)
	at org.tmatesoft.svn.core.internal.io.dav.http.HTTPConnection.request(HTTPConnection.java:352)
	at org.tmatesoft.svn.core.internal.io.dav.http.HTTPConnection.request(HTTPConnection.java:340)
	at org.tmatesoft.svn.core.internal.io.dav.DAVConnection.performHttpRequest(DAVConnection.java:897)
	at org.tmatesoft.svn.core.internal.io.dav.DAVConnection.doReport(DAVConnection.java:363)
	at org.tmatesoft.svn.core.internal.io.dav.DAVConnection.doReport(DAVConnection.java:353)
	at org.tmatesoft.svn.core.internal.io.dav.DAVRepository.logImpl(DAVRepository.java:1003)
	at org.tmatesoft.svn.core.io.SVNRepository.log(SVNRepository.java:1041)
	at org.tmatesoft.svn.core.internal.wc2.remote.SvnRemoteLog.run(SvnRemoteLog.java:181)
	at org.tmatesoft.svn.core.internal.wc2.remote.SvnRemoteLog.run(SvnRemoteLog.java:35)
	at org.tmatesoft.svn.core.internal.wc2.SvnOperationRunner.run(SvnOperationRunner.java:21)
	at org.tmatesoft.svn.core.wc2.SvnOperationFactory.run(SvnOperationFactory.java:1239)
	at org.tmatesoft.svn.core.wc2.SvnOperation.run(SvnOperation.java:294)
	at org.tmatesoft.svn.core.wc.SVNLogClient.doLog(SVNLogClient.java:968)
	at org.tmatesoft.svn.core.wc.SVNLogClient.doLog(SVNLogClient.java:873)
	at hudson.scm.SubversionChangeLogBuilder.buildModule(SubversionChangeLogBuilder.java:190)
Caused: hudson.util.IOException2: revision check failed on http://svn.apache.org/repos/asf/pdfbox/trunk
	at hudson.scm.SubversionChangeLogBuilder.buildModule(SubversionChangeLogBuilder.java:204)
	at hudson.scm.SubversionChangeLogBuilder.run(SubversionChangeLogBuilder.java:124)
	at hudson.scm.SubversionSCM.calcChangeLog(SubversionSCM.java:757)
	at hudson.scm.SubversionSCM.checkout(SubversionSCM.java:898)
	at hudson.scm.SCM.checkout(SCM.java:504)
	at hudson.model.AbstractProject.checkout(AbstractProject.java:1208)
	at hudson.model.AbstractBuild$AbstractBuildExecution.defaultCheckout(AbstractBuild.java:574)
	at jenkins.scm.SCMCheckoutStrategy.checkout(SCMCheckoutStrategy.java:86)
	at hudson.model.AbstractBuild$AbstractBuildExecution.run(AbstractBuild.java:499)
	at hudson.model.Run.execute(Run.java:1794)
	at hudson.maven.MavenModuleSetBuild.run(MavenModuleSetBuild.java:543)
	at hudson.model.ResourceController.execute(ResourceController.java:97)
	at hudson.model.Executor.run(Executor.java:429)
Retrying after 10 seconds
Cleaning up <https://builds.apache.org/job/PDFBox-Trunk-jdk9/ws/trunk>
Updating http://svn.apache.org/repos/asf/pdfbox/trunk at revision '2018-12-27T15:27:12.343
+0000'
At revision 1849800

org.tmatesoft.svn.core.SVNException: svn: E130003: Parser configuration problem: namespace
reporting is not enabled
	at org.tmatesoft.svn.core.internal.wc.SVNErrorManager.error(SVNErrorManager.java:70)
	at org.tmatesoft.svn.core.internal.wc.SVNErrorManager.error(SVNErrorManager.java:57)
	at org.tmatesoft.svn.core.internal.io.dav.http.HTTPConnection.request(HTTPConnection.java:760)
	at org.tmatesoft.svn.core.internal.io.dav.http.HTTPConnection.request(HTTPConnection.java:352)
	at org.tmatesoft.svn.core.internal.io.dav.http.HTTPConnection.request(HTTPConnection.java:340)
	at org.tmatesoft.svn.core.internal.io.dav.DAVConnection.performHttpRequest(DAVConnection.java:897)
	at org.tmatesoft.svn.core.internal.io.dav.DAVConnection.doReport(DAVConnection.java:363)
	at org.tmatesoft.svn.core.internal.io.dav.DAVConnection.doReport(DAVConnection.java:353)
	at org.tmatesoft.svn.core.internal.io.dav.DAVRepository.logImpl(DAVRepository.java:1003)
	at org.tmatesoft.svn.core.io.SVNRepository.log(SVNRepository.java:1041)
	at org.tmatesoft.svn.core.internal.wc2.remote.SvnRemoteLog.run(SvnRemoteLog.java:181)
	at org.tmatesoft.svn.core.internal.wc2.remote.SvnRemoteLog.run(SvnRemoteLog.java:35)
	at org.tmatesoft.svn.core.internal.wc2.SvnOperationRunner.run(SvnOperationRunner.java:21)
	at org.tmatesoft.svn.core.wc2.SvnOperationFactory.run(SvnOperationFactory.java:1239)
	at org.tmatesoft.svn.core.wc2.SvnOperation.run(SvnOperation.java:294)
	at org.tmatesoft.svn.core.wc.SVNLogClient.doLog(SVNLogClient.java:968)
	at org.tmatesoft.svn.core.wc.SVNLogClient.doLog(SVNLogClient.java:873)
	at hudson.scm.SubversionChangeLogBuilder.buildModule(SubversionChangeLogBuilder.java:190)
Caused: hudson.util.IOException2: revision check failed on http://svn.apache.org/repos/asf/pdfbox/trunk
	at hudson.scm.SubversionChangeLogBuilder.buildModule(SubversionChangeLogBuilder.java:204)
	at hudson.scm.SubversionChangeLogBuilder.run(SubversionChangeLogBuilder.java:124)
	at hudson.scm.SubversionSCM.calcChangeLog(SubversionSCM.java:757)
	at hudson.scm.SubversionSCM.checkout(SubversionSCM.java:898)
	at hudson.scm.SCM.checkout(SCM.java:504)
	at hudson.model.AbstractProject.checkout(AbstractProject.java:1208)
	at hudson.model.AbstractBuild$AbstractBuildExecution.defaultCheckout(AbstractBuild.java:574)
	at jenkins.scm.SCMCheckoutStrategy.checkout(SCMCheckoutStrategy.java:86)
	at hudson.model.AbstractBuild$AbstractBuildExecution.run(AbstractBuild.java:499)
	at hudson.model.Run.execute(Run.java:1794)
	at hudson.maven.MavenModuleSetBuild.run(MavenModuleSetBuild.java:543)
	at hudson.model.ResourceController.execute(ResourceController.java:97)
	at hudson.model.Executor.run(Executor.java:429)
Retrying after 10 seconds
Cleaning up <https://builds.apache.org/job/PDFBox-Trunk-jdk9/ws/trunk>
Updating http://svn.apache.org/repos/asf/pdfbox/trunk at revision '2018-12-27T15:27:12.343
+0000'
At revision 1849800

org.tmatesoft.svn.core.SVNException: svn: E130003: Parser configuration problem: namespace
reporting is not enabled
	at org.tmatesoft.svn.core.internal.wc.SVNErrorManager.error(SVNErrorManager.java:70)
	at org.tmatesoft.svn.core.internal.wc.SVNErrorManager.error(SVNErrorManager.java:57)
	at org.tmatesoft.svn.core.internal.io.dav.http.HTTPConnection.request(HTTPConnection.java:760)
	at org.tmatesoft.svn.core.internal.io.dav.http.HTTPConnection.request(HTTPConnection.java:352)
	at org.tmatesoft.svn.core.internal.io.dav.http.HTTPConnection.request(HTTPConnection.java:340)
	at org.tmatesoft.svn.core.internal.io.dav.DAVConnection.performHttpRequest(DAVConnection.java:897)
	at org.tmatesoft.svn.core.internal.io.dav.DAVConnection.doReport(DAVConnection.java:363)
	at org.tmatesoft.svn.core.internal.io.dav.DAVConnection.doReport(DAVConnection.java:353)
	at org.tmatesoft.svn.core.internal.io.dav.DAVRepository.logImpl(DAVRepository.java:1003)
	at org.tmatesoft.svn.core.io.SVNRepository.log(SVNRepository.java:1041)
	at org.tmatesoft.svn.core.internal.wc2.remote.SvnRemoteLog.run(SvnRemoteLog.java:181)
	at org.tmatesoft.svn.core.internal.wc2.remote.SvnRemoteLog.run(SvnRemoteLog.java:35)
	at org.tmatesoft.svn.core.internal.wc2.SvnOperationRunner.run(SvnOperationRunner.java:21)
	at org.tmatesoft.svn.core.wc2.SvnOperationFactory.run(SvnOperationFactory.java:1239)
	at org.tmatesoft.svn.core.wc2.SvnOperation.run(SvnOperation.java:294)
	at org.tmatesoft.svn.core.wc.SVNLogClient.doLog(SVNLogClient.java:968)
	at org.tmatesoft.svn.core.wc.SVNLogClient.doLog(SVNLogClient.java:873)
	at hudson.scm.SubversionChangeLogBuilder.buildModule(SubversionChangeLogBuilder.java:190)
Caused: hudson.util.IOException2: revision check failed on http://svn.apache.org/repos/asf/pdfbox/trunk
	at hudson.scm.SubversionChangeLogBuilder.buildModule(SubversionChangeLogBuilder.java:204)
	at hudson.scm.SubversionChangeLogBuilder.run(SubversionChangeLogBuilder.java:124)
	at hudson.scm.SubversionSCM.calcChangeLog(SubversionSCM.java:757)
	at hudson.scm.SubversionSCM.checkout(SubversionSCM.java:898)
	at hudson.scm.SCM.checkout(SCM.java:504)
	at hudson.model.AbstractProject.checkout(AbstractProject.java:1208)
	at hudson.model.AbstractBuild$AbstractBuildExecution.defaultCheckout(AbstractBuild.java:574)
	at jenkins.scm.SCMCheckoutStrategy.checkout(SCMCheckoutStrategy.java:86)
	at hudson.model.AbstractBuild$AbstractBuildExecution.run(AbstractBuild.java:499)
	at hudson.model.Run.execute(Run.java:1794)
	at hudson.maven.MavenModuleSetBuild.run(MavenModuleSetBuild.java:543)
	at hudson.model.ResourceController.execute(ResourceController.java:97)
	at hudson.model.Executor.run(Executor.java:429)
Archiving artifacts

---------------------------------------------------------------------
To unsubscribe, e-mail: dev-unsubscribe@pdfbox.apache.org
For additional commands, e-mail: dev-help@pdfbox.apache.org


Mime
View raw message