pdfbox-dev mailing list archives

Site index · List index
Message view « Date » · « Thread »
Top « Date » · « Thread »
From Apache Jenkins Server <jenk...@builds.apache.org>
Subject Build failed in Jenkins: PDFBox-trunk » Apache PDFBox examples #4326
Date Mon, 05 Nov 2018 20:08:29 GMT
See <https://builds.apache.org/job/PDFBox-trunk/org.apache.pdfbox$pdfbox-examples/4326/display/redirect?page=changes>

Changes:

[tilman] PDFBOX-3017: check certificate chain only when not self-signed

------------------------------------------
[INFO] 
[INFO] -----------------< org.apache.pdfbox:pdfbox-examples >------------------
[INFO] Building Apache PDFBox examples 3.0.0-SNAPSHOT                   [11/12]
[INFO] --------------------------------[ jar ]---------------------------------
[INFO] 
[INFO] --- maven-clean-plugin:3.1.0:clean (default-clean) @ pdfbox-examples ---
[TASKS] Scanning folder '<https://builds.apache.org/job/PDFBox-trunk/org.apache.pdfbox$pdfbox-examples/ws/'>
for files matching the pattern '**/*.java' - excludes: 
[TASKS] Found 87 files to scan for tasks
Found 13 open tasks.
[TASKS] Computing warning deltas based on reference build #4325
[INFO] 
[INFO] --- maven-enforcer-plugin:1.4.1:enforce (enforce-maven-version) @ pdfbox-examples ---
[INFO] 
[INFO] --- maven-enforcer-plugin:1.4.1:enforce (default) @ pdfbox-examples ---
[INFO] 
[INFO] --- maven-remote-resources-plugin:1.5:process (process-resource-bundles) @ pdfbox-examples
---
[INFO] 
[INFO] --- maven-resources-plugin:3.1.0:resources (default-resources) @ pdfbox-examples ---
[INFO] Using 'UTF-8' encoding to copy filtered resources.
[INFO] Copying 8 resources
[INFO] Copying 3 resources
[INFO] 
[INFO] --- maven-compiler-plugin:3.7.0:compile (default-compile) @ pdfbox-examples ---
[INFO] Changes detected - recompiling the module!
[INFO] Compiling 83 source files to <https://builds.apache.org/job/PDFBox-trunk/org.apache.pdfbox$pdfbox-examples/ws/target/classes>
[INFO] <https://builds.apache.org/job/PDFBox-trunk/org.apache.pdfbox$pdfbox-examples/ws/src/main/java/org/apache/pdfbox/examples/signature/ShowSignature.java>:
<https://builds.apache.org/job/PDFBox-trunk/org.apache.pdfbox$pdfbox-examples/ws/src/main/java/org/apache/pdfbox/examples/signature/ShowSignature.java>
uses unchecked or unsafe operations.
[INFO] <https://builds.apache.org/job/PDFBox-trunk/org.apache.pdfbox$pdfbox-examples/ws/src/main/java/org/apache/pdfbox/examples/signature/ShowSignature.java>:
Recompile with -Xlint:unchecked for details.
[INFO] -------------------------------------------------------------
[WARNING] COMPILATION WARNING : 
[INFO] -------------------------------------------------------------
[WARNING] bootstrap class path not set in conjunction with -source 1.7
[INFO] 1 warning
[INFO] -------------------------------------------------------------
[INFO] -------------------------------------------------------------
[ERROR] COMPILATION ERROR : 
[INFO] -------------------------------------------------------------
[ERROR] <https://builds.apache.org/job/PDFBox-trunk/org.apache.pdfbox$pdfbox-examples/ws/src/main/java/org/apache/pdfbox/examples/signature/ShowSignature.java>:[247,70]
cannot find symbol
  symbol:   variable certFromSignedData
  location: class org.apache.pdfbox.examples.signature.ShowSignature
[INFO] 1 error
[INFO] -------------------------------------------------------------
[INFO] ------------------------------------------------------------------------
[INFO] Reactor Summary:
[INFO] 
[INFO] PDFBox parent ...................................... SUCCESS [01:30 min]
[INFO] Apache FontBox ..................................... SUCCESS [ 55.296 s]
[INFO] Apache XmpBox ...................................... SUCCESS [ 29.768 s]
[INFO] Apache PDFBox ...................................... SUCCESS [02:18 min]
[INFO] Apache Preflight ................................... SUCCESS [ 40.771 s]
[INFO] Apache Preflight application ....................... SUCCESS [ 31.391 s]
[INFO] Apache PDFBox Debugger ............................. SUCCESS [ 28.141 s]
[INFO] Apache PDFBox tools ................................ SUCCESS [ 35.128 s]
[INFO] Apache PDFBox application .......................... SUCCESS [ 30.002 s]
[INFO] Apache PDFBox Debugger application ................. SUCCESS [ 30.846 s]
[INFO] Apache PDFBox examples ............................. FAILURE [  8.943 s]
[INFO] Apache PDFBox 3.0.0-SNAPSHOT ....................... SKIPPED
[INFO] ------------------------------------------------------------------------
[INFO] BUILD FAILURE
[INFO] ------------------------------------------------------------------------
[INFO] Total time: 09:28 min
[INFO] Finished at: 2018-11-05T20:08:13Z
[INFO] ------------------------------------------------------------------------
Waiting for Jenkins to finish collecting data[ERROR] Failed to execute goal org.apache.maven.plugins:maven-compiler-plugin:3.7.0:compile
(default-compile) on project pdfbox-examples: Compilation failure
[ERROR] <https://builds.apache.org/job/PDFBox-trunk/org.apache.pdfbox$pdfbox-examples/ws/src/main/java/org/apache/pdfbox/examples/signature/ShowSignature.java>:[247,70]
cannot find symbol
[ERROR] symbol:   variable certFromSignedData
[ERROR] location: class org.apache.pdfbox.examples.signature.ShowSignature
[ERROR] -> [Help 1]
[ERROR] 
[ERROR] To see the full stack trace of the errors, re-run Maven with the -e switch.
[ERROR] Re-run Maven using the -X switch to enable full debug logging.
[ERROR] 
[ERROR] For more information about the errors and possible solutions, please read the following
articles:
[ERROR] [Help 1] http://cwiki.apache.org/confluence/display/MAVEN/MojoFailureException
[ERROR] 
[ERROR] After correcting the problems, you can resume the build with the command
[ERROR]   mvn <goals> -rf :pdfbox-examples


---------------------------------------------------------------------
To unsubscribe, e-mail: dev-unsubscribe@pdfbox.apache.org
For additional commands, e-mail: dev-help@pdfbox.apache.org


Mime
View raw message