pdfbox-dev mailing list archives

Site index · List index
Message view « Date » · « Thread »
Top « Date » · « Thread »
From Apache Jenkins Server <jenk...@builds.apache.org>
Subject Build failed in Jenkins: PDFBox-2.0.x #1166
Date Wed, 03 Oct 2018 17:04:12 GMT
See <https://builds.apache.org/job/PDFBox-2.0.x/1166/display/redirect>

------------------------------------------
[...truncated 8.46 KB...]
		at hudson.scm.SubversionSCM.checkout(SubversionSCM.java:937)
		at hudson.scm.SubversionSCM.checkout(SubversionSCM.java:864)
		at hudson.scm.SCM.checkout(SCM.java:504)
		at hudson.model.AbstractProject.checkout(AbstractProject.java:1208)
		at hudson.model.AbstractBuild$AbstractBuildExecution.defaultCheckout(AbstractBuild.java:574)
		at jenkins.scm.SCMCheckoutStrategy.checkout(SCMCheckoutStrategy.java:86)
		at hudson.model.AbstractBuild$AbstractBuildExecution.run(AbstractBuild.java:499)
		at hudson.model.Run.execute(Run.java:1794)
		at hudson.maven.MavenModuleSetBuild.run(MavenModuleSetBuild.java:543)
		at hudson.model.ResourceController.execute(ResourceController.java:97)
		at hudson.model.Executor.run(Executor.java:429)
Caused: java.io.IOException
	at hudson.scm.subversion.UpdateUpdater$TaskImpl.perform(UpdateUpdater.java:216)
	at hudson.scm.subversion.WorkspaceUpdater$UpdateTask.delegateTo(WorkspaceUpdater.java:168)
	at hudson.scm.SubversionSCM$CheckOutTask.perform(SubversionSCM.java:1041)
	at hudson.scm.SubversionSCM$CheckOutTask.invoke(SubversionSCM.java:1017)
	at hudson.scm.SubversionSCM$CheckOutTask.invoke(SubversionSCM.java:990)
	at hudson.FilePath$FileCallableWrapper.call(FilePath.java:2918)
	at hudson.remoting.UserRequest.perform(UserRequest.java:212)
	at hudson.remoting.UserRequest.perform(UserRequest.java:54)
	at hudson.remoting.Request$2.run(Request.java:369)
	at hudson.remoting.InterceptingExecutorService$1.call(InterceptingExecutorService.java:72)
	at java.util.concurrent.FutureTask.run(FutureTask.java:266)
	at java.util.concurrent.ThreadPoolExecutor.runWorker(ThreadPoolExecutor.java:1142)
	at java.util.concurrent.ThreadPoolExecutor$Worker.run(ThreadPoolExecutor.java:617)
	at java.lang.Thread.run(Thread.java:748)
Caused: java.io.IOException: remote file operation failed: <https://builds.apache.org/job/PDFBox-2.0.x/ws/>
at hudson.remoting.Channel@2e369a8e:H29
	at hudson.FilePath.act(FilePath.java:1043)
	at hudson.FilePath.act(FilePath.java:1025)
	at hudson.scm.SubversionSCM.checkout(SubversionSCM.java:937)
	at hudson.scm.SubversionSCM.checkout(SubversionSCM.java:864)
	at hudson.scm.SCM.checkout(SCM.java:504)
	at hudson.model.AbstractProject.checkout(AbstractProject.java:1208)
	at hudson.model.AbstractBuild$AbstractBuildExecution.defaultCheckout(AbstractBuild.java:574)
	at jenkins.scm.SCMCheckoutStrategy.checkout(SCMCheckoutStrategy.java:86)
	at hudson.model.AbstractBuild$AbstractBuildExecution.run(AbstractBuild.java:499)
	at hudson.model.Run.execute(Run.java:1794)
	at hudson.maven.MavenModuleSetBuild.run(MavenModuleSetBuild.java:543)
	at hudson.model.ResourceController.execute(ResourceController.java:97)
	at hudson.model.Executor.run(Executor.java:429)
Retrying after 10 seconds
Cleaning up <https://builds.apache.org/job/PDFBox-2.0.x/ws/2.0>
ERROR: Failed to update http://svn.apache.org/repos/asf/pdfbox/branches/2.0
org.tmatesoft.svn.core.SVNException: svn: E155032: The pristine text with checksum '$sha1$0d8a658d1ecd3fa00dd8f46d24a9d2fdef18f3e4'
was found in the DB but not on disk
	at org.tmatesoft.svn.core.internal.wc.SVNErrorManager.error(SVNErrorManager.java:70)
	at org.tmatesoft.svn.core.internal.wc.SVNErrorManager.error(SVNErrorManager.java:57)
	at org.tmatesoft.svn.core.internal.wc17.db.SvnWcDbPristines.checkPristine(SvnWcDbPristines.java:159)
	at org.tmatesoft.svn.core.internal.wc17.db.SvnWcDbPristines.getPristinePath(SvnWcDbPristines.java:184)
	at org.tmatesoft.svn.core.internal.wc17.db.SVNWCDb.getPristinePath(SVNWCDb.java:1724)
	at org.tmatesoft.svn.core.internal.wc17.SVNWCContext.isTextModified(SVNWCContext.java:754)
	at org.tmatesoft.svn.core.internal.wc17.SVNStatusEditor17.assembleStatus(SVNStatusEditor17.java:356)
	at org.tmatesoft.svn.core.internal.wc17.SVNStatusEditor17.sendStatusStructure(SVNStatusEditor17.java:216)
	at org.tmatesoft.svn.core.internal.wc17.SVNStatusEditor17.getDirStatus(SVNStatusEditor17.java:742)
	at org.tmatesoft.svn.core.internal.wc17.SVNStatusEditor17.walkStatus(SVNStatusEditor17.java:665)
	at org.tmatesoft.svn.core.internal.wc2.ng.SvnNgGetStatus.run(SvnNgGetStatus.java:132)
	at org.tmatesoft.svn.core.internal.wc2.ng.SvnNgGetStatus.run(SvnNgGetStatus.java:27)
	at org.tmatesoft.svn.core.internal.wc2.ng.SvnNgOperationRunner.run(SvnNgOperationRunner.java:20)
	at org.tmatesoft.svn.core.internal.wc2.SvnOperationRunner.run(SvnOperationRunner.java:21)
	at org.tmatesoft.svn.core.wc2.SvnOperationFactory.run(SvnOperationFactory.java:1239)
	at org.tmatesoft.svn.core.wc2.SvnOperation.run(SvnOperation.java:294)
	at org.tmatesoft.svn.core.wc.SVNStatusClient.doStatus(SVNStatusClient.java:363)
	at hudson.scm.subversion.UpdateWithCleanUpdater$TaskImpl.preUpdate(UpdateWithCleanUpdater.java:67)
	at hudson.scm.subversion.UpdateUpdater$TaskImpl.perform(UpdateUpdater.java:154)
	at hudson.scm.subversion.WorkspaceUpdater$UpdateTask.delegateTo(WorkspaceUpdater.java:168)
	at hudson.scm.SubversionSCM$CheckOutTask.perform(SubversionSCM.java:1041)
	at hudson.scm.SubversionSCM$CheckOutTask.invoke(SubversionSCM.java:1017)
	at hudson.scm.SubversionSCM$CheckOutTask.invoke(SubversionSCM.java:990)
	at hudson.FilePath$FileCallableWrapper.call(FilePath.java:2918)
	at hudson.remoting.UserRequest.perform(UserRequest.java:212)
	at hudson.remoting.UserRequest.perform(UserRequest.java:54)
	at hudson.remoting.Request$2.run(Request.java:369)
	at hudson.remoting.InterceptingExecutorService$1.call(InterceptingExecutorService.java:72)
	at java.util.concurrent.FutureTask.run(FutureTask.java:266)
	at java.util.concurrent.ThreadPoolExecutor.runWorker(ThreadPoolExecutor.java:1142)
	at java.util.concurrent.ThreadPoolExecutor$Worker.run(ThreadPoolExecutor.java:617)
	at java.lang.Thread.run(Thread.java:748)
ERROR: Subversion update failed
hudson.remoting.ProxyException: org.tmatesoft.svn.core.SVNException: svn: E155032: The pristine
text with checksum '$sha1$0d8a658d1ecd3fa00dd8f46d24a9d2fdef18f3e4' was found in the DB but
not on disk
	at org.tmatesoft.svn.core.internal.wc.SVNErrorManager.error(SVNErrorManager.java:70)
	at org.tmatesoft.svn.core.internal.wc.SVNErrorManager.error(SVNErrorManager.java:57)
	at org.tmatesoft.svn.core.internal.wc17.db.SvnWcDbPristines.checkPristine(SvnWcDbPristines.java:159)
	at org.tmatesoft.svn.core.internal.wc17.db.SvnWcDbPristines.getPristinePath(SvnWcDbPristines.java:184)
	at org.tmatesoft.svn.core.internal.wc17.db.SVNWCDb.getPristinePath(SVNWCDb.java:1724)
	at org.tmatesoft.svn.core.internal.wc17.SVNWCContext.isTextModified(SVNWCContext.java:754)
	at org.tmatesoft.svn.core.internal.wc17.SVNStatusEditor17.assembleStatus(SVNStatusEditor17.java:356)
	at org.tmatesoft.svn.core.internal.wc17.SVNStatusEditor17.sendStatusStructure(SVNStatusEditor17.java:216)
	at org.tmatesoft.svn.core.internal.wc17.SVNStatusEditor17.getDirStatus(SVNStatusEditor17.java:742)
	at org.tmatesoft.svn.core.internal.wc17.SVNStatusEditor17.walkStatus(SVNStatusEditor17.java:665)
	at org.tmatesoft.svn.core.internal.wc2.ng.SvnNgGetStatus.run(SvnNgGetStatus.java:132)
	at org.tmatesoft.svn.core.internal.wc2.ng.SvnNgGetStatus.run(SvnNgGetStatus.java:27)
	at org.tmatesoft.svn.core.internal.wc2.ng.SvnNgOperationRunner.run(SvnNgOperationRunner.java:20)
	at org.tmatesoft.svn.core.internal.wc2.SvnOperationRunner.run(SvnOperationRunner.java:21)
	at org.tmatesoft.svn.core.wc2.SvnOperationFactory.run(SvnOperationFactory.java:1239)
	at org.tmatesoft.svn.core.wc2.SvnOperation.run(SvnOperation.java:294)
	at org.tmatesoft.svn.core.wc.SVNStatusClient.doStatus(SVNStatusClient.java:363)
	at hudson.scm.subversion.UpdateWithCleanUpdater$TaskImpl.preUpdate(UpdateWithCleanUpdater.java:67)
	at hudson.scm.subversion.UpdateUpdater$TaskImpl.perform(UpdateUpdater.java:154)
Caused: hudson.remoting.ProxyException: hudson.scm.subversion.UpdaterException: failed to
perform svn update
Also:   hudson.remoting.Channel$CallSiteStackTrace: Remote call to H29
		at hudson.remoting.Channel.attachCallSiteStackTrace(Channel.java:1741)
		at hudson.remoting.UserRequest$ExceptionResponse.retrieve(UserRequest.java:357)
		at hudson.remoting.Channel.call(Channel.java:955)
		at hudson.FilePath.act(FilePath.java:1036)
		at hudson.FilePath.act(FilePath.java:1025)
		at hudson.scm.SubversionSCM.checkout(SubversionSCM.java:937)
		at hudson.scm.SubversionSCM.checkout(SubversionSCM.java:864)
		at hudson.scm.SCM.checkout(SCM.java:504)
		at hudson.model.AbstractProject.checkout(AbstractProject.java:1208)
		at hudson.model.AbstractBuild$AbstractBuildExecution.defaultCheckout(AbstractBuild.java:574)
		at jenkins.scm.SCMCheckoutStrategy.checkout(SCMCheckoutStrategy.java:86)
		at hudson.model.AbstractBuild$AbstractBuildExecution.run(AbstractBuild.java:499)
		at hudson.model.Run.execute(Run.java:1794)
		at hudson.maven.MavenModuleSetBuild.run(MavenModuleSetBuild.java:543)
		at hudson.model.ResourceController.execute(ResourceController.java:97)
		at hudson.model.Executor.run(Executor.java:429)
Caused: hudson.remoting.ProxyException: java.io.IOException
	at hudson.scm.subversion.UpdateUpdater$TaskImpl.perform(UpdateUpdater.java:216)
	at hudson.scm.subversion.WorkspaceUpdater$UpdateTask.delegateTo(WorkspaceUpdater.java:168)
	at hudson.scm.SubversionSCM$CheckOutTask.perform(SubversionSCM.java:1041)
	at hudson.scm.SubversionSCM$CheckOutTask.invoke(SubversionSCM.java:1017)
	at hudson.scm.SubversionSCM$CheckOutTask.invoke(SubversionSCM.java:990)
	at hudson.FilePath$FileCallableWrapper.call(FilePath.java:2918)
	at hudson.remoting.UserRequest.perform(UserRequest.java:212)
	at hudson.remoting.UserRequest.perform(UserRequest.java:54)
	at hudson.remoting.Request$2.run(Request.java:369)
	at hudson.remoting.InterceptingExecutorService$1.call(InterceptingExecutorService.java:72)
	at java.util.concurrent.FutureTask.run(FutureTask.java:266)
	at java.util.concurrent.ThreadPoolExecutor.runWorker(ThreadPoolExecutor.java:1142)
	at java.util.concurrent.ThreadPoolExecutor$Worker.run(ThreadPoolExecutor.java:617)
	at java.lang.Thread.run(Thread.java:748)
Caused: java.io.IOException: remote file operation failed: <https://builds.apache.org/job/PDFBox-2.0.x/ws/>
at hudson.remoting.Channel@2e369a8e:H29
	at hudson.FilePath.act(FilePath.java:1043)
	at hudson.FilePath.act(FilePath.java:1025)
	at hudson.scm.SubversionSCM.checkout(SubversionSCM.java:937)
	at hudson.scm.SubversionSCM.checkout(SubversionSCM.java:864)
	at hudson.scm.SCM.checkout(SCM.java:504)
	at hudson.model.AbstractProject.checkout(AbstractProject.java:1208)
	at hudson.model.AbstractBuild$AbstractBuildExecution.defaultCheckout(AbstractBuild.java:574)
	at jenkins.scm.SCMCheckoutStrategy.checkout(SCMCheckoutStrategy.java:86)
	at hudson.model.AbstractBuild$AbstractBuildExecution.run(AbstractBuild.java:499)
	at hudson.model.Run.execute(Run.java:1794)
	at hudson.maven.MavenModuleSetBuild.run(MavenModuleSetBuild.java:543)
	at hudson.model.ResourceController.execute(ResourceController.java:97)
	at hudson.model.Executor.run(Executor.java:429)
Retrying after 10 seconds
Cleaning up <https://builds.apache.org/job/PDFBox-2.0.x/ws/2.0>
ERROR: Failed to update http://svn.apache.org/repos/asf/pdfbox/branches/2.0
org.tmatesoft.svn.core.SVNException: svn: E155032: The pristine text with checksum '$sha1$0d8a658d1ecd3fa00dd8f46d24a9d2fdef18f3e4'
was found in the DB but not on disk
	at org.tmatesoft.svn.core.internal.wc.SVNErrorManager.error(SVNErrorManager.java:70)
	at org.tmatesoft.svn.core.internal.wc.SVNErrorManager.error(SVNErrorManager.java:57)
	at org.tmatesoft.svn.core.internal.wc17.db.SvnWcDbPristines.checkPristine(SvnWcDbPristines.java:159)
	at org.tmatesoft.svn.core.internal.wc17.db.SvnWcDbPristines.getPristinePath(SvnWcDbPristines.java:184)
	at org.tmatesoft.svn.core.internal.wc17.db.SVNWCDb.getPristinePath(SVNWCDb.java:1724)
	at org.tmatesoft.svn.core.internal.wc17.SVNWCContext.isTextModified(SVNWCContext.java:754)
	at org.tmatesoft.svn.core.internal.wc17.SVNStatusEditor17.assembleStatus(SVNStatusEditor17.java:356)
	at org.tmatesoft.svn.core.internal.wc17.SVNStatusEditor17.sendStatusStructure(SVNStatusEditor17.java:216)
	at org.tmatesoft.svn.core.internal.wc17.SVNStatusEditor17.getDirStatus(SVNStatusEditor17.java:742)
	at org.tmatesoft.svn.core.internal.wc17.SVNStatusEditor17.walkStatus(SVNStatusEditor17.java:665)
	at org.tmatesoft.svn.core.internal.wc2.ng.SvnNgGetStatus.run(SvnNgGetStatus.java:132)
	at org.tmatesoft.svn.core.internal.wc2.ng.SvnNgGetStatus.run(SvnNgGetStatus.java:27)
	at org.tmatesoft.svn.core.internal.wc2.ng.SvnNgOperationRunner.run(SvnNgOperationRunner.java:20)
	at org.tmatesoft.svn.core.internal.wc2.SvnOperationRunner.run(SvnOperationRunner.java:21)
	at org.tmatesoft.svn.core.wc2.SvnOperationFactory.run(SvnOperationFactory.java:1239)
	at org.tmatesoft.svn.core.wc2.SvnOperation.run(SvnOperation.java:294)
	at org.tmatesoft.svn.core.wc.SVNStatusClient.doStatus(SVNStatusClient.java:363)
	at hudson.scm.subversion.UpdateWithCleanUpdater$TaskImpl.preUpdate(UpdateWithCleanUpdater.java:67)
	at hudson.scm.subversion.UpdateUpdater$TaskImpl.perform(UpdateUpdater.java:154)
	at hudson.scm.subversion.WorkspaceUpdater$UpdateTask.delegateTo(WorkspaceUpdater.java:168)
	at hudson.scm.SubversionSCM$CheckOutTask.perform(SubversionSCM.java:1041)
	at hudson.scm.SubversionSCM$CheckOutTask.invoke(SubversionSCM.java:1017)
	at hudson.scm.SubversionSCM$CheckOutTask.invoke(SubversionSCM.java:990)
	at hudson.FilePath$FileCallableWrapper.call(FilePath.java:2918)
	at hudson.remoting.UserRequest.perform(UserRequest.java:212)
	at hudson.remoting.UserRequest.perform(UserRequest.java:54)
	at hudson.remoting.Request$2.run(Request.java:369)
	at hudson.remoting.InterceptingExecutorService$1.call(InterceptingExecutorService.java:72)
	at java.util.concurrent.FutureTask.run(FutureTask.java:266)
	at java.util.concurrent.ThreadPoolExecutor.runWorker(ThreadPoolExecutor.java:1142)
	at java.util.concurrent.ThreadPoolExecutor$Worker.run(ThreadPoolExecutor.java:617)
	at java.lang.Thread.run(Thread.java:748)
ERROR: Subversion update failed
hudson.remoting.ProxyException: org.tmatesoft.svn.core.SVNException: svn: E155032: The pristine
text with checksum '$sha1$0d8a658d1ecd3fa00dd8f46d24a9d2fdef18f3e4' was found in the DB but
not on disk
	at org.tmatesoft.svn.core.internal.wc.SVNErrorManager.error(SVNErrorManager.java:70)
	at org.tmatesoft.svn.core.internal.wc.SVNErrorManager.error(SVNErrorManager.java:57)
	at org.tmatesoft.svn.core.internal.wc17.db.SvnWcDbPristines.checkPristine(SvnWcDbPristines.java:159)
	at org.tmatesoft.svn.core.internal.wc17.db.SvnWcDbPristines.getPristinePath(SvnWcDbPristines.java:184)
	at org.tmatesoft.svn.core.internal.wc17.db.SVNWCDb.getPristinePath(SVNWCDb.java:1724)
	at org.tmatesoft.svn.core.internal.wc17.SVNWCContext.isTextModified(SVNWCContext.java:754)
	at org.tmatesoft.svn.core.internal.wc17.SVNStatusEditor17.assembleStatus(SVNStatusEditor17.java:356)
	at org.tmatesoft.svn.core.internal.wc17.SVNStatusEditor17.sendStatusStructure(SVNStatusEditor17.java:216)
	at org.tmatesoft.svn.core.internal.wc17.SVNStatusEditor17.getDirStatus(SVNStatusEditor17.java:742)
	at org.tmatesoft.svn.core.internal.wc17.SVNStatusEditor17.walkStatus(SVNStatusEditor17.java:665)
	at org.tmatesoft.svn.core.internal.wc2.ng.SvnNgGetStatus.run(SvnNgGetStatus.java:132)
	at org.tmatesoft.svn.core.internal.wc2.ng.SvnNgGetStatus.run(SvnNgGetStatus.java:27)
	at org.tmatesoft.svn.core.internal.wc2.ng.SvnNgOperationRunner.run(SvnNgOperationRunner.java:20)
	at org.tmatesoft.svn.core.internal.wc2.SvnOperationRunner.run(SvnOperationRunner.java:21)
	at org.tmatesoft.svn.core.wc2.SvnOperationFactory.run(SvnOperationFactory.java:1239)
	at org.tmatesoft.svn.core.wc2.SvnOperation.run(SvnOperation.java:294)
	at org.tmatesoft.svn.core.wc.SVNStatusClient.doStatus(SVNStatusClient.java:363)
	at hudson.scm.subversion.UpdateWithCleanUpdater$TaskImpl.preUpdate(UpdateWithCleanUpdater.java:67)
	at hudson.scm.subversion.UpdateUpdater$TaskImpl.perform(UpdateUpdater.java:154)
Caused: hudson.remoting.ProxyException: hudson.scm.subversion.UpdaterException: failed to
perform svn update
Also:   hudson.remoting.Channel$CallSiteStackTrace: Remote call to H29
		at hudson.remoting.Channel.attachCallSiteStackTrace(Channel.java:1741)
		at hudson.remoting.UserRequest$ExceptionResponse.retrieve(UserRequest.java:357)
		at hudson.remoting.Channel.call(Channel.java:955)
		at hudson.FilePath.act(FilePath.java:1036)
		at hudson.FilePath.act(FilePath.java:1025)
		at hudson.scm.SubversionSCM.checkout(SubversionSCM.java:937)
		at hudson.scm.SubversionSCM.checkout(SubversionSCM.java:864)
		at hudson.scm.SCM.checkout(SCM.java:504)
		at hudson.model.AbstractProject.checkout(AbstractProject.java:1208)
		at hudson.model.AbstractBuild$AbstractBuildExecution.defaultCheckout(AbstractBuild.java:574)
		at jenkins.scm.SCMCheckoutStrategy.checkout(SCMCheckoutStrategy.java:86)
		at hudson.model.AbstractBuild$AbstractBuildExecution.run(AbstractBuild.java:499)
		at hudson.model.Run.execute(Run.java:1794)
		at hudson.maven.MavenModuleSetBuild.run(MavenModuleSetBuild.java:543)
		at hudson.model.ResourceController.execute(ResourceController.java:97)
		at hudson.model.Executor.run(Executor.java:429)
Caused: hudson.remoting.ProxyException: java.io.IOException
	at hudson.scm.subversion.UpdateUpdater$TaskImpl.perform(UpdateUpdater.java:216)
	at hudson.scm.subversion.WorkspaceUpdater$UpdateTask.delegateTo(WorkspaceUpdater.java:168)
	at hudson.scm.SubversionSCM$CheckOutTask.perform(SubversionSCM.java:1041)
	at hudson.scm.SubversionSCM$CheckOutTask.invoke(SubversionSCM.java:1017)
	at hudson.scm.SubversionSCM$CheckOutTask.invoke(SubversionSCM.java:990)
	at hudson.FilePath$FileCallableWrapper.call(FilePath.java:2918)
	at hudson.remoting.UserRequest.perform(UserRequest.java:212)
	at hudson.remoting.UserRequest.perform(UserRequest.java:54)
	at hudson.remoting.Request$2.run(Request.java:369)
	at hudson.remoting.InterceptingExecutorService$1.call(InterceptingExecutorService.java:72)
	at java.util.concurrent.FutureTask.run(FutureTask.java:266)
	at java.util.concurrent.ThreadPoolExecutor.runWorker(ThreadPoolExecutor.java:1142)
	at java.util.concurrent.ThreadPoolExecutor$Worker.run(ThreadPoolExecutor.java:617)
	at java.lang.Thread.run(Thread.java:748)
Caused: java.io.IOException: remote file operation failed: <https://builds.apache.org/job/PDFBox-2.0.x/ws/>
at hudson.remoting.Channel@2e369a8e:H29
	at hudson.FilePath.act(FilePath.java:1043)
	at hudson.FilePath.act(FilePath.java:1025)
	at hudson.scm.SubversionSCM.checkout(SubversionSCM.java:937)
	at hudson.scm.SubversionSCM.checkout(SubversionSCM.java:864)
	at hudson.scm.SCM.checkout(SCM.java:504)
	at hudson.model.AbstractProject.checkout(AbstractProject.java:1208)
	at hudson.model.AbstractBuild$AbstractBuildExecution.defaultCheckout(AbstractBuild.java:574)
	at jenkins.scm.SCMCheckoutStrategy.checkout(SCMCheckoutStrategy.java:86)
	at hudson.model.AbstractBuild$AbstractBuildExecution.run(AbstractBuild.java:499)
	at hudson.model.Run.execute(Run.java:1794)
	at hudson.maven.MavenModuleSetBuild.run(MavenModuleSetBuild.java:543)
	at hudson.model.ResourceController.execute(ResourceController.java:97)
	at hudson.model.Executor.run(Executor.java:429)
Archiving artifacts

---------------------------------------------------------------------
To unsubscribe, e-mail: dev-unsubscribe@pdfbox.apache.org
For additional commands, e-mail: dev-help@pdfbox.apache.org


Mime
View raw message