pdfbox-dev mailing list archives

Site index · List index
Message view « Date » · « Thread »
Top « Date » · « Thread »
From Apache Jenkins Server <jenk...@builds.apache.org>
Subject Build failed in Jenkins: PDFBox-2.0.x #1176
Date Tue, 09 Oct 2018 18:32:46 GMT
See <https://builds.apache.org/job/PDFBox-2.0.x/1176/display/redirect?page=changes>

Changes:

[tilman] PDFBOX-4335: add @Override, close overlay object in utility (SonarQube complaints)

[tilman] PDFBOX-4333: Reduce the total number of break and continue statements in this loop
for SonarQube

------------------------------------------
Started by an SCM change
[EnvInject] - Loading node environment variables.
Building remotely on ubuntu-1 (ubuntu trusty) in workspace <https://builds.apache.org/job/PDFBox-2.0.x/ws/>
Cleaning up <https://builds.apache.org/job/PDFBox-2.0.x/ws/2.0>
Deleting <https://builds.apache.org/job/PDFBox-2.0.x/ws/2.0/parent/target>
Updating http://svn.apache.org/repos/asf/pdfbox/branches/2.0 at revision '2018-10-09T18:29:12.146
+0000'
U         pdfbox/src/main/java/org/apache/pdfbox/multipdf/PDFMergerUtility.java
U         pdfbox/src/main/java/org/apache/pdfbox/multipdf/Overlay.java
U         pdfbox/src/main/java/org/apache/pdfbox/pdfparser/COSParser.java
U         pdfbox/src/test/java/org/apache/pdfbox/pdmodel/graphics/image/ValidateXImage.java
U         tools/src/main/java/org/apache/pdfbox/tools/OverlayPDF.java
At revision 1843320

Parsing POMs
Established TCP socket on 41093
maven35-agent.jar already up to date
maven35-interceptor.jar already up to date
maven3-interceptor-commons.jar already up to date
[2.0] $ /home/jenkins/tools/java/latest1.8/bin/java -Xmx1g -cp /home/jenkins/jenkins-slave/maven35-agent.jar:/home/jenkins/tools/maven/apache-maven-3.5.0/boot/plexus-classworlds-2.5.2.jar:/home/jenkins/tools/maven/apache-maven-3.5.0/conf/logging
jenkins.maven3.agent.Maven35Main /home/jenkins/tools/maven/apache-maven-3.5.0 /home/jenkins/jenkins-slave/slave.jar
/home/jenkins/jenkins-slave/maven35-interceptor.jar /home/jenkins/jenkins-slave/maven3-interceptor-commons.jar
41093
<===[JENKINS REMOTING CAPACITY]===>   channel started
Executing Maven:  -B -f <https://builds.apache.org/job/PDFBox-2.0.x/ws/2.0/pom.xml>
-Dmaven.repo.local=<https://builds.apache.org/job/PDFBox-2.0.x/ws/.repository> clean
deploy -Ppedantic -Dmaven.source.skip=true
[INFO] Scanning for projects...
[INFO] ------------------------------------------------------------------------
[INFO] Reactor Build Order:
[INFO] 
[INFO] PDFBox parent
[INFO] Apache FontBox
[INFO] Apache XmpBox
[INFO] Apache PDFBox
[INFO] Apache Preflight
[INFO] Apache Preflight application
[INFO] Apache PDFBox Debugger
[INFO] Apache PDFBox tools
[INFO] Apache PDFBox application
[INFO] Apache PDFBox Debugger application
[INFO] Apache PDFBox examples
[INFO] PDFBox reactor
[INFO] 
[INFO] ------------------------------------------------------------------------
[INFO] Building PDFBox parent 2.0.13-SNAPSHOT
[INFO] ------------------------------------------------------------------------
[INFO] 
[INFO] --- maven-clean-plugin:3.0.0:clean (default-clean) @ pdfbox-parent ---
[WARNING] Attempt to (de-)serialize anonymous class hudson.plugins.analysis.core.HealthAwareReporter$2;
see: https://jenkins.io/redirect/serialization-of-anonymous-classes/
[WARNING] Attempt to (de-)serialize anonymous class hudson.plugins.analysis.core.HealthAwareReporter$3;
see: https://jenkins.io/redirect/serialization-of-anonymous-classes/
[TASKS] Scanning folder '<https://builds.apache.org/job/PDFBox-2.0.x/ws/2.0/parent'>
for files matching the pattern '**/*.java' - excludes: 
[TASKS] Found 0 files to scan for tasks
Found 0 open tasks.
[WARNING] Attempt to (de-)serialize anonymous class hudson.plugins.analysis.core.HealthAwareReporter$1;
see: https://jenkins.io/redirect/serialization-of-anonymous-classes/
[TASKS] Computing warning deltas based on reference build #1175
[INFO] 
[INFO] --- maven-enforcer-plugin:1.4.1:enforce (enforce-maven-version) @ pdfbox-parent ---
[INFO] 
[INFO] --- maven-enforcer-plugin:1.4.1:enforce (default) @ pdfbox-parent ---
[INFO] 
[INFO] --- maven-remote-resources-plugin:1.5:process (process-resource-bundles) @ pdfbox-parent
---
[INFO] 
[INFO] --- animal-sniffer-maven-plugin:1.17:check (check-java-version) @ pdfbox-parent ---
[INFO] Checking unresolved references to org.codehaus.mojo.signature:java16:1.0
[INFO] 
[INFO] --- maven-site-plugin:3.7:attach-descriptor (attach-descriptor) @ pdfbox-parent ---
[INFO] No site descriptor found: nothing to attach.
[INFO] 
[INFO] >>> maven-source-plugin:3.0.1:jar (attach-sources) > generate-sources @
pdfbox-parent >>>
[INFO] 
[INFO] --- maven-enforcer-plugin:1.4.1:enforce (enforce-maven-version) @ pdfbox-parent ---
[INFO] 
[INFO] --- maven-enforcer-plugin:1.4.1:enforce (default) @ pdfbox-parent ---
[WARNING] Failed to getClass for org.apache.maven.plugins.source.SourceJarMojo
[INFO] 
[INFO] <<< maven-source-plugin:3.0.1:jar (attach-sources) < generate-sources @
pdfbox-parent <<<
[INFO] 
[INFO] 
[INFO] --- maven-source-plugin:3.0.1:jar (attach-sources) @ pdfbox-parent ---
[INFO] Skipping source per configuration.
[INFO] 
[INFO] --- apache-rat-plugin:0.12:check (default) @ pdfbox-parent ---
[INFO] Enabled default license matchers.
[INFO] Will parse SCM ignores for exclusions...
[INFO] Finished adding exclusions from SCM ignore files.
[INFO] 61 implicit excludes (use -debug for more details).
[INFO] Exclude: release.properties
[INFO] 1 resources included (use -debug for more details)
[INFO] Rat check: Summary over all files. Unapproved: 0, unknown: 0, generated: 0, approved:
1 licenses.
[INFO] 
[INFO] --- dependency-check-maven:3.3.2:check (default) @ pdfbox-parent ---
[INFO] Central analyzer disabled
[INFO] Checking for updates
[INFO] starting getUpdatesNeeded() ...
[INFO] Download Started for NVD CVE - Modified
[INFO] Download Complete for NVD CVE - Modified  (14505 ms)
[INFO] Processing Started for NVD CVE - Modified
[INFO] Processing Complete for NVD CVE - Modified  (12467 ms)
[INFO] Begin database maintenance.
[INFO] End database maintenance.
[INFO] Check for updates complete (59209 ms)
[INFO] Analysis Started
[INFO] Finished File Name Analyzer (0 seconds)
[INFO] Finished Dependency Merging Analyzer (0 seconds)
[INFO] Finished Version Filter Analyzer (0 seconds)
[INFO] Finished Hint Analyzer (0 seconds)
[INFO] Created CPE Index (1 seconds)
[INFO] Skipping CPE Analysis for npm
[INFO] Finished CPE Analyzer (1 seconds)
[INFO] Finished False Positive Analyzer (0 seconds)
[INFO] Finished NVD CVE Analyzer (0 seconds)
[INFO] Finished Vulnerability Suppression Analyzer (0 seconds)
[INFO] Finished Dependency Bundling Analyzer (0 seconds)
[INFO] Analysis Complete (2 seconds)
[INFO] 
[INFO] --- maven-install-plugin:2.5.2:install (default-install) @ pdfbox-parent ---
[INFO] Installing <https://builds.apache.org/job/PDFBox-2.0.x/ws/2.0/parent/pom.xml>
to <https://builds.apache.org/job/PDFBox-2.0.x/ws/.repository/org/apache/pdfbox/pdfbox-parent/2.0.13-SNAPSHOT/pdfbox-parent-2.0.13-SNAPSHOT.pom>
[INFO] 
[INFO] --- maven-deploy-plugin:2.8.2:deploy (default-deploy) @ pdfbox-parent ---
[INFO] Downloading: https://repository.apache.org/content/repositories/snapshots/org/apache/pdfbox/pdfbox-parent/2.0.13-SNAPSHOT/maven-metadata.xml
[INFO] Downloaded: https://repository.apache.org/content/repositories/snapshots/org/apache/pdfbox/pdfbox-parent/2.0.13-SNAPSHOT/maven-metadata.xml
(609 B at 805 B/s)
[INFO] Downloading: https://repository.apache.org/content/repositories/snapshots/org/apache/pdfbox/pdfbox-parent/2.0.13-SNAPSHOT/maven-metadata.xml
[INFO] Downloaded: https://repository.apache.org/content/repositories/snapshots/org/apache/pdfbox/pdfbox-parent/2.0.13-SNAPSHOT/maven-metadata.xml
(609 B at 1.1 kB/s)
[INFO] Uploading: https://repository.apache.org/content/repositories/snapshots/org/apache/pdfbox/pdfbox-parent/2.0.13-SNAPSHOT/pdfbox-parent-2.0.13-20181009.183202-8.pom
[WARNING] Attempt to (de-)serialize anonymous class hudson.maven.reporters.MavenArtifactArchiver$2;
see: https://jenkins.io/redirect/serialization-of-anonymous-classes/
[WARNING] Attempt to (de-)serialize anonymous class hudson.maven.reporters.MavenFingerprinter$1;
see: https://jenkins.io/redirect/serialization-of-anonymous-classes/
[INFO] ------------------------------------------------------------------------
[INFO] Reactor Summary:
[INFO] 
[INFO] PDFBox parent ...................................... FAILURE [02:15 min]
[INFO] Apache FontBox ..................................... SKIPPED
[INFO] Apache XmpBox ...................................... SKIPPED
[INFO] Apache PDFBox ...................................... SKIPPED
[INFO] Apache Preflight ................................... SKIPPED
[INFO] Apache Preflight application ....................... SKIPPED
[INFO] Apache PDFBox Debugger ............................. SKIPPED
[INFO] Apache PDFBox tools ................................ SKIPPED
[INFO] Apache PDFBox application .......................... SKIPPED
[INFO] Apache PDFBox Debugger application ................. SKIPPED
[INFO] Apache PDFBox examples ............................. SKIPPED
[INFO] PDFBox reactor ..................................... SKIPPED
[INFO] ------------------------------------------------------------------------
[INFO] BUILD FAILURE
[INFO] ------------------------------------------------------------------------
[INFO] Total time: 02:30 min
[INFO] Finished at: 2018-10-09T18:32:16Z
[INFO] Final Memory: 37M/452M
[INFO] ------------------------------------------------------------------------
[ERROR] Failed to execute goal org.apache.maven.plugins:maven-deploy-plugin:2.8.2:deploy (default-deploy)
on project pdfbox-parent: Failed to deploy artifacts: Could not transfer artifact org.apache.pdfbox:pdfbox-parent:pom:2.0.13-20181009.183202-8
from/to apache.snapshots.https (https://repository.apache.org/content/repositories/snapshots):
Failed to transfer file: https://repository.apache.org/content/repositories/snapshots/org/apache/pdfbox/pdfbox-parent/2.0.13-SNAPSHOT/pdfbox-parent-2.0.13-20181009.183202-8.pom.
Return code is: 401, ReasonPhrase: Unauthorized. -> [Help 1]
[ERROR] 
[ERROR] To see the full stack trace of the errors, re-run Maven with the -e switch.
[ERROR] Re-run Maven using the -X switch to enable full debug logging.
[ERROR] 
[ERROR] For more information about the errors and possible solutions, please read the following
articles:
[ERROR] [Help 1] http://cwiki.apache.org/confluence/display/MAVEN/MojoExecutionException
[JENKINS] Archiving <https://builds.apache.org/job/PDFBox-2.0.x/ws/2.0/xmpbox/pom.xml>
to org.apache.pdfbox/xmpbox/2.0.13-SNAPSHOT/xmpbox-2.0.13-SNAPSHOT.pom
[JENKINS] Archiving <https://builds.apache.org/job/PDFBox-2.0.x/ws/2.0/tools/pom.xml>
to org.apache.pdfbox/pdfbox-tools/2.0.13-SNAPSHOT/pdfbox-tools-2.0.13-SNAPSHOT.pom
[JENKINS] Archiving <https://builds.apache.org/job/PDFBox-2.0.x/ws/2.0/debugger/pom.xml>
to org.apache.pdfbox/pdfbox-debugger/2.0.13-SNAPSHOT/pdfbox-debugger-2.0.13-SNAPSHOT.pom
[JENKINS] Archiving <https://builds.apache.org/job/PDFBox-2.0.x/ws/2.0/preflight-app/pom.xml>
to org.apache.pdfbox/preflight-app/2.0.13-SNAPSHOT/preflight-app-2.0.13-SNAPSHOT.pom
[JENKINS] Archiving <https://builds.apache.org/job/PDFBox-2.0.x/ws/2.0/app/pom.xml>
to org.apache.pdfbox/pdfbox-app/2.0.13-SNAPSHOT/pdfbox-app-2.0.13-SNAPSHOT.pom
[JENKINS] Archiving <https://builds.apache.org/job/PDFBox-2.0.x/ws/2.0/examples/pom.xml>
to org.apache.pdfbox/pdfbox-examples/2.0.13-SNAPSHOT/pdfbox-examples-2.0.13-SNAPSHOT.pom
[JENKINS] Archiving <https://builds.apache.org/job/PDFBox-2.0.x/ws/2.0/preflight/pom.xml>
to org.apache.pdfbox/preflight/2.0.13-SNAPSHOT/preflight-2.0.13-SNAPSHOT.pom
[JENKINS] Archiving <https://builds.apache.org/job/PDFBox-2.0.x/ws/2.0/pom.xml> to org.apache.pdfbox/pdfbox-reactor/2.0.13-SNAPSHOT/pdfbox-reactor-2.0.13-SNAPSHOT.pom
[JENKINS] Archiving <https://builds.apache.org/job/PDFBox-2.0.x/ws/2.0/parent/pom.xml>
to org.apache.pdfbox/pdfbox-parent/2.0.13-SNAPSHOT/pdfbox-parent-2.0.13-SNAPSHOT.pom
[JENKINS] Archiving <https://builds.apache.org/job/PDFBox-2.0.x/ws/2.0/pdfbox/pom.xml>
to org.apache.pdfbox/pdfbox/2.0.13-SNAPSHOT/pdfbox-2.0.13-SNAPSHOT.pom
[JENKINS] Archiving <https://builds.apache.org/job/PDFBox-2.0.x/ws/2.0/debugger-app/pom.xml>
to org.apache.pdfbox/debugger-app/2.0.13-SNAPSHOT/debugger-app-2.0.13-SNAPSHOT.pom
[JENKINS] Archiving <https://builds.apache.org/job/PDFBox-2.0.x/ws/2.0/fontbox/pom.xml>
to org.apache.pdfbox/fontbox/2.0.13-SNAPSHOT/fontbox-2.0.13-SNAPSHOT.pom
Sending e-mails to: dev@pdfbox.apache.org
channel stopped
Archiving artifacts

---------------------------------------------------------------------
To unsubscribe, e-mail: dev-unsubscribe@pdfbox.apache.org
For additional commands, e-mail: dev-help@pdfbox.apache.org


Mime
View raw message