pdfbox-dev mailing list archives

Site index · List index
Message view « Date » · « Thread »
Top « Date » · « Thread »
From Apache Jenkins Server <jenk...@builds.apache.org>
Subject Build failed in Jenkins: PDFBox-2.0.x #1097
Date Sat, 28 Jul 2018 13:42:19 GMT
See <https://builds.apache.org/job/PDFBox-2.0.x/1097/display/redirect?page=changes>

Changes:

[tilman] PDFBOX-4281: small code cleanup

[tilman] PDFBOX-4281: remove Apache Wink dependency, add class from Apache Wink + dependencies

------------------------------------------
[...truncated 415.57 KB...]
[INFO] Downloading: https://repo.maven.apache.org/maven2/org/bouncycastle/bcprov-jdk15on/1.54/bcprov-jdk15on-1.54.jar
[INFO] Downloading: https://repo.maven.apache.org/maven2/com/googlecode/java-diff-utils/diffutils/1.3.0/diffutils-1.3.0.jar
[INFO] Downloading: https://repo.maven.apache.org/maven2/org/apache/pdfbox/jbig2-imageio/3.0.1/jbig2-imageio-3.0.1.jar
[INFO] Downloaded: https://repo.maven.apache.org/maven2/com/googlecode/java-diff-utils/diffutils/1.3.0/diffutils-1.3.0.jar
(34 kB at 1.6 MB/s)
[INFO] Downloading: https://repo.maven.apache.org/maven2/com/github/jai-imageio/jai-imageio-core/1.4.0/jai-imageio-core-1.4.0.jar
[INFO] Downloaded: https://repo.maven.apache.org/maven2/org/bouncycastle/bcmail-jdk15on/1.54/bcmail-jdk15on-1.54.jar
(102 kB at 3.9 MB/s)
[INFO] Downloading: https://repo.maven.apache.org/maven2/com/github/jai-imageio/jai-imageio-jpeg2000/1.3.0/jai-imageio-jpeg2000-1.3.0.jar
[INFO] Downloaded: https://repo.maven.apache.org/maven2/org/apache/pdfbox/jbig2-imageio/3.0.1/jbig2-imageio-3.0.1.jar
(152 kB at 5.4 MB/s)
[INFO] Downloaded: https://repo.maven.apache.org/maven2/org/bouncycastle/bcpkix-jdk15on/1.54/bcpkix-jdk15on-1.54.jar
(674 kB at 13 MB/s)
[INFO] Downloaded: https://repo.maven.apache.org/maven2/com/github/jai-imageio/jai-imageio-jpeg2000/1.3.0/jai-imageio-jpeg2000-1.3.0.jar
(461 kB at 7.4 MB/s)
[INFO] Downloaded: https://repo.maven.apache.org/maven2/com/github/jai-imageio/jai-imageio-core/1.4.0/jai-imageio-core-1.4.0.jar
(628 kB at 8.7 MB/s)
[INFO] Downloaded: https://repo.maven.apache.org/maven2/org/bouncycastle/bcprov-jdk15on/1.54/bcprov-jdk15on-1.54.jar
(3.3 MB at 15 MB/s)
[INFO] 
[INFO] --- maven-clean-plugin:3.0.0:clean (default-clean) @ pdfbox ---
[TASKS] Scanning folder '<https://builds.apache.org/job/PDFBox-2.0.x/ws/2.0/pdfbox'>
for files matching the pattern '**/*.java' - excludes: 
[TASKS] Found 661 files to scan for tasks
Found 261 open tasks.
[TASKS] Computing warning deltas based on reference build #1096
[INFO] 
[INFO] --- maven-enforcer-plugin:1.4.1:enforce (enforce-maven-version) @ pdfbox ---
[INFO] 
[INFO] --- maven-enforcer-plugin:1.4.1:enforce (default) @ pdfbox ---
[INFO] 
[INFO] --- maven-remote-resources-plugin:1.5:process (process-resource-bundles) @ pdfbox ---
[INFO] 
[INFO] --- maven-resources-plugin:3.0.2:resources (default-resources) @ pdfbox ---
[INFO] Using 'UTF-8' encoding to copy filtered resources.
[INFO] Copying 1 resource
[INFO] Copying 21 resources
[INFO] Copying 3 resources
[INFO] 
[INFO] --- maven-compiler-plugin:3.6.0:compile (default-compile) @ pdfbox ---
[INFO] Changes detected - recompiling the module!
[INFO] Compiling 563 source files to <https://builds.apache.org/job/PDFBox-2.0.x/ws/2.0/pdfbox/target/classes>
[WARNING] bootstrap class path not set in conjunction with -source 1.6
[WARNING] <https://builds.apache.org/job/PDFBox-2.0.x/ws/2.0/pdfbox/src/main/java/org/apache/pdfbox/pdmodel/font/PDFont.java>:[306,27]
getHeight(int) in org.apache.pdfbox.pdmodel.font.PDFontLike has been deprecated
[WARNING] <https://builds.apache.org/job/PDFBox-2.0.x/ws/2.0/pdfbox/src/main/java/org/apache/pdfbox/pdmodel/font/PDCIDFont.java>:[297,27]
getHeight(int) in org.apache.pdfbox.pdmodel.font.PDFontLike has been deprecated
[WARNING] <https://builds.apache.org/job/PDFBox-2.0.x/ws/2.0/pdfbox/src/main/java/org/apache/pdfbox/pdmodel/font/TrueTypeEmbedder.java>:[101,19]
getUnicodeCmap() in org.apache.fontbox.ttf.TrueTypeFont has been deprecated
[WARNING] <https://builds.apache.org/job/PDFBox-2.0.x/ws/2.0/pdfbox/src/main/java/org/apache/pdfbox/cos/UnmodifiableCOSDictionary.java>:[286,17]
mergeInto(org.apache.pdfbox.cos.COSDictionary) in org.apache.pdfbox.cos.COSDictionary has
been deprecated
[INFO] <https://builds.apache.org/job/PDFBox-2.0.x/ws/2.0/pdfbox/src/main/java/org/apache/pdfbox/pdmodel/common/PDStream.java>:
Some input files use unchecked or unsafe operations.
[INFO] <https://builds.apache.org/job/PDFBox-2.0.x/ws/2.0/pdfbox/src/main/java/org/apache/pdfbox/pdmodel/common/PDStream.java>:
Recompile with -Xlint:unchecked for details.
[INFO] 
[INFO] --- download-maven-plugin:1.3.0:wget (PDFBOX-3208) @ pdfbox ---
[INFO] 
[INFO] --- download-maven-plugin:1.3.0:wget (PDFBOX-3940) @ pdfbox ---
[INFO] 
[INFO] --- download-maven-plugin:1.3.0:wget (PDFBOX-3783) @ pdfbox ---
[INFO] 
[INFO] --- download-maven-plugin:1.3.0:wget (PDFBOX-3785) @ pdfbox ---
[INFO] 
[INFO] --- download-maven-plugin:1.3.0:wget (PDFBOX-3947) @ pdfbox ---
[INFO] 
[INFO] --- download-maven-plugin:1.3.0:wget (PDFBOX-3948) @ pdfbox ---
[INFO] 
[INFO] --- download-maven-plugin:1.3.0:wget (PDFBOX-3949) @ pdfbox ---
[INFO] 
[INFO] --- download-maven-plugin:1.3.0:wget (PDFBOX-3950) @ pdfbox ---
[INFO] 
[INFO] --- download-maven-plugin:1.3.0:wget (PDFBOX-3951) @ pdfbox ---
[INFO] 
[INFO] --- download-maven-plugin:1.3.0:wget (PDFBOX-3964) @ pdfbox ---
[INFO] 
[INFO] --- download-maven-plugin:1.3.0:wget (PDFBOX-3977) @ pdfbox ---
[INFO] 
[INFO] --- download-maven-plugin:1.3.0:wget (Genko) @ pdfbox ---
[INFO] 
[INFO] --- download-maven-plugin:1.3.0:wget (PDFBOX-3999) @ pdfbox ---
[INFO] 
[INFO] --- download-maven-plugin:1.3.0:wget (PDFBOX-4106) @ pdfbox ---
[INFO] 
[INFO] --- download-maven-plugin:1.3.0:wget (PDFBOX-4106b) @ pdfbox ---
[INFO] 
[INFO] --- download-maven-plugin:1.3.0:wget (PDFBOX-4115) @ pdfbox ---
[INFO] 
[INFO] --- download-maven-plugin:1.3.0:wget (PDFBOX-4197) @ pdfbox ---
[INFO] 
[INFO] --- download-maven-plugin:1.3.0:wget (PDFBOX-4184) @ pdfbox ---
[WARNING] Could not get content
org.apache.maven.wagon.TransferFailedException: www.crh.noaa.gov: Temporary failure in name
resolution
	at org.apache.maven.wagon.providers.http.AbstractHttpClientWagon.fillInputData(AbstractHttpClientWagon.java:1068)
	at org.apache.maven.wagon.providers.http.AbstractHttpClientWagon.fillInputData(AbstractHttpClientWagon.java:962)
	at org.apache.maven.wagon.StreamWagon.getInputStream(StreamWagon.java:126)
	at org.apache.maven.wagon.StreamWagon.getIfNewer(StreamWagon.java:88)
	at org.apache.maven.wagon.StreamWagon.get(StreamWagon.java:61)
	at com.googlecode.download.maven.plugin.internal.WGet.doGet(WGet.java:377)
	at com.googlecode.download.maven.plugin.internal.WGet.execute(WGet.java:282)
	at org.apache.maven.plugin.DefaultBuildPluginManager.executeMojo(DefaultBuildPluginManager.java:134)
	at org.apache.maven.lifecycle.internal.MojoExecutor.execute(MojoExecutor.java:208)
	at org.apache.maven.lifecycle.internal.MojoExecutor.execute(MojoExecutor.java:154)
	at org.apache.maven.lifecycle.internal.MojoExecutor.execute(MojoExecutor.java:146)
	at org.apache.maven.lifecycle.internal.LifecycleModuleBuilder.buildProject(LifecycleModuleBuilder.java:117)
	at org.apache.maven.lifecycle.internal.LifecycleModuleBuilder.buildProject(LifecycleModuleBuilder.java:81)
	at org.apache.maven.lifecycle.internal.builder.singlethreaded.SingleThreadedBuilder.build(SingleThreadedBuilder.java:51)
	at org.apache.maven.lifecycle.internal.LifecycleStarter.execute(LifecycleStarter.java:128)
	at org.apache.maven.DefaultMaven.doExecute(DefaultMaven.java:309)
	at org.apache.maven.DefaultMaven.doExecute(DefaultMaven.java:194)
	at org.apache.maven.DefaultMaven.execute(DefaultMaven.java:107)
	at org.jvnet.hudson.maven3.launcher.Maven35Launcher.main(Maven35Launcher.java:130)
	at sun.reflect.NativeMethodAccessorImpl.invoke0(Native Method)
	at sun.reflect.NativeMethodAccessorImpl.invoke(NativeMethodAccessorImpl.java:62)
	at sun.reflect.DelegatingMethodAccessorImpl.invoke(DelegatingMethodAccessorImpl.java:43)
	at java.lang.reflect.Method.invoke(Method.java:498)
	at org.codehaus.plexus.classworlds.launcher.Launcher.launchEnhanced(Launcher.java:289)
	at org.codehaus.plexus.classworlds.launcher.Launcher.launch(Launcher.java:229)
	at jenkins.maven3.agent.Maven35Main.launch(Maven35Main.java:176)
	at sun.reflect.NativeMethodAccessorImpl.invoke0(Native Method)
	at sun.reflect.NativeMethodAccessorImpl.invoke(NativeMethodAccessorImpl.java:62)
	at sun.reflect.DelegatingMethodAccessorImpl.invoke(DelegatingMethodAccessorImpl.java:43)
	at java.lang.reflect.Method.invoke(Method.java:498)
	at hudson.maven.Maven3Builder.call(Maven3Builder.java:139)
	at hudson.maven.Maven3Builder.call(Maven3Builder.java:70)
	at hudson.remoting.UserRequest.perform(UserRequest.java:212)
	at hudson.remoting.UserRequest.perform(UserRequest.java:54)
	at hudson.remoting.Request$2.run(Request.java:369)
	at hudson.remoting.InterceptingExecutorService$1.call(InterceptingExecutorService.java:72)
	at java.util.concurrent.FutureTask.run(FutureTask.java:266)
	at java.util.concurrent.ThreadPoolExecutor.runWorker(ThreadPoolExecutor.java:1149)
	at java.util.concurrent.ThreadPoolExecutor$Worker.run(ThreadPoolExecutor.java:624)
	at java.lang.Thread.run(Thread.java:748)
Caused by: java.net.UnknownHostException: www.crh.noaa.gov: Temporary failure in name resolution
	at java.net.Inet6AddressImpl.lookupAllHostAddr(Native Method)
	at java.net.InetAddress$2.lookupAllHostAddr(InetAddress.java:928)
	at java.net.InetAddress.getAddressesFromNameService(InetAddress.java:1323)
	at java.net.InetAddress.getAllByName0(InetAddress.java:1276)
	at java.net.InetAddress.getAllByName(InetAddress.java:1192)
	at java.net.InetAddress.getAllByName(InetAddress.java:1126)
	at org.apache.maven.wagon.providers.http.httpclient.impl.conn.SystemDefaultDnsResolver.resolve(SystemDefaultDnsResolver.java:45)
	at org.apache.maven.wagon.providers.http.httpclient.impl.conn.DefaultHttpClientConnectionOperator.connect(DefaultHttpClientConnectionOperator.java:111)
	at org.apache.maven.wagon.providers.http.httpclient.impl.conn.PoolingHttpClientConnectionManager.connect(PoolingHttpClientConnectionManager.java:353)
	at org.apache.maven.wagon.providers.http.httpclient.impl.execchain.MainClientExec.establishRoute(MainClientExec.java:380)
	at org.apache.maven.wagon.providers.http.httpclient.impl.execchain.MainClientExec.execute(MainClientExec.java:236)
	at org.apache.maven.wagon.providers.http.httpclient.impl.execchain.ProtocolExec.execute(ProtocolExec.java:184)
	at org.apache.maven.wagon.providers.http.httpclient.impl.execchain.RetryExec.execute(RetryExec.java:88)
	at org.apache.maven.wagon.providers.http.httpclient.impl.execchain.RedirectExec.execute(RedirectExec.java:110)
	at org.apache.maven.wagon.providers.http.httpclient.impl.client.InternalHttpClient.doExecute(InternalHttpClient.java:184)
	at org.apache.maven.wagon.providers.http.httpclient.impl.client.CloseableHttpClient.execute(CloseableHttpClient.java:82)
	at org.apache.maven.wagon.providers.http.AbstractHttpClientWagon.execute(AbstractHttpClientWagon.java:834)
	at org.apache.maven.wagon.providers.http.AbstractHttpClientWagon.fillInputData(AbstractHttpClientWagon.java:985)
	... 39 more
[WARNING] Retrying (1 more)
[WARNING] Could not get content
org.apache.maven.wagon.TransferFailedException: www.crh.noaa.gov
	at org.apache.maven.wagon.providers.http.AbstractHttpClientWagon.fillInputData(AbstractHttpClientWagon.java:1068)
	at org.apache.maven.wagon.providers.http.AbstractHttpClientWagon.fillInputData(AbstractHttpClientWagon.java:962)
	at org.apache.maven.wagon.StreamWagon.getInputStream(StreamWagon.java:126)
	at org.apache.maven.wagon.StreamWagon.getIfNewer(StreamWagon.java:88)
	at org.apache.maven.wagon.StreamWagon.get(StreamWagon.java:61)
	at com.googlecode.download.maven.plugin.internal.WGet.doGet(WGet.java:377)
	at com.googlecode.download.maven.plugin.internal.WGet.execute(WGet.java:282)
	at org.apache.maven.plugin.DefaultBuildPluginManager.executeMojo(DefaultBuildPluginManager.java:134)
	at org.apache.maven.lifecycle.internal.MojoExecutor.execute(MojoExecutor.java:208)
	at org.apache.maven.lifecycle.internal.MojoExecutor.execute(MojoExecutor.java:154)
	at org.apache.maven.lifecycle.internal.MojoExecutor.execute(MojoExecutor.java:146)
	at org.apache.maven.lifecycle.internal.LifecycleModuleBuilder.buildProject(LifecycleModuleBuilder.java:117)
	at org.apache.maven.lifecycle.internal.LifecycleModuleBuilder.buildProject(LifecycleModuleBuilder.java:81)
	at org.apache.maven.lifecycle.internal.builder.singlethreaded.SingleThreadedBuilder.build(SingleThreadedBuilder.java:51)
	at org.apache.maven.lifecycle.internal.LifecycleStarter.execute(LifecycleStarter.java:128)
	at org.apache.maven.DefaultMaven.doExecute(DefaultMaven.java:309)
	at org.apache.maven.DefaultMaven.doExecute(DefaultMaven.java:194)
	at org.apache.maven.DefaultMaven.execute(DefaultMaven.java:107)
	at org.jvnet.hudson.maven3.launcher.Maven35Launcher.main(Maven35Launcher.java:130)
	at sun.reflect.NativeMethodAccessorImpl.invoke0(Native Method)
	at sun.reflect.NativeMethodAccessorImpl.invoke(NativeMethodAccessorImpl.java:62)
	at sun.reflect.DelegatingMethodAccessorImpl.invoke(DelegatingMethodAccessorImpl.java:43)
	at java.lang.reflect.Method.invoke(Method.java:498)
	at org.codehaus.plexus.classworlds.launcher.Launcher.launchEnhanced(Launcher.java:289)
	at org.codehaus.plexus.classworlds.launcher.Launcher.launch(Launcher.java:229)
	at jenkins.maven3.agent.Maven35Main.launch(Maven35Main.java:176)
	at sun.reflect.NativeMethodAccessorImpl.invoke0(Native Method)
	at sun.reflect.NativeMethodAccessorImpl.invoke(NativeMethodAccessorImpl.java:62)
	at sun.reflect.DelegatingMethodAccessorImpl.invoke(DelegatingMethodAccessorImpl.java:43)
	at java.lang.reflect.Method.invoke(Method.java:498)
	at hudson.maven.Maven3Builder.call(Maven3Builder.java:139)
	at hudson.maven.Maven3Builder.call(Maven3Builder.java:70)
	at hudson.remoting.UserRequest.perform(UserRequest.java:212)
	at hudson.remoting.UserRequest.perform(UserRequest.java:54)
	at hudson.remoting.Request$2.run(Request.java:369)
	at hudson.remoting.InterceptingExecutorService$1.call(InterceptingExecutorService.java:72)
	at java.util.concurrent.FutureTask.run(FutureTask.java:266)
	at java.util.concurrent.ThreadPoolExecutor.runWorker(ThreadPoolExecutor.java:1149)
	at java.util.concurrent.ThreadPoolExecutor$Worker.run(ThreadPoolExecutor.java:624)
	at java.lang.Thread.run(Thread.java:748)
Caused by: java.net.UnknownHostException: www.crh.noaa.gov
	at java.net.InetAddress.getAllByName0(InetAddress.java:1280)
	at java.net.InetAddress.getAllByName(InetAddress.java:1192)
	at java.net.InetAddress.getAllByName(InetAddress.java:1126)
	at org.apache.maven.wagon.providers.http.httpclient.impl.conn.SystemDefaultDnsResolver.resolve(SystemDefaultDnsResolver.java:45)
	at org.apache.maven.wagon.providers.http.httpclient.impl.conn.DefaultHttpClientConnectionOperator.connect(DefaultHttpClientConnectionOperator.java:111)
	at org.apache.maven.wagon.providers.http.httpclient.impl.conn.PoolingHttpClientConnectionManager.connect(PoolingHttpClientConnectionManager.java:353)
	at org.apache.maven.wagon.providers.http.httpclient.impl.execchain.MainClientExec.establishRoute(MainClientExec.java:380)
	at org.apache.maven.wagon.providers.http.httpclient.impl.execchain.MainClientExec.execute(MainClientExec.java:236)
	at org.apache.maven.wagon.providers.http.httpclient.impl.execchain.ProtocolExec.execute(ProtocolExec.java:184)
	at org.apache.maven.wagon.providers.http.httpclient.impl.execchain.RetryExec.execute(RetryExec.java:88)
	at org.apache.maven.wagon.providers.http.httpclient.impl.execchain.RedirectExec.execute(RedirectExec.java:110)
	at org.apache.maven.wagon.providers.http.httpclient.impl.client.InternalHttpClient.doExecute(InternalHttpClient.java:184)
	at org.apache.maven.wagon.providers.http.httpclient.impl.client.CloseableHttpClient.execute(CloseableHttpClient.java:82)
	at org.apache.maven.wagon.providers.http.AbstractHttpClientWagon.execute(AbstractHttpClientWagon.java:834)
	at org.apache.maven.wagon.providers.http.AbstractHttpClientWagon.fillInputData(AbstractHttpClientWagon.java:985)
	... 39 more
[INFO] ------------------------------------------------------------------------
[INFO] Reactor Summary:
[INFO] 
[INFO] PDFBox parent ...................................... SUCCESS [03:48 min]
[INFO] Apache FontBox ..................................... SUCCESS [03:09 min]
[INFO] Apache XmpBox ...................................... SUCCESS [02:20 min]
[INFO] Apache PDFBox ...................................... FAILURE [01:23 min]
[INFO] Apache Preflight ................................... SKIPPED
[INFO] Apache Preflight application ....................... SKIPPED
[INFO] Apache PDFBox Debugger ............................. SKIPPED
[INFO] Apache PDFBox tools ................................ SKIPPED
[INFO] Apache PDFBox application .......................... SKIPPED
[INFO] Apache PDFBox Debugger application ................. SKIPPED
[INFO] Apache PDFBox examples ............................. SKIPPED
[INFO] PDFBox reactor ..................................... SKIPPED
[INFO] ------------------------------------------------------------------------
[INFO] BUILD FAILURE
[INFO] ------------------------------------------------------------------------
[INFO] Total time: 11:11 min
[INFO] Finished at: 2018-07-28T13:41:54Z
[INFO] Final Memory: 59M/698M
[INFO] ------------------------------------------------------------------------
[ERROR] Failed to execute goal com.googlecode.maven-download-plugin:download-maven-plugin:1.3.0:wget
(PDFBOX-4184) on project pdfbox: IO Error: Could not get content -> [Help 1]
[ERROR] 
[ERROR] To see the full stack trace of the errors, re-run Maven with the -e switch.
[ERROR] Re-run Maven using the -X switch to enable full debug logging.
[ERROR] 
[ERROR] For more information about the errors and possible solutions, please read the following
articles:
[ERROR] [Help 1] http://cwiki.apache.org/confluence/display/MAVEN/MojoExecutionException
[ERROR] 
[ERROR] After correcting the problems, you can resume the build with the command
[ERROR]   mvn <goals> -rf :pdfbox
[JENKINS] Archiving <https://builds.apache.org/job/PDFBox-2.0.x/ws/2.0/xmpbox/pom.xml>
to org.apache.pdfbox/xmpbox/2.0.12-SNAPSHOT/xmpbox-2.0.12-SNAPSHOT.pom
[JENKINS] Archiving <https://builds.apache.org/job/PDFBox-2.0.x/ws/2.0/xmpbox/target/xmpbox-2.0.12-SNAPSHOT.jar>
to org.apache.pdfbox/xmpbox/2.0.12-20180728.133856-88/xmpbox-2.0.12-20180728.133856-88.jar
[JENKINS] Archiving <https://builds.apache.org/job/PDFBox-2.0.x/ws/2.0/tools/pom.xml>
to org.apache.pdfbox/pdfbox-tools/2.0.12-SNAPSHOT/pdfbox-tools-2.0.12-SNAPSHOT.pom
[JENKINS] Archiving <https://builds.apache.org/job/PDFBox-2.0.x/ws/2.0/debugger/pom.xml>
to org.apache.pdfbox/pdfbox-debugger/2.0.12-SNAPSHOT/pdfbox-debugger-2.0.12-SNAPSHOT.pom
[JENKINS] Archiving <https://builds.apache.org/job/PDFBox-2.0.x/ws/2.0/preflight-app/pom.xml>
to org.apache.pdfbox/preflight-app/2.0.12-SNAPSHOT/preflight-app-2.0.12-SNAPSHOT.pom
[JENKINS] Archiving <https://builds.apache.org/job/PDFBox-2.0.x/ws/2.0/app/pom.xml>
to org.apache.pdfbox/pdfbox-app/2.0.12-SNAPSHOT/pdfbox-app-2.0.12-SNAPSHOT.pom
[JENKINS] Archiving <https://builds.apache.org/job/PDFBox-2.0.x/ws/2.0/examples/pom.xml>
to org.apache.pdfbox/pdfbox-examples/2.0.12-SNAPSHOT/pdfbox-examples-2.0.12-SNAPSHOT.pom
[JENKINS] Archiving <https://builds.apache.org/job/PDFBox-2.0.x/ws/2.0/preflight/pom.xml>
to org.apache.pdfbox/preflight/2.0.12-SNAPSHOT/preflight-2.0.12-SNAPSHOT.pom
[JENKINS] Archiving <https://builds.apache.org/job/PDFBox-2.0.x/ws/2.0/pom.xml> to org.apache.pdfbox/pdfbox-reactor/2.0.12-SNAPSHOT/pdfbox-reactor-2.0.12-SNAPSHOT.pom
[JENKINS] Archiving <https://builds.apache.org/job/PDFBox-2.0.x/ws/2.0/parent/pom.xml>
to org.apache.pdfbox/pdfbox-parent/2.0.12-SNAPSHOT/pdfbox-parent-2.0.12-SNAPSHOT.pom
[JENKINS] Archiving <https://builds.apache.org/job/PDFBox-2.0.x/ws/2.0/pdfbox/pom.xml>
to org.apache.pdfbox/pdfbox/2.0.12-SNAPSHOT/pdfbox-2.0.12-SNAPSHOT.pom
[JENKINS] Archiving <https://builds.apache.org/job/PDFBox-2.0.x/ws/2.0/debugger-app/pom.xml>
to org.apache.pdfbox/debugger-app/2.0.12-SNAPSHOT/debugger-app-2.0.12-SNAPSHOT.pom
[JENKINS] Archiving <https://builds.apache.org/job/PDFBox-2.0.x/ws/2.0/fontbox/pom.xml>
to org.apache.pdfbox/fontbox/2.0.12-SNAPSHOT/fontbox-2.0.12-SNAPSHOT.pom
[JENKINS] Archiving <https://builds.apache.org/job/PDFBox-2.0.x/ws/2.0/fontbox/target/fontbox-2.0.12-SNAPSHOT.jar>
to org.apache.pdfbox/fontbox/2.0.12-20180728.133620-88/fontbox-2.0.12-20180728.133620-88.jar
[Fast Archiver] Compressed 1.49 MB of artifacts by 37.8% relative to #1096
Sending e-mails to: dev@pdfbox.apache.org
channel stopped
Archiving artifacts

---------------------------------------------------------------------
To unsubscribe, e-mail: dev-unsubscribe@pdfbox.apache.org
For additional commands, e-mail: dev-help@pdfbox.apache.org


Mime
View raw message