pdfbox-dev mailing list archives

Site index · List index
Message view « Date » · « Thread »
Top « Date » · « Thread »
From Apache Jenkins Server <jenk...@builds.apache.org>
Subject Build failed in Jenkins: PDFBox-Trunk-jdk9 #518
Date Tue, 05 Jun 2018 20:16:33 GMT
See <https://builds.apache.org/job/PDFBox-Trunk-jdk9/518/display/redirect?page=changes>

Changes:

[tilman] PDFBOX-3353: don't rotate non angled styles

[tilman] PDFBOX-4237: fix javadoc

------------------------------------------
Started by an SCM change
[EnvInject] - Loading node environment variables.
Building remotely on H23 (ubuntu xenial) in workspace <https://builds.apache.org/job/PDFBox-Trunk-jdk9/ws/>
Cleaning up <https://builds.apache.org/job/PDFBox-Trunk-jdk9/ws/trunk>
Deleting <https://builds.apache.org/job/PDFBox-Trunk-jdk9/ws/trunk/app/target>
Deleting <https://builds.apache.org/job/PDFBox-Trunk-jdk9/ws/trunk/parent/target>
Deleting <https://builds.apache.org/job/PDFBox-Trunk-jdk9/ws/trunk/debugger-app/target>
Deleting <https://builds.apache.org/job/PDFBox-Trunk-jdk9/ws/trunk/debugger/target>
Deleting <https://builds.apache.org/job/PDFBox-Trunk-jdk9/ws/trunk/xmpbox/target>
Deleting <https://builds.apache.org/job/PDFBox-Trunk-jdk9/ws/trunk/tools/target>
Deleting <https://builds.apache.org/job/PDFBox-Trunk-jdk9/ws/trunk/preflight/target>
Deleting <https://builds.apache.org/job/PDFBox-Trunk-jdk9/ws/trunk/target>
Deleting <https://builds.apache.org/job/PDFBox-Trunk-jdk9/ws/trunk/examples/target>
Deleting <https://builds.apache.org/job/PDFBox-Trunk-jdk9/ws/trunk/fontbox/target>
Deleting <https://builds.apache.org/job/PDFBox-Trunk-jdk9/ws/trunk/pdfbox/target>
Deleting <https://builds.apache.org/job/PDFBox-Trunk-jdk9/ws/trunk/preflight-app/target>
Updating http://svn.apache.org/repos/asf/pdfbox/trunk at revision '2018-06-05T20:11:56.126
+0000'
U         examples/src/main/java/org/apache/pdfbox/examples/util/RemoveAllText.java
U         pdfbox/src/main/java/org/apache/pdfbox/multipdf/PDFCloneUtility.java
U         pdfbox/src/main/java/org/apache/pdfbox/pdmodel/font/PDType3CharProc.java
U         pdfbox/src/main/java/org/apache/pdfbox/pdmodel/interactive/annotation/handlers/PDFreeTextAppearanceHandler.java
U         pdfbox/src/main/java/org/apache/pdfbox/pdmodel/interactive/annotation/handlers/PDLineAppearanceHandler.java
U         pdfbox/src/main/java/org/apache/pdfbox/pdmodel/interactive/annotation/handlers/PDPolylineAppearanceHandler.java
U         pdfbox/src/main/java/org/apache/pdfbox/pdmodel/interactive/annotation/handlers/PDSquareAppearanceHandler.java
U         pdfbox/src/main/java/org/apache/pdfbox/pdmodel/interactive/annotation/handlers/PDAbstractAppearanceHandler.java
A         pdfbox/src/main/java/org/apache/pdfbox/pdmodel/interactive/annotation/layout
AU        pdfbox/src/main/java/org/apache/pdfbox/pdmodel/interactive/annotation/layout/AppearanceStyle.java
AU        pdfbox/src/main/java/org/apache/pdfbox/pdmodel/interactive/annotation/layout/PlainText.java
AU        pdfbox/src/main/java/org/apache/pdfbox/pdmodel/interactive/annotation/layout/PlainTextFormatter.java
U         pdfbox/src/main/java/org/apache/pdfbox/pdmodel/interactive/form/AppearanceGeneratorHelper.java
U         pdfbox/src/main/java/org/apache/pdfbox/pdmodel/interactive/form/PlainTextFormatter.java
U         pdfbox/src/main/java/org/apache/pdfbox/contentstream/PDFStreamEngine.java
U         pdfbox/src/main/java/org/apache/pdfbox/pdfparser/PDFStreamParser.java
U         pdfbox/src/test/java/org/apache/pdfbox/pdmodel/interactive/annotation/AppearanceGenerationTest.java
U         pdfbox/src/test/java/org/apache/pdfbox/pdmodel/interactive/annotation/PDSquareAnnotationTest.java
U         pdfbox/src/test/java/org/apache/pdfbox/pdmodel/interactive/form/PDAcroFormTest.java
U         pdfbox/src/test/java/org/apache/pdfbox/pdmodel/interactive/form/ControlCharacterTest.java
U         pdfbox/src/test/java/org/apache/pdfbox/pdmodel/TestPDPageContentStream.java
U         pdfbox/src/test/java/org/apache/pdfbox/pdmodel/graphics/image/LosslessFactoryTest.java
U         pdfbox/pom.xml
At revision 1832970

Parsing POMs
Established TCP socket on 45417
maven35-agent.jar already up to date
maven35-interceptor.jar already up to date
maven3-interceptor-commons.jar already up to date
[trunk] $ /home/jenkins/tools/java/jdk-9-b181-unlimited-security/bin/java -Xmx1g -XX:MaxPermSize=300m
-cp /home/jenkins/jenkins-slave/maven35-agent.jar:/home/jenkins/tools/maven/apache-maven-3.5.0/boot/plexus-classworlds-2.5.2.jar:/home/jenkins/tools/maven/apache-maven-3.5.0/conf/logging
jenkins.maven3.agent.Maven35Main /home/jenkins/tools/maven/apache-maven-3.5.0 /home/jenkins/jenkins-slave/slave.jar
/home/jenkins/jenkins-slave/maven35-interceptor.jar /home/jenkins/jenkins-slave/maven3-interceptor-commons.jar
45417
Java HotSpot(TM) 64-Bit Server VM warning: Ignoring option MaxPermSize; support was removed
in 8.0
<===[JENKINS REMOTING CAPACITY]===>   channel started
WARNING: An illegal reflective access operation has occurred
WARNING: Illegal reflective access by hudson.remoting.RemoteClassLoader (file:/home/jenkins/jenkins-slave/slave.jar)
to method java.lang.ClassLoader.getClassLoadingLock(java.lang.String)
WARNING: Please consider reporting this to the maintainers of hudson.remoting.RemoteClassLoader
WARNING: Use --illegal-access=warn to enable warnings of further illegal reflective access
operations
WARNING: All illegal access operations will be denied in a future release
Executing Maven:  -B -f <https://builds.apache.org/job/PDFBox-Trunk-jdk9/ws/trunk/pom.xml>
-Dmaven.repo.local=/home/jenkins/jenkins-slave/maven-repositories/0 clean install -Ppedantic,jdk9
-Dskip-bavaria=false
[INFO] Scanning for projects...
[WARNING] The project org.apache.pdfbox:pdfbox-parent:pom:3.0.0-SNAPSHOT uses prerequisites
which is only intended for maven-plugin projects but not for non maven-plugin projects. For
such purposes you should use the maven-enforcer-plugin. See https://maven.apache.org/enforcer/enforcer-rules/requireMavenVersion.html
[INFO] ------------------------------------------------------------------------
[INFO] Reactor Build Order:
[INFO] 
[INFO] PDFBox parent
[INFO] Apache FontBox
[INFO] Apache XmpBox
[INFO] Apache PDFBox
[INFO] Apache Preflight
[INFO] Apache Preflight application
[INFO] Apache PDFBox Debugger
[INFO] Apache PDFBox tools
[INFO] Apache PDFBox application
[INFO] Apache PDFBox Debugger application
[INFO] Apache PDFBox examples
[INFO] Apache PDFBox
[INFO] 
[INFO] ------------------------------------------------------------------------
[INFO] Building PDFBox parent 3.0.0-SNAPSHOT
[INFO] ------------------------------------------------------------------------
[INFO] 
[INFO] --- maven-clean-plugin:3.0.0:clean (default-clean) @ pdfbox-parent ---
[TASKS] Scanning folder '<https://builds.apache.org/job/PDFBox-Trunk-jdk9/ws/trunk/parent'>
for files matching the pattern '**/*.java' - excludes: 
[TASKS] Found 0 files to scan for tasks
Found 0 open tasks.
[TASKS] Computing warning deltas based on reference build #517
[INFO] 
[INFO] --- maven-enforcer-plugin:1.4.1:enforce (enforce-maven-version) @ pdfbox-parent ---
[INFO] 
[INFO] --- maven-remote-resources-plugin:1.5:process (process-resource-bundles) @ pdfbox-parent
---
[INFO] 
[INFO] --- animal-sniffer-maven-plugin:1.16:check (check-java-version) @ pdfbox-parent ---
[INFO] Checking unresolved references to org.codehaus.mojo.signature:java17:1.0
[INFO] 
[INFO] --- maven-site-plugin:3.7:attach-descriptor (attach-descriptor) @ pdfbox-parent ---
[INFO] No site descriptor found: nothing to attach.
[INFO] 
[INFO] >>> maven-source-plugin:3.0.1:jar (attach-sources) > generate-sources @
pdfbox-parent >>>
[INFO] 
[INFO] --- maven-enforcer-plugin:1.4.1:enforce (enforce-maven-version) @ pdfbox-parent ---
[WARNING] Failed to getClass for org.apache.maven.plugins.source.SourceJarMojo
[INFO] 
[INFO] <<< maven-source-plugin:3.0.1:jar (attach-sources) < generate-sources @
pdfbox-parent <<<
[INFO] 
[INFO] 
[INFO] --- maven-source-plugin:3.0.1:jar (attach-sources) @ pdfbox-parent ---
[INFO] 
[INFO] --- apache-rat-plugin:0.12:check (default) @ pdfbox-parent ---
[INFO] Enabled default license matchers.
[INFO] Will parse SCM ignores for exclusions...
[INFO] Finished adding exclusions from SCM ignore files.
[INFO] 61 implicit excludes (use -debug for more details).
[INFO] Exclude: release.properties
[INFO] 1 resources included (use -debug for more details)
[INFO] Rat check: Summary over all files. Unapproved: 0, unknown: 0, generated: 0, approved:
1 licenses.
[INFO] 
[INFO] --- dependency-check-maven:3.2.0:check (default) @ pdfbox-parent ---
[INFO] Central analyzer disabled
[INFO] Checking for updates
[INFO] starting getUpdatesNeeded() ...
[INFO] Download Started for NVD CVE - Modified
[INFO] Download Complete for NVD CVE - Modified  (1806 ms)
[INFO] Processing Started for NVD CVE - Modified
[INFO] Processing Complete for NVD CVE - Modified  (9819 ms)
[INFO] Begin database maintenance.
[INFO] End database maintenance.
[INFO] Check for updates complete (115996 ms)
[INFO] ------------------------------------------------------------------------
[INFO] Reactor Summary:
[INFO] 
[INFO] PDFBox parent ...................................... FAILURE [03:10 min]
[INFO] Apache FontBox ..................................... SKIPPED
[INFO] Apache XmpBox ...................................... SKIPPED
[INFO] Apache PDFBox ...................................... SKIPPED
[INFO] Apache Preflight ................................... SKIPPED
[INFO] Apache Preflight application ....................... SKIPPED
[INFO] Apache PDFBox Debugger ............................. SKIPPED
[INFO] Apache PDFBox tools ................................ SKIPPED
[INFO] Apache PDFBox application .......................... SKIPPED
[INFO] Apache PDFBox Debugger application ................. SKIPPED
[INFO] Apache PDFBox examples ............................. SKIPPED
[INFO] Apache PDFBox ...................................... SKIPPED
[INFO] ------------------------------------------------------------------------
[INFO] BUILD FAILURE
[INFO] ------------------------------------------------------------------------
[INFO] Total time: 03:28 min
[INFO] Finished at: 2018-06-05T20:16:01Z
[INFO] Final Memory: 41M/136M
[INFO] ------------------------------------------------------------------------
[ERROR] Failed to execute goal org.owasp:dependency-check-maven:3.2.0:check (default) on project
pdfbox-parent: One or more exceptions occurred during dependency-check analysis: Unable to
connect to the database
[ERROR] Unable to open db in read only mode
[ERROR] -> [Help 1]
[ERROR] 
[ERROR] To see the full stack trace of the errors, re-run Maven with the -e switch.
[ERROR] Re-run Maven using the -X switch to enable full debug logging.
[ERROR] 
[ERROR] For more information about the errors and possible solutions, please read the following
articles:
[ERROR] [Help 1] http://cwiki.apache.org/confluence/display/MAVEN/MojoExecutionException
[JENKINS] Archiving <https://builds.apache.org/job/PDFBox-Trunk-jdk9/ws/trunk/xmpbox/pom.xml>
to org.apache.pdfbox/xmpbox/3.0.0-SNAPSHOT/xmpbox-3.0.0-SNAPSHOT.pom
[JENKINS] Archiving <https://builds.apache.org/job/PDFBox-Trunk-jdk9/ws/trunk/tools/pom.xml>
to org.apache.pdfbox/pdfbox-tools/3.0.0-SNAPSHOT/pdfbox-tools-3.0.0-SNAPSHOT.pom
[JENKINS] Archiving <https://builds.apache.org/job/PDFBox-Trunk-jdk9/ws/trunk/debugger/pom.xml>
to org.apache.pdfbox/pdfbox-debugger/3.0.0-SNAPSHOT/pdfbox-debugger-3.0.0-SNAPSHOT.pom
[JENKINS] Archiving <https://builds.apache.org/job/PDFBox-Trunk-jdk9/ws/trunk/preflight-app/pom.xml>
to org.apache.pdfbox/preflight-app/3.0.0-SNAPSHOT/preflight-app-3.0.0-SNAPSHOT.pom
[JENKINS] Archiving <https://builds.apache.org/job/PDFBox-Trunk-jdk9/ws/trunk/app/pom.xml>
to org.apache.pdfbox/pdfbox-app/3.0.0-SNAPSHOT/pdfbox-app-3.0.0-SNAPSHOT.pom
[JENKINS] Archiving <https://builds.apache.org/job/PDFBox-Trunk-jdk9/ws/trunk/examples/pom.xml>
to org.apache.pdfbox/pdfbox-examples/3.0.0-SNAPSHOT/pdfbox-examples-3.0.0-SNAPSHOT.pom
[JENKINS] Archiving <https://builds.apache.org/job/PDFBox-Trunk-jdk9/ws/trunk/preflight/pom.xml>
to org.apache.pdfbox/preflight/3.0.0-SNAPSHOT/preflight-3.0.0-SNAPSHOT.pom
[JENKINS] Archiving <https://builds.apache.org/job/PDFBox-Trunk-jdk9/ws/trunk/pom.xml>
to org.apache.pdfbox/pdfbox-reactor/3.0.0-SNAPSHOT/pdfbox-reactor-3.0.0-SNAPSHOT.pom
[JENKINS] Archiving <https://builds.apache.org/job/PDFBox-Trunk-jdk9/ws/trunk/parent/pom.xml>
to org.apache.pdfbox/pdfbox-parent/3.0.0-SNAPSHOT/pdfbox-parent-3.0.0-SNAPSHOT.pom
[JENKINS] Archiving <https://builds.apache.org/job/PDFBox-Trunk-jdk9/ws/trunk/pdfbox/pom.xml>
to org.apache.pdfbox/pdfbox/3.0.0-SNAPSHOT/pdfbox-3.0.0-SNAPSHOT.pom
[JENKINS] Archiving <https://builds.apache.org/job/PDFBox-Trunk-jdk9/ws/trunk/debugger-app/pom.xml>
to org.apache.pdfbox/debugger-app/3.0.0-SNAPSHOT/debugger-app-3.0.0-SNAPSHOT.pom
[JENKINS] Archiving <https://builds.apache.org/job/PDFBox-Trunk-jdk9/ws/trunk/fontbox/pom.xml>
to org.apache.pdfbox/fontbox/3.0.0-SNAPSHOT/fontbox-3.0.0-SNAPSHOT.pom
Sending e-mails to: dev@pdfbox.apache.org
channel stopped
Archiving artifacts

---------------------------------------------------------------------
To unsubscribe, e-mail: dev-unsubscribe@pdfbox.apache.org
For additional commands, e-mail: dev-help@pdfbox.apache.org


Mime
View raw message