pdfbox-dev mailing list archives

Site index · List index
Message view « Date » · « Thread »
Top « Date » · « Thread »
From Apache Jenkins Server <jenk...@builds.apache.org>
Subject Build failed in Jenkins: PDFBox-sonar #457
Date Thu, 10 May 2018 12:09:45 GMT
See <https://builds.apache.org/job/PDFBox-sonar/457/display/redirect>

------------------------------------------
[...truncated 15.80 KB...]
[INFO] 
[INFO] --- maven-enforcer-plugin:1.4.1:enforce (enforce-maven-version) @ preflight ---
[INFO] 
[INFO] --- maven-remote-resources-plugin:1.5:process (process-resource-bundles) @ preflight
---
[INFO] 
[INFO] --- maven-resources-plugin:3.0.2:resources (default-resources) @ preflight ---
[INFO] Using 'UTF-8' encoding to copy filtered resources.
[INFO] Copying 0 resource
[INFO] Copying 3 resources
[INFO] 
[INFO] --- maven-compiler-plugin:3.6.0:compile (default-compile) @ preflight ---
[INFO] Changes detected - recompiling the module!
[INFO] Compiling 117 source files to <https://builds.apache.org/job/PDFBox-sonar/ws/trunk/preflight/target/classes>
[WARNING] bootstrap class path not set in conjunction with -source 1.7
[INFO] <https://builds.apache.org/job/PDFBox-sonar/ws/trunk/preflight/src/main/java/org/apache/pdfbox/preflight/font/descriptor/FontDescriptorHelper.java>:
<https://builds.apache.org/job/PDFBox-sonar/ws/trunk/preflight/src/main/java/org/apache/pdfbox/preflight/font/descriptor/FontDescriptorHelper.java>
uses unchecked or unsafe operations.
[INFO] <https://builds.apache.org/job/PDFBox-sonar/ws/trunk/preflight/src/main/java/org/apache/pdfbox/preflight/font/descriptor/FontDescriptorHelper.java>:
Recompile with -Xlint:unchecked for details.
[INFO]                                                                         
[INFO] ------------------------------------------------------------------------
[INFO] Building Apache Preflight application 3.0.0-SNAPSHOT
[INFO] ------------------------------------------------------------------------
[INFO] 
[INFO] --- maven-enforcer-plugin:1.4.1:enforce (enforce-maven-version) @ preflight-app ---
[INFO] 
[INFO] --- maven-remote-resources-plugin:1.5:process (process-resource-bundles) @ preflight-app
---
[INFO] 
[INFO] --- maven-resources-plugin:3.0.2:resources (default-resources) @ preflight-app ---
[INFO] Using 'UTF-8' encoding to copy filtered resources.
[INFO] skip non existing resourceDirectory <https://builds.apache.org/job/PDFBox-sonar/ws/trunk/preflight-app/src/main/resources>
[INFO] Copying 3 resources
[INFO] 
[INFO] --- maven-compiler-plugin:3.6.0:compile (default-compile) @ preflight-app ---
[INFO] No sources to compile
[INFO]                                                                         
[INFO] ------------------------------------------------------------------------
[INFO] Building Apache PDFBox Debugger 3.0.0-SNAPSHOT
[INFO] ------------------------------------------------------------------------
[INFO] 
[INFO] --- maven-enforcer-plugin:1.4.1:enforce (enforce-maven-version) @ pdfbox-debugger ---
[INFO] 
[INFO] --- maven-remote-resources-plugin:1.5:process (process-resource-bundles) @ pdfbox-debugger
---
[INFO] 
[INFO] --- maven-resources-plugin:3.0.2:resources (default-resources) @ pdfbox-debugger ---
[INFO] Using 'UTF-8' encoding to copy filtered resources.
[INFO] Copying 13 resources
[INFO] Copying 3 resources
[INFO] 
[INFO] --- maven-compiler-plugin:3.6.0:compile (default-compile) @ pdfbox-debugger ---
[INFO] Changes detected - recompiling the module!
[INFO] Compiling 82 source files to <https://builds.apache.org/job/PDFBox-sonar/ws/trunk/debugger/target/classes>
[WARNING] bootstrap class path not set in conjunction with -source 1.7
[WARNING] <https://builds.apache.org/job/PDFBox-sonar/ws/trunk/debugger/src/main/java/org/apache/pdfbox/debugger/fontencodingpane/Type3Font.java>:[166,19]
appendRawCommands(byte[]) in org.apache.pdfbox.pdmodel.PDPageContentStream has been deprecated
[INFO] <https://builds.apache.org/job/PDFBox-sonar/ws/trunk/debugger/src/main/java/org/apache/pdfbox/debugger/streampane/StreamPane.java>:
Some input files use unchecked or unsafe operations.
[INFO] <https://builds.apache.org/job/PDFBox-sonar/ws/trunk/debugger/src/main/java/org/apache/pdfbox/debugger/streampane/StreamPane.java>:
Recompile with -Xlint:unchecked for details.
[INFO]                                                                         
[INFO] ------------------------------------------------------------------------
[INFO] Building Apache PDFBox tools 3.0.0-SNAPSHOT
[INFO] ------------------------------------------------------------------------
[INFO] 
[INFO] --- maven-enforcer-plugin:1.4.1:enforce (enforce-maven-version) @ pdfbox-tools ---
[INFO] 
[INFO] --- maven-remote-resources-plugin:1.5:process (process-resource-bundles) @ pdfbox-tools
---
[INFO] 
[INFO] --- maven-resources-plugin:3.0.2:resources (default-resources) @ pdfbox-tools ---
[INFO] Using 'UTF-8' encoding to copy filtered resources.
[INFO] skip non existing resourceDirectory <https://builds.apache.org/job/PDFBox-sonar/ws/trunk/tools/src/main/resources>
[INFO] Copying 3 resources
[INFO] 
[INFO] --- maven-compiler-plugin:3.6.0:compile (default-compile) @ pdfbox-tools ---
[INFO] Changes detected - recompiling the module!
[INFO] Compiling 23 source files to <https://builds.apache.org/job/PDFBox-sonar/ws/trunk/tools/target/classes>
[WARNING] bootstrap class path not set in conjunction with -source 1.7
[INFO]                                                                         
[INFO] ------------------------------------------------------------------------
[INFO] Building Apache PDFBox application 3.0.0-SNAPSHOT
[INFO] ------------------------------------------------------------------------
[INFO] 
[INFO] --- maven-enforcer-plugin:1.4.1:enforce (enforce-maven-version) @ pdfbox-app ---
[INFO] 
[INFO] --- maven-remote-resources-plugin:1.5:process (process-resource-bundles) @ pdfbox-app
---
[INFO] 
[INFO] --- maven-resources-plugin:3.0.2:resources (default-resources) @ pdfbox-app ---
[INFO] Using 'UTF-8' encoding to copy filtered resources.
[INFO] skip non existing resourceDirectory <https://builds.apache.org/job/PDFBox-sonar/ws/trunk/app/src/main/resources>
[INFO] Copying 3 resources
[INFO] 
[INFO] --- maven-compiler-plugin:3.6.0:compile (default-compile) @ pdfbox-app ---
[INFO] No sources to compile
[INFO]                                                                         
[INFO] ------------------------------------------------------------------------
[INFO] Building Apache PDFBox Debugger application 3.0.0-SNAPSHOT
[INFO] ------------------------------------------------------------------------
[INFO] 
[INFO] --- maven-enforcer-plugin:1.4.1:enforce (enforce-maven-version) @ debugger-app ---
[INFO] 
[INFO] --- maven-remote-resources-plugin:1.5:process (process-resource-bundles) @ debugger-app
---
[INFO] 
[INFO] --- maven-resources-plugin:3.0.2:resources (default-resources) @ debugger-app ---
[INFO] Using 'UTF-8' encoding to copy filtered resources.
[INFO] skip non existing resourceDirectory <https://builds.apache.org/job/PDFBox-sonar/ws/trunk/debugger-app/src/main/resources>
[INFO] Copying 3 resources
[INFO] 
[INFO] --- maven-compiler-plugin:3.6.0:compile (default-compile) @ debugger-app ---
[INFO] No sources to compile
[INFO]                                                                         
[INFO] ------------------------------------------------------------------------
[INFO] Building Apache PDFBox examples 3.0.0-SNAPSHOT
[INFO] ------------------------------------------------------------------------
Downloading: http://repo.maven.apache.org/maven2/org/apache/lucene/lucene-core/5.5.4/lucene-core-5.5.4.pom
Downloaded: http://repo.maven.apache.org/maven2/org/apache/lucene/lucene-core/5.5.4/lucene-core-5.5.4.pom
(3 KB at 90.9 KB/sec)
Downloading: http://repo.maven.apache.org/maven2/org/apache/lucene/lucene-parent/5.5.4/lucene-parent-5.5.4.pom
Downloaded: http://repo.maven.apache.org/maven2/org/apache/lucene/lucene-parent/5.5.4/lucene-parent-5.5.4.pom
(5 KB at 277.9 KB/sec)
Downloading: http://repo.maven.apache.org/maven2/org/apache/lucene/lucene-solr-grandparent/5.5.4/lucene-solr-grandparent-5.5.4.pom
Downloaded: http://repo.maven.apache.org/maven2/org/apache/lucene/lucene-solr-grandparent/5.5.4/lucene-solr-grandparent-5.5.4.pom
(388 KB at 6450.0 KB/sec)
Downloading: http://repo.maven.apache.org/maven2/org/apache/lucene/lucene-analyzers-common/5.5.4/lucene-analyzers-common-5.5.4.pom
Downloaded: http://repo.maven.apache.org/maven2/org/apache/lucene/lucene-analyzers-common/5.5.4/lucene-analyzers-common-5.5.4.pom
(3 KB at 171.6 KB/sec)
Downloading: http://repo.maven.apache.org/maven2/org/apache/wink/wink-component-test-support/1.4/wink-component-test-support-1.4.pom
Downloaded: http://repo.maven.apache.org/maven2/org/apache/wink/wink-component-test-support/1.4/wink-component-test-support-1.4.pom
(3 KB at 161.9 KB/sec)
Downloading: http://repo.maven.apache.org/maven2/org/apache/wink/wink/1.4/wink-1.4.pom
Downloaded: http://repo.maven.apache.org/maven2/org/apache/wink/wink/1.4/wink-1.4.pom (42
KB at 2093.0 KB/sec)
Downloading: http://repo.maven.apache.org/maven2/org/springframework/spring-context/3.0.5.RELEASE/spring-context-3.0.5.RELEASE.pom
Downloaded: http://repo.maven.apache.org/maven2/org/springframework/spring-context/3.0.5.RELEASE/spring-context-3.0.5.RELEASE.pom
(7 KB at 263.0 KB/sec)
Downloading: http://repo.maven.apache.org/maven2/org/springframework/spring-aop/3.0.5.RELEASE/spring-aop-3.0.5.RELEASE.pom
Downloaded: http://repo.maven.apache.org/maven2/org/springframework/spring-aop/3.0.5.RELEASE/spring-aop-3.0.5.RELEASE.pom
(3 KB at 147.6 KB/sec)
Downloading: http://repo.maven.apache.org/maven2/org/springframework/spring-beans/3.0.5.RELEASE/spring-beans-3.0.5.RELEASE.pom
[WARNING] Checksum validation failed, could not read expected checksum: GET request of: org/springframework/spring-beans/3.0.5.RELEASE/spring-beans-3.0.5.RELEASE.pom.sha1
from central failed for http://repo.maven.apache.org/maven2/org/springframework/spring-beans/3.0.5.RELEASE/spring-beans-3.0.5.RELEASE.pom
[WARNING] Checksum validation failed, could not read expected checksum: GET request of: org/springframework/spring-beans/3.0.5.RELEASE/spring-beans-3.0.5.RELEASE.pom.sha1
from central failed for http://repo.maven.apache.org/maven2/org/springframework/spring-beans/3.0.5.RELEASE/spring-beans-3.0.5.RELEASE.pom
Downloaded: http://repo.maven.apache.org/maven2/org/springframework/spring-beans/3.0.5.RELEASE/spring-beans-3.0.5.RELEASE.pom
(3 KB at 69.7 KB/sec)
[WARNING] Failed to write resolution tracking file /home/jenkins/jenkins-slave/maven-repositories/0/org/springframework/spring-beans/3.0.5.RELEASE/_maven.repositories
java.io.IOException: No space left on device
	at java.io.RandomAccessFile.writeBytes(Native Method)
	at java.io.RandomAccessFile.write(RandomAccessFile.java:512)
	at org.sonatype.aether.impl.internal.TrackingFileManager.update(TrackingFileManager.java:129)
	at org.sonatype.aether.impl.internal.EnhancedLocalRepositoryManager.addRepo(EnhancedLocalRepositoryManager.java:158)
	at org.sonatype.aether.impl.internal.EnhancedLocalRepositoryManager.addArtifact(EnhancedLocalRepositoryManager.java:137)
	at org.sonatype.aether.impl.internal.EnhancedLocalRepositoryManager.add(EnhancedLocalRepositoryManager.java:110)
	at org.sonatype.aether.impl.internal.DefaultArtifactResolver.resolve(DefaultArtifactResolver.java:501)
	at org.sonatype.aether.impl.internal.DefaultArtifactResolver.resolveArtifacts(DefaultArtifactResolver.java:216)
	at org.sonatype.aether.impl.internal.DefaultArtifactResolver.resolveArtifact(DefaultArtifactResolver.java:193)
	at org.apache.maven.repository.internal.DefaultArtifactDescriptorReader.loadPom(DefaultArtifactDescriptorReader.java:281)
	at org.apache.maven.repository.internal.DefaultArtifactDescriptorReader.readArtifactDescriptor(DefaultArtifactDescriptorReader.java:186)
	at org.sonatype.aether.impl.internal.DefaultDependencyCollector.process(DefaultDependencyCollector.java:412)
	at org.sonatype.aether.impl.internal.DefaultDependencyCollector.process(DefaultDependencyCollector.java:544)
	at org.sonatype.aether.impl.internal.DefaultDependencyCollector.process(DefaultDependencyCollector.java:544)
	at org.sonatype.aether.impl.internal.DefaultDependencyCollector.process(DefaultDependencyCollector.java:544)
	at org.sonatype.aether.impl.internal.DefaultDependencyCollector.collectDependencies(DefaultDependencyCollector.java:240)
	at org.sonatype.aether.impl.internal.DefaultRepositorySystem.collectDependencies(DefaultRepositorySystem.java:308)
	at org.apache.maven.project.DefaultProjectDependenciesResolver.resolve(DefaultProjectDependenciesResolver.java:150)
	at org.apache.maven.lifecycle.internal.LifecycleDependencyResolver.getDependencies(LifecycleDependencyResolver.java:185)
	at org.apache.maven.lifecycle.internal.LifecycleDependencyResolver.resolveProjectDependencies(LifecycleDependencyResolver.java:117)
	at org.apache.maven.lifecycle.internal.MojoExecutor.ensureDependenciesAreResolved(MojoExecutor.java:258)
	at org.apache.maven.lifecycle.internal.MojoExecutor.execute(MojoExecutor.java:201)
	at org.apache.maven.lifecycle.internal.MojoExecutor.execute(MojoExecutor.java:153)
	at org.apache.maven.lifecycle.internal.MojoExecutor.execute(MojoExecutor.java:145)
	at org.apache.maven.lifecycle.internal.LifecycleModuleBuilder.buildProject(LifecycleModuleBuilder.java:84)
	at org.apache.maven.lifecycle.internal.LifecycleModuleBuilder.buildProject(LifecycleModuleBuilder.java:59)
	at org.apache.maven.lifecycle.internal.LifecycleStarter.singleThreadedBuild(LifecycleStarter.java:183)
	at org.apache.maven.lifecycle.internal.LifecycleStarter.execute(LifecycleStarter.java:161)
	at org.apache.maven.DefaultMaven.doExecute(DefaultMaven.java:320)
	at org.apache.maven.DefaultMaven.execute(DefaultMaven.java:156)
	at org.jvnet.hudson.maven3.launcher.Maven3Launcher.main(Maven3Launcher.java:117)
	at sun.reflect.NativeMethodAccessorImpl.invoke0(Native Method)
	at sun.reflect.NativeMethodAccessorImpl.invoke(NativeMethodAccessorImpl.java:62)
	at sun.reflect.DelegatingMethodAccessorImpl.invoke(DelegatingMethodAccessorImpl.java:43)
	at java.lang.reflect.Method.invoke(Method.java:498)
	at org.codehaus.plexus.classworlds.launcher.Launcher.launchStandard(Launcher.java:329)
	at org.codehaus.plexus.classworlds.launcher.Launcher.launch(Launcher.java:239)
	at org.jvnet.hudson.maven3.agent.Maven3Main.launch(Maven3Main.java:181)
	at sun.reflect.NativeMethodAccessorImpl.invoke0(Native Method)
	at sun.reflect.NativeMethodAccessorImpl.invoke(NativeMethodAccessorImpl.java:62)
	at sun.reflect.DelegatingMethodAccessorImpl.invoke(DelegatingMethodAccessorImpl.java:43)
	at java.lang.reflect.Method.invoke(Method.java:498)
	at hudson.maven.Maven3Builder.call(Maven3Builder.java:139)
	at hudson.maven.Maven3Builder.call(Maven3Builder.java:70)
	at hudson.remoting.UserRequest.perform(UserRequest.java:207)
	at hudson.remoting.UserRequest.perform(UserRequest.java:53)
	at hudson.remoting.Request$2.run(Request.java:358)
	at hudson.remoting.InterceptingExecutorService$1.call(InterceptingExecutorService.java:72)
	at java.util.concurrent.FutureTask.run(FutureTask.java:266)
	at java.util.concurrent.ThreadPoolExecutor.runWorker(ThreadPoolExecutor.java:1149)
	at java.util.concurrent.ThreadPoolExecutor$Worker.run(ThreadPoolExecutor.java:624)
	at java.lang.Thread.run(Thread.java:748)
Downloading: http://repo.maven.apache.org/maven2/org/springframework/spring-core/3.0.5.RELEASE/spring-core-3.0.5.RELEASE.pom
Downloading: http://repo.maven.apache.org/maven2/org/springframework/spring-expression/3.0.5.RELEASE/spring-expression-3.0.5.RELEASE.pom
Downloading: http://repo.maven.apache.org/maven2/org/springframework/spring-web/3.0.5.RELEASE/spring-web-3.0.5.RELEASE.pom
Downloading: http://repo.maven.apache.org/maven2/org/slf4j/jcl-over-slf4j/1.6.1/jcl-over-slf4j-1.6.1.pom
Downloading: http://repo.maven.apache.org/maven2/org/apache/geronimo/specs/geronimo-jaxrs_1.1_spec/1.0/geronimo-jaxrs_1.1_spec-1.0.pom
[INFO]                                                                         
[INFO] ------------------------------------------------------------------------
[INFO] Skipping Apache PDFBox
[INFO] This project has been banned from the build due to previous failures.
[INFO] ------------------------------------------------------------------------
[INFO] ------------------------------------------------------------------------
[INFO] Reactor Summary:
[INFO] 
[INFO] PDFBox parent ..................................... SUCCESS [5.847s]
[INFO] Apache FontBox .................................... SUCCESS [4.944s]
[INFO] Apache XmpBox ..................................... SUCCESS [1.863s]
[INFO] Apache PDFBox ..................................... SUCCESS [4.760s]
[INFO] Apache Preflight .................................. SUCCESS [1.804s]
[INFO] Apache Preflight application ...................... SUCCESS [1.440s]
[INFO] Apache PDFBox Debugger ............................ SUCCESS [3.027s]
[INFO] Apache PDFBox tools ............................... SUCCESS [1.624s]
[INFO] Apache PDFBox application ......................... SUCCESS [1.210s]
[INFO] Apache PDFBox Debugger application ................ SUCCESS [1.218s]
[INFO] Apache PDFBox examples ............................ FAILURE [1.051s]
[INFO] Apache PDFBox ..................................... SKIPPED
[INFO] ------------------------------------------------------------------------
[INFO] BUILD FAILURE
[INFO] ------------------------------------------------------------------------
[INFO] Total time: 1:12.570s
[INFO] Finished at: Thu May 10 12:09:23 UTC 2018
[INFO] Final Memory: 40M/569M
[INFO] ------------------------------------------------------------------------
Waiting for Jenkins to finish collecting data
[ERROR] Failed to execute goal on project pdfbox-examples: Could not resolve dependencies
for project org.apache.pdfbox:pdfbox-examples:jar:3.0.0-SNAPSHOT: Failed to collect dependencies
for [org.bouncycastle:bcmail-jdk15on:jar:1.59 (compile?), org.apache.pdfbox:pdfbox-tools:jar:3.0.0-SNAPSHOT
(compile), org.apache.pdfbox:xmpbox:jar:3.0.0-SNAPSHOT (compile), org.apache.pdfbox:preflight:jar:3.0.0-SNAPSHOT
(test), org.apache.lucene:lucene-core:jar:5.5.4 (compile), org.apache.lucene:lucene-analyzers-common:jar:5.5.4
(compile), org.apache.ant:ant:jar:1.9.9 (compile), junit:junit:jar:4.12 (test), org.apache.wink:wink-component-test-support:jar:1.4
(test)]: Failed to read artifact descriptor for org.springframework:spring-core:jar:3.0.5.RELEASE:
Could not transfer artifact org.springframework:spring-core:pom:3.0.5.RELEASE from/to central
(http://repo.maven.apache.org/maven2): Specified destination directory cannot be created:
/home/jenkins/jenkins-slave/maven-repositories/0/org/springframework/spring-core/3.0.5.RELEASE
-> [Help 1]
[ERROR] 
[ERROR] To see the full stack trace of the errors, re-run Maven with the -e switch.
[ERROR] Re-run Maven using the -X switch to enable full debug logging.
[ERROR] 
[ERROR] For more information about the errors and possible solutions, please read the following
articles:
[ERROR] [Help 1] http://cwiki.apache.org/confluence/display/MAVEN/DependencyResolutionException
[ERROR] 
[ERROR] After correcting the problems, you can resume the build with the command
[ERROR]   mvn <goals> -rf :pdfbox-examples
[JENKINS] Archiving <https://builds.apache.org/job/PDFBox-sonar/ws/trunk/xmpbox/pom.xml>
to org.apache.pdfbox/xmpbox/3.0.0-SNAPSHOT/xmpbox-3.0.0-SNAPSHOT.pom
[Fast Archiver] No artifacts from PDFBox-sonar » Apache XmpBox #456 to compare, so performing
full copy of artifacts
[JENKINS] Archiving <https://builds.apache.org/job/PDFBox-sonar/ws/trunk/tools/pom.xml>
to org.apache.pdfbox/pdfbox-tools/3.0.0-SNAPSHOT/pdfbox-tools-3.0.0-SNAPSHOT.pom
[Fast Archiver] No artifacts from PDFBox-sonar » Apache PDFBox tools #456 to compare, so
performing full copy of artifacts
[JENKINS] Archiving <https://builds.apache.org/job/PDFBox-sonar/ws/trunk/debugger/pom.xml>
to org.apache.pdfbox/pdfbox-debugger/3.0.0-SNAPSHOT/pdfbox-debugger-3.0.0-SNAPSHOT.pom
[Fast Archiver] No artifacts from PDFBox-sonar » Apache PDFBox Debugger #456 to compare,
so performing full copy of artifacts
[JENKINS] Archiving <https://builds.apache.org/job/PDFBox-sonar/ws/trunk/preflight-app/pom.xml>
to org.apache.pdfbox/preflight-app/3.0.0-SNAPSHOT/preflight-app-3.0.0-SNAPSHOT.pom
[Fast Archiver] No artifacts from PDFBox-sonar » Apache Preflight application #456 to compare,
so performing full copy of artifacts
[JENKINS] Archiving <https://builds.apache.org/job/PDFBox-sonar/ws/trunk/app/pom.xml>
to org.apache.pdfbox/pdfbox-app/3.0.0-SNAPSHOT/pdfbox-app-3.0.0-SNAPSHOT.pom
[Fast Archiver] No artifacts from PDFBox-sonar » Apache PDFBox application #456 to compare,
so performing full copy of artifacts
[JENKINS] Archiving <https://builds.apache.org/job/PDFBox-sonar/ws/trunk/examples/pom.xml>
to org.apache.pdfbox/pdfbox-examples/3.0.0-SNAPSHOT/pdfbox-examples-3.0.0-SNAPSHOT.pom
[Fast Archiver] No artifacts from PDFBox-sonar » Apache PDFBox examples #456 to compare,
so performing full copy of artifacts
[JENKINS] Archiving <https://builds.apache.org/job/PDFBox-sonar/ws/trunk/preflight/pom.xml>
to org.apache.pdfbox/preflight/3.0.0-SNAPSHOT/preflight-3.0.0-SNAPSHOT.pom
[Fast Archiver] No artifacts from PDFBox-sonar » Apache Preflight #456 to compare, so performing
full copy of artifacts
[JENKINS] Archiving <https://builds.apache.org/job/PDFBox-sonar/ws/trunk/pom.xml> to
org.apache.pdfbox/pdfbox-reactor/3.0.0-SNAPSHOT/pdfbox-reactor-3.0.0-SNAPSHOT.pom
[JENKINS] Archiving <https://builds.apache.org/job/PDFBox-sonar/ws/trunk/parent/pom.xml>
to org.apache.pdfbox/pdfbox-parent/3.0.0-SNAPSHOT/pdfbox-parent-3.0.0-SNAPSHOT.pom
[Fast Archiver] No artifacts from PDFBox-sonar » PDFBox parent #456 to compare, so performing
full copy of artifacts
[JENKINS] Archiving <https://builds.apache.org/job/PDFBox-sonar/ws/trunk/pdfbox/pom.xml>
to org.apache.pdfbox/pdfbox/3.0.0-SNAPSHOT/pdfbox-3.0.0-SNAPSHOT.pom
[Fast Archiver] No artifacts from PDFBox-sonar » Apache PDFBox #456 to compare, so performing
full copy of artifacts
[JENKINS] Archiving <https://builds.apache.org/job/PDFBox-sonar/ws/trunk/debugger-app/pom.xml>
to org.apache.pdfbox/debugger-app/3.0.0-SNAPSHOT/debugger-app-3.0.0-SNAPSHOT.pom
[Fast Archiver] No artifacts from PDFBox-sonar » Apache PDFBox Debugger application #456
to compare, so performing full copy of artifacts
[JENKINS] Archiving <https://builds.apache.org/job/PDFBox-sonar/ws/trunk/fontbox/pom.xml>
to org.apache.pdfbox/fontbox/3.0.0-SNAPSHOT/fontbox-3.0.0-SNAPSHOT.pom
[Fast Archiver] No artifacts from PDFBox-sonar » Apache FontBox #456 to compare, so performing
full copy of artifacts
Sending e-mails to: dev@pdfbox.apache.org
channel stopped

---------------------------------------------------------------------
To unsubscribe, e-mail: dev-unsubscribe@pdfbox.apache.org
For additional commands, e-mail: dev-help@pdfbox.apache.org


Mime
View raw message