pdfbox-dev mailing list archives

Site index · List index
Message view « Date » · « Thread »
Top « Date » · « Thread »
From Apache Jenkins Server <jenk...@builds.apache.org>
Subject Build failed in Jenkins: PDFBox-sonar #456
Date Thu, 10 May 2018 11:58:55 GMT
See <https://builds.apache.org/job/PDFBox-sonar/456/display/redirect>

------------------------------------------
[...truncated 343.46 KB...]
[INFO] Copying 3 resources
[INFO] 
[INFO] --- maven-compiler-plugin:3.6.0:compile (default-compile) @ debugger-app ---
[INFO] No sources to compile
[INFO]                                                                         
[INFO] ------------------------------------------------------------------------
[INFO] Building Apache PDFBox examples 3.0.0-SNAPSHOT
[INFO] ------------------------------------------------------------------------
Downloading: http://repo.maven.apache.org/maven2/org/apache/wink/wink-component-test-support/1.4/wink-component-test-support-1.4.pom
Downloaded: http://repo.maven.apache.org/maven2/org/apache/wink/wink-component-test-support/1.4/wink-component-test-support-1.4.pom
(3 KB at 131.1 KB/sec)
Downloading: http://repo.maven.apache.org/maven2/org/apache/wink/wink/1.4/wink-1.4.pom
Downloaded: http://repo.maven.apache.org/maven2/org/apache/wink/wink/1.4/wink-1.4.pom (42
KB at 1820.0 KB/sec)
Downloading: http://repo.maven.apache.org/maven2/org/springframework/spring-context/3.0.5.RELEASE/spring-context-3.0.5.RELEASE.pom
Downloaded: http://repo.maven.apache.org/maven2/org/springframework/spring-context/3.0.5.RELEASE/spring-context-3.0.5.RELEASE.pom
(7 KB at 284.9 KB/sec)
Downloading: http://repo.maven.apache.org/maven2/org/springframework/spring-parent/3.0.5.RELEASE/spring-parent-3.0.5.RELEASE.pom
Downloaded: http://repo.maven.apache.org/maven2/org/springframework/spring-parent/3.0.5.RELEASE/spring-parent-3.0.5.RELEASE.pom
(9 KB at 455.3 KB/sec)
Downloading: http://repo.maven.apache.org/maven2/org/springframework/spring-aop/3.0.5.RELEASE/spring-aop-3.0.5.RELEASE.pom
Downloaded: http://repo.maven.apache.org/maven2/org/springframework/spring-aop/3.0.5.RELEASE/spring-aop-3.0.5.RELEASE.pom
(3 KB at 132.0 KB/sec)
Downloading: http://repo.maven.apache.org/maven2/org/springframework/spring-asm/3.0.5.RELEASE/spring-asm-3.0.5.RELEASE.pom
Downloaded: http://repo.maven.apache.org/maven2/org/springframework/spring-asm/3.0.5.RELEASE/spring-asm-3.0.5.RELEASE.pom
(2 KB at 110.8 KB/sec)
Downloading: http://repo.maven.apache.org/maven2/org/springframework/spring-beans/3.0.5.RELEASE/spring-beans-3.0.5.RELEASE.pom
Downloaded: http://repo.maven.apache.org/maven2/org/springframework/spring-beans/3.0.5.RELEASE/spring-beans-3.0.5.RELEASE.pom
(3 KB at 134.9 KB/sec)
Downloading: http://repo.maven.apache.org/maven2/org/springframework/spring-core/3.0.5.RELEASE/spring-core-3.0.5.RELEASE.pom
Downloaded: http://repo.maven.apache.org/maven2/org/springframework/spring-core/3.0.5.RELEASE/spring-core-3.0.5.RELEASE.pom
(3 KB at 142.1 KB/sec)
Downloading: http://repo.maven.apache.org/maven2/org/springframework/spring-expression/3.0.5.RELEASE/spring-expression-3.0.5.RELEASE.pom
Downloaded: http://repo.maven.apache.org/maven2/org/springframework/spring-expression/3.0.5.RELEASE/spring-expression-3.0.5.RELEASE.pom
(2 KB at 95.5 KB/sec)
Downloading: http://repo.maven.apache.org/maven2/org/springframework/spring-web/3.0.5.RELEASE/spring-web-3.0.5.RELEASE.pom
Downloaded: http://repo.maven.apache.org/maven2/org/springframework/spring-web/3.0.5.RELEASE/spring-web-3.0.5.RELEASE.pom
(5 KB at 114.7 KB/sec)
Downloading: http://repo.maven.apache.org/maven2/xmlunit/xmlunit/1.1/xmlunit-1.1.pom
Downloaded: http://repo.maven.apache.org/maven2/xmlunit/xmlunit/1.1/xmlunit-1.1.pom (2 KB
at 44.9 KB/sec)
Downloading: http://repo.maven.apache.org/maven2/org/apache/geronimo/specs/geronimo-jaxrs_1.1_spec/1.0/geronimo-jaxrs_1.1_spec-1.0.pom
Downloaded: http://repo.maven.apache.org/maven2/org/apache/geronimo/specs/geronimo-jaxrs_1.1_spec/1.0/geronimo-jaxrs_1.1_spec-1.0.pom
(4 KB at 204.9 KB/sec)
[INFO] 
[INFO] --- maven-enforcer-plugin:1.4.1:enforce (enforce-maven-version) @ pdfbox-examples ---
[INFO] 
[INFO] --- maven-remote-resources-plugin:1.5:process (process-resource-bundles) @ pdfbox-examples
---
[INFO] 
[INFO] --- maven-resources-plugin:3.0.2:resources (default-resources) @ pdfbox-examples ---
[INFO] Using 'UTF-8' encoding to copy filtered resources.
[INFO] Copying 8 resources
[INFO] Copying 3 resources
[INFO] 
[INFO] --- maven-compiler-plugin:3.6.0:compile (default-compile) @ pdfbox-examples ---
[INFO] Changes detected - recompiling the module!
[INFO] Compiling 78 source files to <https://builds.apache.org/job/PDFBox-sonar/ws/trunk/examples/target/classes>
[WARNING] bootstrap class path not set in conjunction with -source 1.7
[INFO] <https://builds.apache.org/job/PDFBox-sonar/ws/trunk/examples/src/main/java/org/apache/pdfbox/examples/signature/validation/CertInformationCollector.java>:
Some input files use unchecked or unsafe operations.
[INFO] <https://builds.apache.org/job/PDFBox-sonar/ws/trunk/examples/src/main/java/org/apache/pdfbox/examples/signature/validation/CertInformationCollector.java>:
Recompile with -Xlint:unchecked for details.
[INFO]                                                                         
[INFO] ------------------------------------------------------------------------
[INFO] Building Apache PDFBox 3.0.0-SNAPSHOT
[INFO] ------------------------------------------------------------------------
[INFO] 
[INFO] --- maven-enforcer-plugin:1.4.1:enforce (enforce-maven-version) @ pdfbox-reactor ---
[INFO] 
[INFO] --- maven-remote-resources-plugin:1.5:process (process-resource-bundles) @ pdfbox-reactor
---
[INFO]                                                                         
[INFO] ------------------------------------------------------------------------
[INFO] Building Apache PDFBox 3.0.0-SNAPSHOT
[INFO] ------------------------------------------------------------------------
Downloading: http://repo.maven.apache.org/maven2/com/github/jai-imageio/jai-imageio-core/1.4.0/jai-imageio-core-1.4.0.jar
Downloading: http://repo.maven.apache.org/maven2/com/github/jai-imageio/jai-imageio-jpeg2000/1.3.0/jai-imageio-jpeg2000-1.3.0.jar
Downloaded: http://repo.maven.apache.org/maven2/com/github/jai-imageio/jai-imageio-core/1.4.0/jai-imageio-core-1.4.0.jar
(614 KB at 8401.8 KB/sec)
Downloaded: http://repo.maven.apache.org/maven2/com/github/jai-imageio/jai-imageio-jpeg2000/1.3.0/jai-imageio-jpeg2000-1.3.0.jar
(450 KB at 5487.1 KB/sec)
Downloading: http://repo.maven.apache.org/maven2/org/apache/wink/wink-component-test-support/1.4/wink-component-test-support-1.4.jar
Downloading: http://repo.maven.apache.org/maven2/org/springframework/spring-context/3.0.5.RELEASE/spring-context-3.0.5.RELEASE.jar
Downloading: http://repo.maven.apache.org/maven2/org/springframework/spring-aop/3.0.5.RELEASE/spring-aop-3.0.5.RELEASE.jar
Downloading: http://repo.maven.apache.org/maven2/org/springframework/spring-beans/3.0.5.RELEASE/spring-beans-3.0.5.RELEASE.jar
Downloading: http://repo.maven.apache.org/maven2/org/springframework/spring-core/3.0.5.RELEASE/spring-core-3.0.5.RELEASE.jar
Downloaded: http://repo.maven.apache.org/maven2/org/apache/wink/wink-component-test-support/1.4/wink-component-test-support-1.4.jar
(40 KB at 1985.3 KB/sec)
Downloading: http://repo.maven.apache.org/maven2/org/springframework/spring-expression/3.0.5.RELEASE/spring-expression-3.0.5.RELEASE.jar
Downloaded: http://repo.maven.apache.org/maven2/org/springframework/spring-expression/3.0.5.RELEASE/spring-expression-3.0.5.RELEASE.jar
(166 KB at 7207.5 KB/sec)
Downloading: http://repo.maven.apache.org/maven2/org/springframework/spring-asm/3.0.5.RELEASE/spring-asm-3.0.5.RELEASE.jar
Downloaded: http://repo.maven.apache.org/maven2/org/springframework/spring-aop/3.0.5.RELEASE/spring-aop-3.0.5.RELEASE.jar
(314 KB at 7294.5 KB/sec)
Downloading: http://repo.maven.apache.org/maven2/org/springframework/spring-web/3.0.5.RELEASE/spring-web-3.0.5.RELEASE.jar
Downloaded: http://repo.maven.apache.org/maven2/org/springframework/spring-core/3.0.5.RELEASE/spring-core-3.0.5.RELEASE.jar
(374 KB at 7182.3 KB/sec)
Downloading: http://repo.maven.apache.org/maven2/org/slf4j/jcl-over-slf4j/1.6.1/jcl-over-slf4j-1.6.1.jar
Downloaded: http://repo.maven.apache.org/maven2/org/springframework/spring-context/3.0.5.RELEASE/spring-context-3.0.5.RELEASE.jar
(654 KB at 11876.1 KB/sec)
Downloading: http://repo.maven.apache.org/maven2/xmlunit/xmlunit/1.1/xmlunit-1.1.jar
Downloaded: http://repo.maven.apache.org/maven2/org/springframework/spring-asm/3.0.5.RELEASE/spring-asm-3.0.5.RELEASE.jar
(52 KB at 3455.9 KB/sec)
Downloading: http://repo.maven.apache.org/maven2/org/apache/geronimo/specs/geronimo-jaxrs_1.1_spec/1.0/geronimo-jaxrs_1.1_spec-1.0.jar
Downloaded: http://repo.maven.apache.org/maven2/org/springframework/spring-beans/3.0.5.RELEASE/spring-beans-3.0.5.RELEASE.jar
(543 KB at 8218.1 KB/sec)
Downloaded: http://repo.maven.apache.org/maven2/org/slf4j/jcl-over-slf4j/1.6.1/jcl-over-slf4j-1.6.1.jar
(17 KB at 1126.8 KB/sec)
Downloaded: http://repo.maven.apache.org/maven2/xmlunit/xmlunit/1.1/xmlunit-1.1.jar (85 KB
at 4679.3 KB/sec)
Downloaded: http://repo.maven.apache.org/maven2/org/springframework/spring-web/3.0.5.RELEASE/spring-web-3.0.5.RELEASE.jar
(387 KB at 12877.2 KB/sec)
Downloaded: http://repo.maven.apache.org/maven2/org/apache/geronimo/specs/geronimo-jaxrs_1.1_spec/1.0/geronimo-jaxrs_1.1_spec-1.0.jar
(54 KB at 3154.9 KB/sec)
[INFO] 
[INFO] --- sonar-maven-plugin:3.4.0.905:sonar (default-cli) @ pdfbox-reactor ---
[INFO] User cache: /home/jenkins/.sonar/cache
[INFO] SonarQube version: 5.6.3
[INFO] Default locale: "en_US", source code encoding: "UTF-8"
[INFO] Load global repositories
[INFO] Load global repositories (done) | time=1323ms
[INFO] Server id: 17cad23492ff68b
[INFO] User cache: /home/jenkins/.sonar/cache
[INFO] Load plugins index
[INFO] Load plugins index (done) | time=328ms
[INFO] Process project properties
[INFO] Load project repositories
[INFO] Load project repositories (done) | time=1595ms
[INFO] Load quality profiles
[INFO] Load quality profiles (done) | time=374ms
[INFO] Load active rules
[INFO] Load active rules (done) | time=2116ms
[INFO] Publish mode
[INFO] -------------  Scan PDFBox parent
[INFO] Load server rules
[INFO] Load server rules (done) | time=705ms
[INFO] Base dir: <https://builds.apache.org/job/PDFBox-sonar/ws/trunk/parent>
[INFO] Working dir: <https://builds.apache.org/job/PDFBox-sonar/ws/trunk/parent/target/sonar>
[INFO] Source paths: pom.xml
[INFO] Source encoding: UTF-8, default locale: en_US
[INFO] Index files
[INFO] 0 files indexed
[INFO] Sensor Lines Sensor
[INFO] Sensor Lines Sensor (done) | time=0ms
[INFO] Sensor SCM Sensor
[INFO] Sensor SCM Sensor (done) | time=0ms
[INFO] Sensor Coverage Report Import
[INFO] Sensor Coverage Report Import (done) | time=0ms
[INFO] Sensor Coverage Report Import
[INFO] Sensor Coverage Report Import (done) | time=0ms
[INFO] Sensor Unit Test Results Import
[INFO] Sensor Unit Test Results Import (done) | time=0ms
[INFO] Sensor XmlFileSensor
[INFO] Sensor XmlFileSensor (done) | time=0ms
[INFO] Sensor Zero Coverage Sensor
[INFO] Sensor Zero Coverage Sensor (done) | time=0ms
[INFO] Sensor Code Colorizer Sensor
[INFO] Sensor Code Colorizer Sensor (done) | time=0ms
[INFO] Sensor CPD Block Indexer
[INFO] Sensor CPD Block Indexer (done) | time=0ms
[INFO] -------------  Scan Apache FontBox
[INFO] Base dir: <https://builds.apache.org/job/PDFBox-sonar/ws/trunk/fontbox>
[INFO] Working dir: <https://builds.apache.org/job/PDFBox-sonar/ws/trunk/fontbox/target/sonar>
[INFO] Source paths: pom.xml, src/main/java
[INFO] Test paths: src/test/java
[INFO] Binary dirs: target/classes
[INFO] Source encoding: UTF-8, default locale: en_US
[INFO] Index files
[INFO] 147 files indexed
[INFO] Quality profile for java: Sonar way
[INFO] Sensor Lines Sensor
[INFO] Sensor Lines Sensor (done) | time=36ms
[INFO] Sensor JavaSquidSensor
[INFO] Configured Java source version (sonar.java.source): 7
[INFO] JavaClasspath initialization
[INFO] JavaClasspath initialization (done) | time=19ms
[INFO] JavaTestClasspath initialization
[INFO] JavaTestClasspath initialization (done) | time=0ms
[INFO] Java Main Files AST scan
[INFO] 134 source files to be analyzed
[INFO] ------------------------------------------------------------------------
[INFO] Reactor Summary:
[INFO] 
[INFO] PDFBox parent ..................................... SUCCESS [5.647s]
[INFO] Apache FontBox .................................... SUCCESS [5.129s]
[INFO] Apache XmpBox ..................................... SUCCESS [1.831s]
[INFO] Apache PDFBox ..................................... SUCCESS [5.993s]
[INFO] Apache Preflight .................................. SUCCESS [1.781s]
[INFO] Apache Preflight application ...................... SUCCESS [1.260s]
[INFO] Apache PDFBox Debugger ............................ SUCCESS [2.205s]
[INFO] Apache PDFBox tools ............................... SUCCESS [1.531s]
[INFO] Apache PDFBox application ......................... SUCCESS [1.907s]
[INFO] Apache PDFBox Debugger application ................ SUCCESS [1.599s]
[INFO] Apache PDFBox examples ............................ SUCCESS [2.618s]
[INFO] Apache PDFBox ..................................... FAILURE [19.772s]
[INFO] ------------------------------------------------------------------------
[INFO] BUILD FAILURE
[INFO] ------------------------------------------------------------------------
[INFO] Total time: 1:38.535s
[INFO] Finished at: Thu May 10 11:58:42 UTC 2018
[INFO] Final Memory: 52M/851M
[INFO] ------------------------------------------------------------------------
Waiting for Jenkins to finish collecting data
[WARNING] LinkageError while performing UserRequest:hudson.maven.Maven3Builder@5b6c9356
java.lang.NoClassDefFoundError: com/google/common/collect/LinkedListMultimap$2
	at com.google.common.collect.LinkedListMultimap.createKeySet(LinkedListMultimap.java:684)
	at com.google.common.collect.AbstractMultimap.keySet(AbstractMultimap.java:150)
	at com.google.common.collect.LinkedListMultimap.keySet(LinkedListMultimap.java:101)
	at org.sonar.core.util.ContextException.format(ContextException.java:148)
	at org.sonar.core.util.ContextException.getMessage(ContextException.java:135)
	at org.apache.maven.exception.DefaultExceptionHandler.getMessage(DefaultExceptionHandler.java:241)
	at org.apache.maven.exception.DefaultExceptionHandler.handle(DefaultExceptionHandler.java:117)
	at org.apache.maven.exception.DefaultExceptionHandler.handleException(DefaultExceptionHandler.java:89)
	at hudson.maven.Maven3FailureLogger.logFailures(Maven3FailureLogger.java:41)
	at hudson.maven.Maven3Builder.call(Maven3Builder.java:168)
	at hudson.maven.Maven3Builder.call(Maven3Builder.java:70)
	at hudson.remoting.UserRequest.perform(UserRequest.java:207)
	at hudson.remoting.UserRequest.perform(UserRequest.java:53)
	at hudson.remoting.Request$2.run(Request.java:358)
	at hudson.remoting.InterceptingExecutorService$1.call(InterceptingExecutorService.java:72)
	at java.util.concurrent.FutureTask.run(FutureTask.java:266)
	at java.util.concurrent.ThreadPoolExecutor.runWorker(ThreadPoolExecutor.java:1149)
	at java.util.concurrent.ThreadPoolExecutor$Worker.run(ThreadPoolExecutor.java:624)
	at java.lang.Thread.run(Thread.java:748)
Caused by: java.lang.ClassNotFoundException: com.google.common.collect.LinkedListMultimap$2
	at java.net.URLClassLoader.findClass(URLClassLoader.java:381)
	at org.sonarsource.scanner.api.internal.IsolatedClassloader.loadClass(IsolatedClassloader.java:82)
	at java.lang.ClassLoader.loadClass(ClassLoader.java:357)
	... 19 more
Sending e-mails to: dev@pdfbox.apache.org
channel stopped
ERROR: Failed to parse POMs
java.io.IOException: Remote call on Channel to Maven [/home/jenkins/tools/java/latest1.8/bin/java,
-Xmx1g, -XX:MaxPermSize=300m, -cp, /home/jenkins/jenkins-slave/maven3-agent.jar:/home/jenkins/tools/maven/apache-maven-3.0.4/boot/plexus-classworlds-2.4.jar,
org.jvnet.hudson.maven3.agent.Maven3Main, /home/jenkins/tools/maven/apache-maven-3.0.4, /home/jenkins/jenkins-slave/slave.jar,
/home/jenkins/jenkins-slave/maven3-interceptor.jar, /home/jenkins/jenkins-slave/maven3-interceptor-commons.jar,
43135] failed
	at hudson.remoting.Channel.call(Channel.java:916)
	at hudson.maven.ProcessCache$MavenProcess.call(ProcessCache.java:161)
	at hudson.maven.MavenModuleSetBuild$MavenModuleSetBuildExecution.doRun(MavenModuleSetBuild.java:879)
	at hudson.model.AbstractBuild$AbstractBuildExecution.run(AbstractBuild.java:504)
	at hudson.model.Run.execute(Run.java:1724)
	at hudson.maven.MavenModuleSetBuild.run(MavenModuleSetBuild.java:543)
	at hudson.model.ResourceController.execute(ResourceController.java:97)
	at hudson.model.Executor.run(Executor.java:429)
Caused by: java.lang.NoClassDefFoundError: com/google/common/collect/LinkedListMultimap$2
	at com.google.common.collect.LinkedListMultimap.createKeySet(LinkedListMultimap.java:684)
	at com.google.common.collect.AbstractMultimap.keySet(AbstractMultimap.java:150)
	at com.google.common.collect.LinkedListMultimap.keySet(LinkedListMultimap.java:101)
	at org.sonar.core.util.ContextException.format(ContextException.java:148)
	at org.sonar.core.util.ContextException.getMessage(ContextException.java:135)
	at org.apache.maven.exception.DefaultExceptionHandler.getMessage(DefaultExceptionHandler.java:241)
	at org.apache.maven.exception.DefaultExceptionHandler.handle(DefaultExceptionHandler.java:117)
	at org.apache.maven.exception.DefaultExceptionHandler.handleException(DefaultExceptionHandler.java:89)
	at hudson.maven.Maven3FailureLogger.logFailures(Maven3FailureLogger.java:41)
	at hudson.maven.Maven3Builder.call(Maven3Builder.java:168)
	at hudson.maven.Maven3Builder.call(Maven3Builder.java:70)
	at hudson.remoting.UserRequest.perform(UserRequest.java:207)
	at hudson.remoting.UserRequest.perform(UserRequest.java:53)
	at hudson.remoting.Request$2.run(Request.java:358)
	at hudson.remoting.InterceptingExecutorService$1.call(InterceptingExecutorService.java:72)
	at java.util.concurrent.FutureTask.run(FutureTask.java:266)
	at java.util.concurrent.ThreadPoolExecutor.runWorker(ThreadPoolExecutor.java:1149)
	at java.util.concurrent.ThreadPoolExecutor$Worker.run(ThreadPoolExecutor.java:624)
	at java.lang.Thread.run(Thread.java:748)
	Suppressed: hudson.remoting.Channel$CallSiteStackTrace: Remote call to Channel to Maven [/home/jenkins/tools/java/latest1.8/bin/java,
-Xmx1g, -XX:MaxPermSize=300m, -cp, /home/jenkins/jenkins-slave/maven3-agent.jar:/home/jenkins/tools/maven/apache-maven-3.0.4/boot/plexus-classworlds-2.4.jar,
org.jvnet.hudson.maven3.agent.Maven3Main, /home/jenkins/tools/maven/apache-maven-3.0.4, /home/jenkins/jenkins-slave/slave.jar,
/home/jenkins/jenkins-slave/maven3-interceptor.jar, /home/jenkins/jenkins-slave/maven3-interceptor-commons.jar,
43135]
		at hudson.remoting.Channel.attachCallSiteStackTrace(Channel.java:1693)
		at hudson.remoting.UserResponse.retrieve(UserRequest.java:310)
		at hudson.remoting.Channel.call(Channel.java:908)
		at hudson.maven.ProcessCache$MavenProcess.call(ProcessCache.java:161)
		at hudson.maven.MavenModuleSetBuild$MavenModuleSetBuildExecution.doRun(MavenModuleSetBuild.java:879)
		at hudson.model.AbstractBuild$AbstractBuildExecution.run(AbstractBuild.java:504)
		at hudson.model.Run.execute(Run.java:1724)
		at hudson.maven.MavenModuleSetBuild.run(MavenModuleSetBuild.java:543)
		at hudson.model.ResourceController.execute(ResourceController.java:97)
		at hudson.model.Executor.run(Executor.java:429)
Caused by: java.lang.ClassNotFoundException: com.google.common.collect.LinkedListMultimap$2
	at java.net.URLClassLoader.findClass(URLClassLoader.java:381)
	at org.sonarsource.scanner.api.internal.IsolatedClassloader.loadClass(IsolatedClassloader.java:82)
	at java.lang.ClassLoader.loadClass(ClassLoader.java:357)
	... 19 more

---------------------------------------------------------------------
To unsubscribe, e-mail: dev-unsubscribe@pdfbox.apache.org
For additional commands, e-mail: dev-help@pdfbox.apache.org


Mime
View raw message