pdfbox-dev mailing list archives

Site index · List index
Message view « Date » · « Thread »
Top « Date » · « Thread »
From Apache Jenkins Server <jenk...@builds.apache.org>
Subject Build failed in Jenkins: PDFBox-2.0.x #817
Date Fri, 05 Jan 2018 19:23:40 GMT
See <https://builds.apache.org/job/PDFBox-2.0.x/817/display/redirect?page=changes>

Changes:

[tilman] PDFBOX-2852: improve javadoc

------------------------------------------
[...truncated 487.76 KB...]
[INFO] --- maven-download-plugin:1.1.0:wget (get-bavaria) @ preflight ---
[INFO] Got from cache: /home/jenkins/jenkins-slave/maven-repositories/0/.cache/maven-download-plugin/2009-04-03-Bavaria-pdfa.zip
[INFO] 
[INFO] --- maven-resources-plugin:2.6:testResources (default-testResources) @ preflight ---
[INFO] Using 'UTF-8' encoding to copy filtered resources.
[INFO] Copying 9 resources
[INFO] Copying 3 resources
[INFO] Copying 3 resources
[INFO] Copying 3 resources
[INFO] 
[INFO] --- maven-compiler-plugin:3.1:testCompile (default-testCompile) @ preflight ---
[INFO] Nothing to compile - all classes are up to date
[INFO] 
[INFO] --- maven-surefire-plugin:2.17:test (default-test) @ preflight ---
[INFO] Tests are skipped.
[INFO] 
[INFO] --- animal-sniffer-maven-plugin:1.14:check (check-java-version) @ preflight ---
[INFO] Checking unresolved references to org.codehaus.mojo.signature:java16:1.0
[INFO] 
[INFO] --- maven-surefire-plugin:2.17:test (surefire-test) @ preflight ---
[INFO] Skipping execution of surefire because it has already been run for this configuration
[JENKINS] Recording test results
[INFO] 
[INFO] --- maven-site-plugin:3.4:attach-descriptor (attach-descriptor) @ preflight ---
[WARNING] Failed to getClass for org.apache.maven.plugin.source.SourceJarMojo
[INFO] 
[INFO] --- maven-source-plugin:2.3:jar (attach-sources) @ preflight ---
[INFO] Building jar: <https://builds.apache.org/job/PDFBox-2.0.x/ws/2.0/preflight/target/preflight-2.0.9-SNAPSHOT-sources.jar>
[WARNING] Failed to getClass for org.apache.felix.bundleplugin.BundlePlugin
[INFO] 
[INFO] --- maven-bundle-plugin:2.5.4:bundle (default-bundle) @ preflight ---
[INFO] 
[INFO] --- maven-site-plugin:3.4:attach-descriptor (attach-descriptor) @ preflight ---
[WARNING] Failed to getClass for org.apache.maven.plugin.source.SourceJarMojo
[INFO] 
[INFO] --- maven-source-plugin:2.3:jar (attach-sources) @ preflight ---
[INFO] Building jar: <https://builds.apache.org/job/PDFBox-2.0.x/ws/2.0/preflight/target/preflight-2.0.9-SNAPSHOT-sources.jar>
[INFO] 
[INFO] --- maven-surefire-plugin:2.17:test (surefire-itest) @ preflight ---
[INFO] Skipping execution of surefire because it has already been run for this configuration
[JENKINS] Recording test results
[INFO] 
[INFO] --- apache-rat-plugin:0.11:check (default) @ preflight ---
[INFO] 51 implicit excludes (use -debug for more details).
[INFO] Exclude: src/main/resources/project.version
[INFO] Exclude: release.properties
[INFO] 149 resources included (use -debug for more details)
Warning:  org.apache.xerces.jaxp.SAXParserImpl$JAXPSAXParser: Property 'http://www.oracle.com/xml/jaxp/properties/entityExpansionLimit'
is not recognized.
Compiler warnings:
  WARNING:  'org.apache.xerces.jaxp.SAXParserImpl: Property 'http://javax.xml.XMLConstants/property/accessExternalDTD'
is not recognized.'
Warning:  org.apache.xerces.parsers.SAXParser: Feature 'http://javax.xml.XMLConstants/feature/secure-processing'
is not recognized.
Warning:  org.apache.xerces.parsers.SAXParser: Property 'http://javax.xml.XMLConstants/property/accessExternalDTD'
is not recognized.
Warning:  org.apache.xerces.parsers.SAXParser: Property 'http://www.oracle.com/xml/jaxp/properties/entityExpansionLimit'
is not recognized.
[INFO] Rat check: Summary of files. Unapproved: 0 unknown: 0 generated: 0 approved: 139 licence.
[INFO] 
[INFO] --- dependency-check-maven:3.0.2:check (default) @ preflight ---
[INFO] 
[INFO] --- maven-install-plugin:2.5.2:install (default-install) @ preflight ---
[INFO] Installing <https://builds.apache.org/job/PDFBox-2.0.x/ws/2.0/preflight/target/preflight-2.0.9-SNAPSHOT.jar>
to /home/jenkins/jenkins-slave/maven-repositories/0/org/apache/pdfbox/preflight/2.0.9-SNAPSHOT/preflight-2.0.9-SNAPSHOT.jar
[INFO] Installing <https://builds.apache.org/job/PDFBox-2.0.x/ws/2.0/preflight/pom.xml>
to /home/jenkins/jenkins-slave/maven-repositories/0/org/apache/pdfbox/preflight/2.0.9-SNAPSHOT/preflight-2.0.9-SNAPSHOT.pom
[INFO] Installing <https://builds.apache.org/job/PDFBox-2.0.x/ws/2.0/preflight/target/preflight-2.0.9-SNAPSHOT-sources.jar>
to /home/jenkins/jenkins-slave/maven-repositories/0/org/apache/pdfbox/preflight/2.0.9-SNAPSHOT/preflight-2.0.9-SNAPSHOT-sources.jar
[INFO] Installing <https://builds.apache.org/job/PDFBox-2.0.x/ws/2.0/preflight/target/preflight-2.0.9-SNAPSHOT-sources.jar>
to /home/jenkins/jenkins-slave/maven-repositories/0/org/apache/pdfbox/preflight/2.0.9-SNAPSHOT/preflight-2.0.9-SNAPSHOT-sources.jar
[INFO] 
[INFO] --- maven-remote-resources-plugin:1.5:process (default) @ preflight ---
[INFO] 
[INFO] --- maven-resources-plugin:2.6:resources (default-resources) @ preflight ---
[INFO] Using 'UTF-8' encoding to copy filtered resources.
[INFO] Copying 0 resource
[INFO] Copying 3 resources
[INFO] Copying 3 resources
[INFO] Copying 3 resources
[INFO] 
[INFO] --- maven-compiler-plugin:3.1:compile (default-compile) @ preflight ---
[INFO] Nothing to compile - all classes are up to date
[INFO] 
[INFO] --- maven-download-plugin:1.1.0:wget (get-isartor) @ preflight ---
[INFO] Got from cache: /home/jenkins/jenkins-slave/maven-repositories/0/.cache/maven-download-plugin/isartor-pdfa-2008-08-13.zip
[INFO] 
[INFO] --- maven-download-plugin:1.1.0:wget (get-bavaria) @ preflight ---
[INFO] Got from cache: /home/jenkins/jenkins-slave/maven-repositories/0/.cache/maven-download-plugin/2009-04-03-Bavaria-pdfa.zip
[INFO] 
[INFO] --- maven-resources-plugin:2.6:testResources (default-testResources) @ preflight ---
[INFO] Using 'UTF-8' encoding to copy filtered resources.
[INFO] Copying 9 resources
[INFO] Copying 3 resources
[INFO] Copying 3 resources
[INFO] Copying 3 resources
[INFO] 
[INFO] --- maven-compiler-plugin:3.1:testCompile (default-testCompile) @ preflight ---
[INFO] Nothing to compile - all classes are up to date
[INFO] 
[INFO] --- maven-surefire-plugin:2.17:test (default-test) @ preflight ---
[INFO] Tests are skipped.
[INFO] 
[INFO] --- animal-sniffer-maven-plugin:1.14:check (check-java-version) @ preflight ---
[INFO] Checking unresolved references to org.codehaus.mojo.signature:java16:1.0
[INFO] 
[INFO] --- maven-surefire-plugin:2.17:test (surefire-test) @ preflight ---
[INFO] Skipping execution of surefire because it has already been run for this configuration
[JENKINS] Recording test results
[INFO] 
[INFO] --- maven-remote-resources-plugin:1.5:process (default) @ preflight ---
[INFO] 
[INFO] --- maven-resources-plugin:2.6:resources (default-resources) @ preflight ---
[INFO] Using 'UTF-8' encoding to copy filtered resources.
[INFO] Copying 0 resource
[INFO] Copying 3 resources
[INFO] Copying 3 resources
[INFO] Copying 3 resources
[INFO] Copying 3 resources
[INFO] 
[INFO] --- maven-compiler-plugin:3.1:compile (default-compile) @ preflight ---
[INFO] Nothing to compile - all classes are up to date
[INFO] 
[INFO] --- maven-download-plugin:1.1.0:wget (get-isartor) @ preflight ---
[INFO] Got from cache: /home/jenkins/jenkins-slave/maven-repositories/0/.cache/maven-download-plugin/isartor-pdfa-2008-08-13.zip
[INFO] 
[INFO] --- maven-download-plugin:1.1.0:wget (get-bavaria) @ preflight ---
[INFO] Got from cache: /home/jenkins/jenkins-slave/maven-repositories/0/.cache/maven-download-plugin/2009-04-03-Bavaria-pdfa.zip
[INFO] 
[INFO] --- maven-resources-plugin:2.6:testResources (default-testResources) @ preflight ---
[INFO] Using 'UTF-8' encoding to copy filtered resources.
[INFO] Copying 9 resources
[INFO] Copying 3 resources
[INFO] Copying 3 resources
[INFO] Copying 3 resources
[INFO] Copying 3 resources
[INFO] 
[INFO] --- maven-compiler-plugin:3.1:testCompile (default-testCompile) @ preflight ---
[INFO] Nothing to compile - all classes are up to date
[INFO] 
[INFO] --- maven-surefire-plugin:2.17:test (default-test) @ preflight ---
[INFO] Tests are skipped.
[INFO] 
[INFO] --- animal-sniffer-maven-plugin:1.14:check (check-java-version) @ preflight ---
[INFO] Checking unresolved references to org.codehaus.mojo.signature:java16:1.0
[INFO] 
[INFO] --- maven-surefire-plugin:2.17:test (surefire-test) @ preflight ---
[INFO] Skipping execution of surefire because it has already been run for this configuration
[JENKINS] Recording test results
[INFO] 
[INFO] --- maven-site-plugin:3.4:attach-descriptor (attach-descriptor) @ preflight ---
[WARNING] Failed to getClass for org.apache.maven.plugin.source.SourceJarMojo
[INFO] 
[INFO] --- maven-source-plugin:2.3:jar (attach-sources) @ preflight ---
[INFO] Building jar: <https://builds.apache.org/job/PDFBox-2.0.x/ws/2.0/preflight/target/preflight-2.0.9-SNAPSHOT-sources.jar>
[WARNING] Failed to getClass for org.apache.felix.bundleplugin.BundlePlugin
[INFO] 
[INFO] --- maven-bundle-plugin:2.5.4:bundle (default-bundle) @ preflight ---
[INFO] 
[INFO] --- maven-site-plugin:3.4:attach-descriptor (attach-descriptor) @ preflight ---
[WARNING] Failed to getClass for org.apache.maven.plugin.source.SourceJarMojo
[INFO] 
[INFO] --- maven-source-plugin:2.3:jar (attach-sources) @ preflight ---
[INFO] Building jar: <https://builds.apache.org/job/PDFBox-2.0.x/ws/2.0/preflight/target/preflight-2.0.9-SNAPSHOT-sources.jar>
[INFO] 
[INFO] --- maven-surefire-plugin:2.17:test (surefire-itest) @ preflight ---
[INFO] Skipping execution of surefire because it has already been run for this configuration
[JENKINS] Recording test results
[INFO] 
[INFO] --- apache-rat-plugin:0.11:check (default) @ preflight ---
[INFO] 51 implicit excludes (use -debug for more details).
[INFO] Exclude: src/main/resources/project.version
[INFO] Exclude: release.properties
[INFO] 149 resources included (use -debug for more details)
Warning:  org.apache.xerces.jaxp.SAXParserImpl$JAXPSAXParser: Property 'http://www.oracle.com/xml/jaxp/properties/entityExpansionLimit'
is not recognized.
Compiler warnings:
  WARNING:  'org.apache.xerces.jaxp.SAXParserImpl: Property 'http://javax.xml.XMLConstants/property/accessExternalDTD'
is not recognized.'
Warning:  org.apache.xerces.parsers.SAXParser: Feature 'http://javax.xml.XMLConstants/feature/secure-processing'
is not recognized.
Warning:  org.apache.xerces.parsers.SAXParser: Property 'http://javax.xml.XMLConstants/property/accessExternalDTD'
is not recognized.
Warning:  org.apache.xerces.parsers.SAXParser: Property 'http://www.oracle.com/xml/jaxp/properties/entityExpansionLimit'
is not recognized.
[INFO] Rat check: Summary of files. Unapproved: 0 unknown: 0 generated: 0 approved: 139 licence.
[INFO] 
[INFO] --- dependency-check-maven:3.0.2:check (default) @ preflight ---
[INFO] 
[INFO] --- maven-install-plugin:2.5.2:install (default-install) @ preflight ---
[INFO] Installing <https://builds.apache.org/job/PDFBox-2.0.x/ws/2.0/preflight/target/preflight-2.0.9-SNAPSHOT.jar>
to /home/jenkins/jenkins-slave/maven-repositories/0/org/apache/pdfbox/preflight/2.0.9-SNAPSHOT/preflight-2.0.9-SNAPSHOT.jar
[INFO] Installing <https://builds.apache.org/job/PDFBox-2.0.x/ws/2.0/preflight/pom.xml>
to /home/jenkins/jenkins-slave/maven-repositories/0/org/apache/pdfbox/preflight/2.0.9-SNAPSHOT/preflight-2.0.9-SNAPSHOT.pom
[INFO] Installing <https://builds.apache.org/job/PDFBox-2.0.x/ws/2.0/preflight/target/preflight-2.0.9-SNAPSHOT-sources.jar>
to /home/jenkins/jenkins-slave/maven-repositories/0/org/apache/pdfbox/preflight/2.0.9-SNAPSHOT/preflight-2.0.9-SNAPSHOT-sources.jar
[INFO] Installing <https://builds.apache.org/job/PDFBox-2.0.x/ws/2.0/preflight/target/preflight-2.0.9-SNAPSHOT-sources.jar>
to /home/jenkins/jenkins-slave/maven-repositories/0/org/apache/pdfbox/preflight/2.0.9-SNAPSHOT/preflight-2.0.9-SNAPSHOT-sources.jar
[INFO] Installing <https://builds.apache.org/job/PDFBox-2.0.x/ws/2.0/preflight/target/preflight-2.0.9-SNAPSHOT-sources.jar>
to /home/jenkins/jenkins-slave/maven-repositories/0/org/apache/pdfbox/preflight/2.0.9-SNAPSHOT/preflight-2.0.9-SNAPSHOT-sources.jar
[WARNING] Failed to getClass for org.apache.felix.obrplugin.ObrInstall
[INFO] 
[INFO] --- maven-bundle-plugin:2.5.4:install (default-install) @ preflight ---
[INFO] Installing org/apache/pdfbox/preflight/2.0.9-SNAPSHOT/preflight-2.0.9-20180105.192155-115.jar
[INFO] Writing OBR metadata
[INFO] 
[INFO] --- maven-deploy-plugin:2.8.2:deploy (default-deploy) @ preflight ---
Downloading: https://repository.apache.org/content/repositories/snapshots/org/apache/pdfbox/preflight/2.0.9-SNAPSHOT/maven-metadata.xml
[WARNING] Could not transfer metadata org.apache.pdfbox:preflight:2.0.9-SNAPSHOT/maven-metadata.xml
from/to apache.snapshots.https (https://repository.apache.org/content/repositories/snapshots):
repository.apache.org: unknown error
[WARNING] Failed to getClass for org.apache.felix.obrplugin.ObrDeploy
[INFO] ------------------------------------------------------------------------
[INFO] Reactor Summary:
[INFO] 
[INFO] PDFBox parent ..................................... SUCCESS [33:03.460s]
[INFO] Apache FontBox .................................... SUCCESS [2:25.839s]
[INFO] Apache XmpBox ..................................... SUCCESS [1:42.005s]
[INFO] Apache PDFBox ..................................... SUCCESS [4:32.181s]
[INFO] Apache Preflight .................................. FAILURE [4:48.778s]
[INFO] Apache Preflight application ...................... SKIPPED
[INFO] Apache PDFBox Debugger ............................ SKIPPED
[INFO] Apache PDFBox tools ............................... SKIPPED
[INFO] Apache PDFBox application ......................... SKIPPED
[INFO] Apache PDFBox Debugger application ................ SKIPPED
[INFO] Apache PDFBox examples ............................ SKIPPED
[INFO] PDFBox reactor .................................... SKIPPED
[INFO] ------------------------------------------------------------------------
[INFO] BUILD FAILURE
[INFO] ------------------------------------------------------------------------
[INFO] Total time: 46:47.074s
[INFO] Finished at: Fri Jan 05 19:23:09 UTC 2018
[INFO] Final Memory: 68M/685M
[INFO] ------------------------------------------------------------------------
Waiting for Jenkins to finish collecting data
[ERROR] Failed to execute goal org.apache.maven.plugins:maven-deploy-plugin:2.8.2:deploy (default-deploy)
on project preflight: Failed to retrieve remote metadata org.apache.pdfbox:preflight:2.0.9-SNAPSHOT/maven-metadata.xml:
Could not transfer metadata org.apache.pdfbox:preflight:2.0.9-SNAPSHOT/maven-metadata.xml
from/to apache.snapshots.https (https://repository.apache.org/content/repositories/snapshots):
repository.apache.org: unknown error: Unknown host repository.apache.org: unknown error ->
[Help 1]
[ERROR] 
[ERROR] To see the full stack trace of the errors, re-run Maven with the -e switch.
[ERROR] Re-run Maven using the -X switch to enable full debug logging.
[ERROR] 
[ERROR] For more information about the errors and possible solutions, please read the following
articles:
[ERROR] [Help 1] http://cwiki.apache.org/confluence/display/MAVEN/MojoExecutionException
[ERROR] 
[ERROR] After correcting the problems, you can resume the build with the command
[ERROR]   mvn <goals> -rf :preflight
[JENKINS] Archiving <https://builds.apache.org/job/PDFBox-2.0.x/ws/2.0/xmpbox/pom.xml>
to org.apache.pdfbox/xmpbox/2.0.9-SNAPSHOT/xmpbox-2.0.9-SNAPSHOT.pom
[JENKINS] Archiving <https://builds.apache.org/job/PDFBox-2.0.x/ws/2.0/xmpbox/target/xmpbox-2.0.9-SNAPSHOT.jar>
to org.apache.pdfbox/xmpbox/2.0.9-20180105.191247-115/xmpbox-2.0.9-20180105.191247-115.jar
[JENKINS] Archiving <https://builds.apache.org/job/PDFBox-2.0.x/ws/2.0/xmpbox/target/xmpbox-2.0.9-SNAPSHOT-sources.jar>
to org.apache.pdfbox/xmpbox/2.0.9-20180105.191247-115/xmpbox-2.0.9-20180105.191247-115-sources.jar
[JENKINS] Archiving <https://builds.apache.org/job/PDFBox-2.0.x/ws/2.0/tools/pom.xml>
to org.apache.pdfbox/pdfbox-tools/2.0.9-SNAPSHOT/pdfbox-tools-2.0.9-SNAPSHOT.pom
[JENKINS] Archiving <https://builds.apache.org/job/PDFBox-2.0.x/ws/2.0/debugger/pom.xml>
to org.apache.pdfbox/pdfbox-debugger/2.0.9-SNAPSHOT/pdfbox-debugger-2.0.9-SNAPSHOT.pom
[JENKINS] Archiving <https://builds.apache.org/job/PDFBox-2.0.x/ws/2.0/preflight-app/pom.xml>
to org.apache.pdfbox/preflight-app/2.0.9-SNAPSHOT/preflight-app-2.0.9-SNAPSHOT.pom
[JENKINS] Archiving <https://builds.apache.org/job/PDFBox-2.0.x/ws/2.0/app/pom.xml>
to org.apache.pdfbox/pdfbox-app/2.0.9-SNAPSHOT/pdfbox-app-2.0.9-SNAPSHOT.pom
[JENKINS] Archiving <https://builds.apache.org/job/PDFBox-2.0.x/ws/2.0/examples/pom.xml>
to org.apache.pdfbox/pdfbox-examples/2.0.9-SNAPSHOT/pdfbox-examples-2.0.9-SNAPSHOT.pom
[JENKINS] Archiving <https://builds.apache.org/job/PDFBox-2.0.x/ws/2.0/preflight/pom.xml>
to org.apache.pdfbox/preflight/2.0.9-SNAPSHOT/preflight-2.0.9-SNAPSHOT.pom
[JENKINS] Archiving <https://builds.apache.org/job/PDFBox-2.0.x/ws/2.0/preflight/target/preflight-2.0.9-SNAPSHOT.jar>
to org.apache.pdfbox/preflight/2.0.9-20180105.192155-115/preflight-2.0.9-20180105.192155-115.jar
[JENKINS] Archiving <https://builds.apache.org/job/PDFBox-2.0.x/ws/2.0/preflight/target/preflight-2.0.9-SNAPSHOT-sources.jar>
to org.apache.pdfbox/preflight/2.0.9-20180105.192155-115/preflight-2.0.9-20180105.192155-115-sources.jar
[JENKINS] Archiving <https://builds.apache.org/job/PDFBox-2.0.x/ws/2.0/pom.xml> to org.apache.pdfbox/pdfbox-reactor/2.0.9-SNAPSHOT/pdfbox-reactor-2.0.9-SNAPSHOT.pom
[JENKINS] Archiving <https://builds.apache.org/job/PDFBox-2.0.x/ws/2.0/parent/pom.xml>
to org.apache.pdfbox/pdfbox-parent/2.0.9-SNAPSHOT/pdfbox-parent-2.0.9-SNAPSHOT.pom
[JENKINS] Archiving <https://builds.apache.org/job/PDFBox-2.0.x/ws/2.0/pdfbox/pom.xml>
to org.apache.pdfbox/pdfbox/2.0.9-SNAPSHOT/pdfbox-2.0.9-SNAPSHOT.pom
[JENKINS] Archiving <https://builds.apache.org/job/PDFBox-2.0.x/ws/2.0/pdfbox/target/pdfbox-2.0.9-SNAPSHOT.jar>
to org.apache.pdfbox/pdfbox/2.0.9-20180105.191638-115/pdfbox-2.0.9-20180105.191638-115.jar
[JENKINS] Archiving <https://builds.apache.org/job/PDFBox-2.0.x/ws/2.0/pdfbox/target/pdfbox-2.0.9-SNAPSHOT-sources.jar>
to org.apache.pdfbox/pdfbox/2.0.9-20180105.191638-115/pdfbox-2.0.9-20180105.191638-115-sources.jar
[Fast Archiver] Compressed 4.65 MB of artifacts by 37.7% relative to #816
[JENKINS] Archiving <https://builds.apache.org/job/PDFBox-2.0.x/ws/2.0/debugger-app/pom.xml>
to org.apache.pdfbox/debugger-app/2.0.9-SNAPSHOT/debugger-app-2.0.9-SNAPSHOT.pom
[JENKINS] Archiving <https://builds.apache.org/job/PDFBox-2.0.x/ws/2.0/fontbox/pom.xml>
to org.apache.pdfbox/fontbox/2.0.9-SNAPSHOT/fontbox-2.0.9-SNAPSHOT.pom
[JENKINS] Archiving <https://builds.apache.org/job/PDFBox-2.0.x/ws/2.0/fontbox/target/fontbox-2.0.9-SNAPSHOT.jar>
to org.apache.pdfbox/fontbox/2.0.9-20180105.191058-119/fontbox-2.0.9-20180105.191058-119.jar
[JENKINS] Archiving <https://builds.apache.org/job/PDFBox-2.0.x/ws/2.0/fontbox/target/fontbox-2.0.9-SNAPSHOT-sources.jar>
to org.apache.pdfbox/fontbox/2.0.9-20180105.191058-119/fontbox-2.0.9-20180105.191058-119-sources.jar
[Fast Archiver] Compressed 2.79 MB of artifacts by 42.6% relative to #816
Sending e-mails to: dev@pdfbox.apache.org
channel stopped
Archiving artifacts

---------------------------------------------------------------------
To unsubscribe, e-mail: dev-unsubscribe@pdfbox.apache.org
For additional commands, e-mail: dev-help@pdfbox.apache.org


Mime
View raw message