pdfbox-dev mailing list archives

Site index · List index
Message view « Date » · « Thread »
Top « Date » · « Thread »
From Apache Jenkins Server <jenk...@builds.apache.org>
Subject Build failed in Jenkins: PDFBox-1.8.x #662
Date Sat, 06 Jan 2018 12:35:14 GMT
See <https://builds.apache.org/job/PDFBox-1.8.x/662/display/redirect?page=changes>

Changes:

[tilman] PDFBOX-2852: use latest version of owasp maven plugin

------------------------------------------
Started by user tilman
[EnvInject] - Loading node environment variables.
Building remotely on H31 (ubuntu xenial) in workspace <https://builds.apache.org/job/PDFBox-1.8.x/ws/>
Cleaning up <https://builds.apache.org/job/PDFBox-1.8.x/ws/1.8>
Updating http://svn.apache.org/repos/asf/pdfbox/branches/1.8 at revision '2018-01-06T12:33:20.838
+0000'
U         parent/pom.xml
At revision 1820392

Parsing POMs
Modules changed, recalculating dependency graph
Established TCP socket on 39657
maven3-agent.jar already up to date
maven3-interceptor.jar already up to date
maven3-interceptor-commons.jar already up to date
[1.8] $ /home/jenkins/tools/java/jdk1.8.0_66-unlimited-security/bin/java -Xmx1g -XX:MaxPermSize=300m
-cp /home/jenkins/jenkins-slave/maven3-agent.jar:/home/jenkins/tools/maven/apache-maven-3.0.4/boot/plexus-classworlds-2.4.jar
org.jvnet.hudson.maven3.agent.Maven3Main /home/jenkins/tools/maven/apache-maven-3.0.4 /home/jenkins/jenkins-slave/slave.jar
/home/jenkins/jenkins-slave/maven3-interceptor.jar /home/jenkins/jenkins-slave/maven3-interceptor-commons.jar
39657
Java HotSpot(TM) 64-Bit Server VM warning: ignoring option MaxPermSize=300m; support was removed
in 8.0
<===[JENKINS REMOTING CAPACITY]===>   channel started
Executing Maven:  -B -f <https://builds.apache.org/job/PDFBox-1.8.x/ws/1.8/pom.xml>
-Dmaven.repo.local=/home/jenkins/jenkins-slave/maven-repositories/1 clean deploy -Ppedantic
[INFO] Scanning for projects...
[INFO] ------------------------------------------------------------------------
[INFO] Reactor Build Order:
[INFO] 
[INFO] PDFBox parent
[INFO] Apache FontBox
[INFO] Apache JempBox
[INFO] Apache XmpBox
[INFO] Apache PDFBox
[INFO] Apache Preflight
[INFO] Apache Preflight application
[INFO] Apache PDFBox for Lucene
[INFO] Apache PDFBox for Ant
[INFO] Apache PDFBox webapp
[INFO] Apache PDFBox application
[INFO] Apache PDFBox examples
[INFO] PDFBox reactor
[INFO]                                                                         
[INFO] ------------------------------------------------------------------------
[INFO] Building PDFBox parent 1.8.14-SNAPSHOT
[INFO] ------------------------------------------------------------------------
Downloading: http://repo.maven.apache.org/maven2/org/owasp/dependency-check-maven/3.1.0/dependency-check-maven-3.1.0.pom
Downloaded: http://repo.maven.apache.org/maven2/org/owasp/dependency-check-maven/3.1.0/dependency-check-maven-3.1.0.pom
(10 KB at 29.6 KB/sec)
Downloading: http://repo.maven.apache.org/maven2/org/owasp/dependency-check-parent/3.1.0/dependency-check-parent-3.1.0.pom
Downloaded: http://repo.maven.apache.org/maven2/org/owasp/dependency-check-parent/3.1.0/dependency-check-parent-3.1.0.pom
(41 KB at 1314.5 KB/sec)
Downloading: http://repo.maven.apache.org/maven2/org/owasp/dependency-check-maven/3.1.0/dependency-check-maven-3.1.0.jar
Downloaded: http://repo.maven.apache.org/maven2/org/owasp/dependency-check-maven/3.1.0/dependency-check-maven-3.1.0.jar
(51 KB at 1926.3 KB/sec)
[INFO] 
[INFO] --- maven-clean-plugin:2.5:clean (default-clean) @ pdfbox-parent ---
[INFO] 
[INFO] --- maven-remote-resources-plugin:1.5:process (default) @ pdfbox-parent ---
[INFO] 
[INFO] --- animal-sniffer-maven-plugin:1.14:check (check-java-compatibility) @ pdfbox-parent
---
[INFO] Checking unresolved references to org.codehaus.mojo.signature:java15:1.0
[INFO] 
[INFO] --- maven-site-plugin:3.4:attach-descriptor (attach-descriptor) @ pdfbox-parent ---
[INFO] 
[INFO] --- apache-rat-plugin:0.11:check (default) @ pdfbox-parent ---
[INFO] 51 implicit excludes (use -debug for more details).
[INFO] Exclude: release.properties
[INFO] 1 resources included (use -debug for more details)
Warning:  org.apache.xerces.jaxp.SAXParserImpl$JAXPSAXParser: Property 'http://www.oracle.com/xml/jaxp/properties/entityExpansionLimit'
is not recognized.
Compiler warnings:
  WARNING:  'org.apache.xerces.jaxp.SAXParserImpl: Property 'http://javax.xml.XMLConstants/property/accessExternalDTD'
is not recognized.'
Warning:  org.apache.xerces.parsers.SAXParser: Feature 'http://javax.xml.XMLConstants/feature/secure-processing'
is not recognized.
Warning:  org.apache.xerces.parsers.SAXParser: Property 'http://javax.xml.XMLConstants/property/accessExternalDTD'
is not recognized.
Warning:  org.apache.xerces.parsers.SAXParser: Property 'http://www.oracle.com/xml/jaxp/properties/entityExpansionLimit'
is not recognized.
[INFO] Rat check: Summary of files. Unapproved: 0 unknown: 0 generated: 0 approved: 1 licence.
[INFO] 
[INFO] --- dependency-check-maven:3.1.0:check (default) @ pdfbox-parent ---
Downloading: http://repo.maven.apache.org/maven2/org/owasp/dependency-check-core/3.1.0/dependency-check-core-3.1.0.pom
Downloaded: http://repo.maven.apache.org/maven2/org/owasp/dependency-check-core/3.1.0/dependency-check-core-3.1.0.pom
(26 KB at 1044.2 KB/sec)
Downloading: http://repo.maven.apache.org/maven2/com/vdurmont/semver4j/2.1.0/semver4j-2.1.0.pom
Downloaded: http://repo.maven.apache.org/maven2/com/vdurmont/semver4j/2.1.0/semver4j-2.1.0.pom
(6 KB at 328.2 KB/sec)
Downloading: http://repo.maven.apache.org/maven2/org/owasp/dependency-check-utils/3.1.0/dependency-check-utils-3.1.0.pom
Downloaded: http://repo.maven.apache.org/maven2/org/owasp/dependency-check-utils/3.1.0/dependency-check-utils-3.1.0.pom
(5 KB at 229.2 KB/sec)
Downloading: http://repo.maven.apache.org/maven2/org/apache/lucene/lucene-core/5.5.5/lucene-core-5.5.5.pom
Downloaded: http://repo.maven.apache.org/maven2/org/apache/lucene/lucene-core/5.5.5/lucene-core-5.5.5.pom
(3 KB at 125.0 KB/sec)
Downloading: http://repo.maven.apache.org/maven2/org/apache/lucene/lucene-parent/5.5.5/lucene-parent-5.5.5.pom
Downloaded: http://repo.maven.apache.org/maven2/org/apache/lucene/lucene-parent/5.5.5/lucene-parent-5.5.5.pom
(5 KB at 277.9 KB/sec)
Downloading: http://repo.maven.apache.org/maven2/org/apache/lucene/lucene-solr-grandparent/5.5.5/lucene-solr-grandparent-5.5.5.pom
Downloaded: http://repo.maven.apache.org/maven2/org/apache/lucene/lucene-solr-grandparent/5.5.5/lucene-solr-grandparent-5.5.5.pom
(387 KB at 5607.7 KB/sec)
Downloading: http://repo.maven.apache.org/maven2/org/apache/lucene/lucene-analyzers-common/5.5.5/lucene-analyzers-common-5.5.5.pom
Downloaded: http://repo.maven.apache.org/maven2/org/apache/lucene/lucene-analyzers-common/5.5.5/lucene-analyzers-common-5.5.5.pom
(3 KB at 162.1 KB/sec)
Downloading: http://repo.maven.apache.org/maven2/org/apache/lucene/lucene-queryparser/5.5.5/lucene-queryparser-5.5.5.pom
Downloaded: http://repo.maven.apache.org/maven2/org/apache/lucene/lucene-queryparser/5.5.5/lucene-queryparser-5.5.5.pom
(4 KB at 192.2 KB/sec)
Downloading: http://repo.maven.apache.org/maven2/org/apache/lucene/lucene-queries/5.5.5/lucene-queries-5.5.5.pom
Downloaded: http://repo.maven.apache.org/maven2/org/apache/lucene/lucene-queries/5.5.5/lucene-queries-5.5.5.pom
(3 KB at 153.0 KB/sec)
Downloading: http://repo.maven.apache.org/maven2/org/apache/lucene/lucene-sandbox/5.5.5/lucene-sandbox-5.5.5.pom
Downloaded: http://repo.maven.apache.org/maven2/org/apache/lucene/lucene-sandbox/5.5.5/lucene-sandbox-5.5.5.pom
(4 KB at 195.8 KB/sec)
Downloading: http://repo.maven.apache.org/maven2/org/jsoup/jsoup/1.11.2/jsoup-1.11.2.pom
Downloaded: http://repo.maven.apache.org/maven2/org/jsoup/jsoup/1.11.2/jsoup-1.11.2.pom (8
KB at 470.5 KB/sec)
Downloading: http://repo.maven.apache.org/maven2/com/sun/mail/mailapi/1.6.0/mailapi-1.6.0.pom
Downloaded: http://repo.maven.apache.org/maven2/com/sun/mail/mailapi/1.6.0/mailapi-1.6.0.pom
(5 KB at 271.0 KB/sec)
Downloading: http://repo.maven.apache.org/maven2/org/owasp/dependency-check-core/3.1.0/dependency-check-core-3.1.0.jar
Downloading: http://repo.maven.apache.org/maven2/com/vdurmont/semver4j/2.1.0/semver4j-2.1.0.jar
Downloading: http://repo.maven.apache.org/maven2/org/apache/lucene/lucene-core/5.5.5/lucene-core-5.5.5.jar
Downloading: http://repo.maven.apache.org/maven2/org/apache/lucene/lucene-analyzers-common/5.5.5/lucene-analyzers-common-5.5.5.jar
Downloading: http://repo.maven.apache.org/maven2/org/apache/lucene/lucene-queryparser/5.5.5/lucene-queryparser-5.5.5.jar
Downloaded: http://repo.maven.apache.org/maven2/com/vdurmont/semver4j/2.1.0/semver4j-2.1.0.jar
(26 KB at 737.4 KB/sec)
Downloading: http://repo.maven.apache.org/maven2/org/apache/lucene/lucene-queries/5.5.5/lucene-queries-5.5.5.jar
Downloaded: http://repo.maven.apache.org/maven2/org/apache/lucene/lucene-queries/5.5.5/lucene-queries-5.5.5.jar
(246 KB at 8465.8 KB/sec)
Downloading: http://repo.maven.apache.org/maven2/org/apache/lucene/lucene-sandbox/5.5.5/lucene-sandbox-5.5.5.jar
Downloaded: http://repo.maven.apache.org/maven2/org/apache/lucene/lucene-queryparser/5.5.5/lucene-queryparser-5.5.5.jar
(394 KB at 6061.0 KB/sec)
Downloading: http://repo.maven.apache.org/maven2/org/jsoup/jsoup/1.11.2/jsoup-1.11.2.jar
Downloaded: http://repo.maven.apache.org/maven2/org/owasp/dependency-check-core/3.1.0/dependency-check-core-3.1.0.jar
(585 KB at 7586.3 KB/sec)
Downloading: http://repo.maven.apache.org/maven2/com/sun/mail/mailapi/1.6.0/mailapi-1.6.0.jar
Downloaded: http://repo.maven.apache.org/maven2/org/apache/lucene/lucene-sandbox/5.5.5/lucene-sandbox-5.5.5.jar
(227 KB at 9072.0 KB/sec)
Downloading: http://repo.maven.apache.org/maven2/org/owasp/dependency-check-utils/3.1.0/dependency-check-utils-3.1.0.jar
Downloaded: http://repo.maven.apache.org/maven2/org/owasp/dependency-check-utils/3.1.0/dependency-check-utils-3.1.0.jar
(35 KB at 2026.3 KB/sec)
Downloaded: http://repo.maven.apache.org/maven2/org/jsoup/jsoup/1.11.2/jsoup-1.11.2.jar (384
KB at 9345.3 KB/sec)
Downloaded: http://repo.maven.apache.org/maven2/com/sun/mail/mailapi/1.6.0/mailapi-1.6.0.jar
(351 KB at 8998.5 KB/sec)
Downloaded: http://repo.maven.apache.org/maven2/org/apache/lucene/lucene-analyzers-common/5.5.5/lucene-analyzers-common-5.5.5.jar
(1540 KB at 9997.7 KB/sec)
Downloaded: http://repo.maven.apache.org/maven2/org/apache/lucene/lucene-core/5.5.5/lucene-core-5.5.5.jar
(2315 KB at 13536.2 KB/sec)
SLF4J: Failed to load class "org.slf4j.impl.StaticLoggerBinder".
SLF4J: Defaulting to no-operation (NOP) logger implementation
SLF4J: See http://www.slf4j.org/codes.html#StaticLoggerBinder for further details.
[INFO] ------------------------------------------------------------------------
[INFO] Reactor Summary:
[INFO] 
[INFO] PDFBox parent ..................................... FAILURE [10.028s]
[INFO] Apache FontBox .................................... SKIPPED
[INFO] Apache JempBox .................................... SKIPPED
[INFO] Apache XmpBox ..................................... SKIPPED
[INFO] Apache PDFBox ..................................... SKIPPED
[INFO] Apache Preflight .................................. SKIPPED
[INFO] Apache Preflight application ...................... SKIPPED
[INFO] Apache PDFBox for Lucene .......................... SKIPPED
[INFO] Apache PDFBox for Ant ............................. SKIPPED
[INFO] Apache PDFBox webapp .............................. SKIPPED
[INFO] Apache PDFBox application ......................... SKIPPED
[INFO] Apache PDFBox examples ............................ SKIPPED
[INFO] PDFBox reactor .................................... SKIPPED
[INFO] ------------------------------------------------------------------------
[INFO] BUILD FAILURE
[INFO] ------------------------------------------------------------------------
[INFO] Total time: 16.960s
[INFO] Finished at: Sat Jan 06 12:34:51 UTC 2018
[INFO] Final Memory: 29M/575M
[INFO] ------------------------------------------------------------------------
Waiting for Jenkins to finish collecting data
[ERROR] Failed to execute goal org.owasp:dependency-check-maven:3.1.0:check (default) on project
pdfbox-parent: A type incompatibility occured while executing org.owasp:dependency-check-maven:3.1.0:check:
org.sonatype.aether.util.DefaultRepositorySystemSession cannot be cast to org.eclipse.aether.RepositorySystemSession
[ERROR] -----------------------------------------------------
[ERROR] realm =    plugin>org.owasp:dependency-check-maven:3.1.0
[ERROR] strategy = org.codehaus.plexus.classworlds.strategy.SelfFirstStrategy
[ERROR] urls[0] = file:/home/jenkins/jenkins-slave/maven-repositories/1/org/owasp/dependency-check-maven/3.1.0/dependency-check-maven-3.1.0.jar
[ERROR] urls[1] = file:/home/jenkins/jenkins-slave/maven-repositories/1/org/owasp/dependency-check-core/3.1.0/dependency-check-core-3.1.0.jar
[ERROR] urls[2] = file:/home/jenkins/jenkins-slave/maven-repositories/1/com/vdurmont/semver4j/2.1.0/semver4j-2.1.0.jar
[ERROR] urls[3] = file:/home/jenkins/jenkins-slave/maven-repositories/1/joda-time/joda-time/1.6/joda-time-1.6.jar
[ERROR] urls[4] = file:/home/jenkins/jenkins-slave/maven-repositories/1/org/slf4j/slf4j-api/1.7.25/slf4j-api-1.7.25.jar
[ERROR] urls[5] = file:/home/jenkins/jenkins-slave/maven-repositories/1/org/apache/commons/commons-compress/1.15/commons-compress-1.15.jar
[ERROR] urls[6] = file:/home/jenkins/jenkins-slave/maven-repositories/1/org/objenesis/objenesis/2.6/objenesis-2.6.jar
[ERROR] urls[7] = file:/home/jenkins/jenkins-slave/maven-repositories/1/commons-io/commons-io/2.6/commons-io-2.6.jar
[ERROR] urls[8] = file:/home/jenkins/jenkins-slave/maven-repositories/1/org/apache/commons/commons-lang3/3.4/commons-lang3-3.4.jar
[ERROR] urls[9] = file:/home/jenkins/jenkins-slave/maven-repositories/1/org/apache/lucene/lucene-core/5.5.5/lucene-core-5.5.5.jar
[ERROR] urls[10] = file:/home/jenkins/jenkins-slave/maven-repositories/1/org/apache/lucene/lucene-analyzers-common/5.5.5/lucene-analyzers-common-5.5.5.jar
[ERROR] urls[11] = file:/home/jenkins/jenkins-slave/maven-repositories/1/org/apache/lucene/lucene-queryparser/5.5.5/lucene-queryparser-5.5.5.jar
[ERROR] urls[12] = file:/home/jenkins/jenkins-slave/maven-repositories/1/org/apache/lucene/lucene-queries/5.5.5/lucene-queries-5.5.5.jar
[ERROR] urls[13] = file:/home/jenkins/jenkins-slave/maven-repositories/1/org/apache/lucene/lucene-sandbox/5.5.5/lucene-sandbox-5.5.5.jar
[ERROR] urls[14] = file:/home/jenkins/jenkins-slave/maven-repositories/1/org/apache/velocity/velocity/1.7/velocity-1.7.jar
[ERROR] urls[15] = file:/home/jenkins/jenkins-slave/maven-repositories/1/commons-collections/commons-collections/3.2.2/commons-collections-3.2.2.jar
[ERROR] urls[16] = file:/home/jenkins/jenkins-slave/maven-repositories/1/commons-lang/commons-lang/2.4/commons-lang-2.4.jar
[ERROR] urls[17] = file:/home/jenkins/jenkins-slave/maven-repositories/1/com/h2database/h2/1.4.196/h2-1.4.196.jar
[ERROR] urls[18] = file:/home/jenkins/jenkins-slave/maven-repositories/1/org/glassfish/javax.json/1.0.4/javax.json-1.0.4.jar
[ERROR] urls[19] = file:/home/jenkins/jenkins-slave/maven-repositories/1/org/jsoup/jsoup/1.11.2/jsoup-1.11.2.jar
[ERROR] urls[20] = file:/home/jenkins/jenkins-slave/maven-repositories/1/com/sun/mail/mailapi/1.6.0/mailapi-1.6.0.jar
[ERROR] urls[21] = file:/home/jenkins/jenkins-slave/maven-repositories/1/com/google/code/gson/gson/2.8.2/gson-2.8.2.jar
[ERROR] urls[22] = file:/home/jenkins/jenkins-slave/maven-repositories/1/org/owasp/dependency-check-utils/3.1.0/dependency-check-utils-3.1.0.jar
[ERROR] urls[23] = file:/home/jenkins/jenkins-slave/maven-repositories/1/org/apache/maven/shared/file-management/3.0.0/file-management-3.0.0.jar
[ERROR] urls[24] = file:/home/jenkins/jenkins-slave/maven-repositories/1/org/eclipse/sisu/org.eclipse.sisu.plexus/0.3.3/org.eclipse.sisu.plexus-0.3.3.jar
[ERROR] urls[25] = file:/home/jenkins/jenkins-slave/maven-repositories/1/javax/enterprise/cdi-api/1.0/cdi-api-1.0.jar
[ERROR] urls[26] = file:/home/jenkins/jenkins-slave/maven-repositories/1/javax/annotation/jsr250-api/1.0/jsr250-api-1.0.jar
[ERROR] urls[27] = file:/home/jenkins/jenkins-slave/maven-repositories/1/org/apache/maven/shared/maven-shared-io/3.0.0/maven-shared-io-3.0.0.jar
[ERROR] urls[28] = file:/home/jenkins/jenkins-slave/maven-repositories/1/org/codehaus/plexus/plexus-interpolation/1.14/plexus-interpolation-1.14.jar
[ERROR] urls[29] = file:/home/jenkins/jenkins-slave/maven-repositories/1/org/apache/maven/shared/maven-shared-utils/3.0.0/maven-shared-utils-3.0.0.jar
[ERROR] urls[30] = file:/home/jenkins/jenkins-slave/maven-repositories/1/com/google/code/findbugs/jsr305/2.0.1/jsr305-2.0.1.jar
[ERROR] urls[31] = file:/home/jenkins/jenkins-slave/maven-repositories/1/org/codehaus/plexus/plexus-utils/3.0.22/plexus-utils-3.0.22.jar
[ERROR] urls[32] = file:/home/jenkins/jenkins-slave/maven-repositories/1/org/apache/maven/reporting/maven-reporting-api/3.0/maven-reporting-api-3.0.jar
[ERROR] urls[33] = file:/home/jenkins/jenkins-slave/maven-repositories/1/org/apache/maven/doxia/doxia-sink-api/1.0/doxia-sink-api-1.0.jar
[ERROR] urls[34] = file:/home/jenkins/jenkins-slave/maven-repositories/1/org/sonatype/plexus/plexus-sec-dispatcher/1.4/plexus-sec-dispatcher-1.4.jar
[ERROR] urls[35] = file:/home/jenkins/jenkins-slave/maven-repositories/1/org/sonatype/plexus/plexus-cipher/1.4/plexus-cipher-1.4.jar
[ERROR] urls[36] = file:/home/jenkins/jenkins-slave/maven-repositories/1/org/apache/maven/shared/maven-dependency-tree/2.2/maven-dependency-tree-2.2.jar
[ERROR] urls[37] = file:/home/jenkins/jenkins-slave/maven-repositories/1/org/codehaus/plexus/plexus-component-annotations/1.5.5/plexus-component-annotations-1.5.5.jar
[ERROR] urls[38] = file:/home/jenkins/jenkins-slave/maven-repositories/1/org/eclipse/aether/aether-util/0.9.0.M2/aether-util-0.9.0.M2.jar
[ERROR] urls[39] = file:/home/jenkins/jenkins-slave/maven-repositories/1/org/apache/maven/shared/maven-artifact-transfer/0.9.1/maven-artifact-transfer-0.9.1.jar
[ERROR] urls[40] = file:/home/jenkins/jenkins-slave/maven-repositories/1/org/apache/maven/maven-builder-support/3.5.2/maven-builder-support-3.5.2.jar
[ERROR] urls[41] = file:/home/jenkins/jenkins-slave/maven-repositories/1/org/apache/maven/maven-resolver-provider/3.5.2/maven-resolver-provider-3.5.2.jar
[ERROR] urls[42] = file:/home/jenkins/jenkins-slave/maven-repositories/1/org/apache/maven/resolver/maven-resolver-impl/1.1.0/maven-resolver-impl-1.1.0.jar
[ERROR] urls[43] = file:/home/jenkins/jenkins-slave/maven-repositories/1/org/apache/maven/resolver/maven-resolver-api/1.1.0/maven-resolver-api-1.1.0.jar
[ERROR] urls[44] = file:/home/jenkins/jenkins-slave/maven-repositories/1/org/apache/maven/resolver/maven-resolver-spi/1.1.0/maven-resolver-spi-1.1.0.jar
[ERROR] urls[45] = file:/home/jenkins/jenkins-slave/maven-repositories/1/org/apache/maven/resolver/maven-resolver-util/1.1.0/maven-resolver-util-1.1.0.jar
[ERROR] urls[46] = file:/home/jenkins/jenkins-slave/maven-repositories/1/org/eclipse/sisu/org.eclipse.sisu.inject/0.3.3/org.eclipse.sisu.inject-0.3.3.jar
[ERROR] urls[47] = file:/home/jenkins/jenkins-slave/maven-repositories/1/com/google/inject/guice/4.0/guice-4.0-no_aop.jar
[ERROR] urls[48] = file:/home/jenkins/jenkins-slave/maven-repositories/1/aopalliance/aopalliance/1.0/aopalliance-1.0.jar
[ERROR] urls[49] = file:/home/jenkins/jenkins-slave/maven-repositories/1/com/google/guava/guava/20.0/guava-20.0.jar
[ERROR] urls[50] = file:/home/jenkins/jenkins-slave/maven-repositories/1/javax/inject/javax.inject/1/javax.inject-1.jar
[ERROR] urls[51] = file:/home/jenkins/jenkins-slave/maven-repositories/1/org/apache/maven/shared/maven-common-artifact-filters/3.0.1/maven-common-artifact-filters-3.0.1.jar
[ERROR] urls[52] = file:/home/jenkins/jenkins-slave/maven-repositories/1/org/sonatype/sisu/sisu-inject-bean/1.4.2/sisu-inject-bean-1.4.2.jar
[ERROR] urls[53] = file:/home/jenkins/jenkins-slave/maven-repositories/1/org/sonatype/sisu/sisu-guice/2.1.7/sisu-guice-2.1.7-noaop.jar
[ERROR] urls[54] = file:/home/jenkins/jenkins-slave/maven-repositories/1/commons-codec/commons-codec/1.6/commons-codec-1.6.jar
[ERROR] Number of foreign imports: 1
[ERROR] import: Entry[import  from realm ClassRealm[maven.api, parent: null]]
[ERROR] 
[ERROR] -----------------------------------------------------
[ERROR] -> [Help 1]
[ERROR] 
[ERROR] To see the full stack trace of the errors, re-run Maven with the -e switch.
[ERROR] Re-run Maven using the -X switch to enable full debug logging.
[ERROR] 
[ERROR] For more information about the errors and possible solutions, please read the following
articles:
[ERROR] [Help 1] http://cwiki.apache.org/confluence/display/MAVEN/PluginExecutionException
[JENKINS] Archiving <https://builds.apache.org/job/PDFBox-1.8.x/ws/1.8/lucene/pom.xml>
to org.apache.pdfbox/pdfbox-lucene/1.8.14-SNAPSHOT/pdfbox-lucene-1.8.14-SNAPSHOT.pom
[JENKINS] Archiving <https://builds.apache.org/job/PDFBox-1.8.x/ws/1.8/jempbox/pom.xml>
to org.apache.pdfbox/jempbox/1.8.14-SNAPSHOT/jempbox-1.8.14-SNAPSHOT.pom
[JENKINS] Archiving <https://builds.apache.org/job/PDFBox-1.8.x/ws/1.8/examples/pom.xml>
to org.apache.pdfbox/pdfbox-examples/1.8.14-SNAPSHOT/pdfbox-examples-1.8.14-SNAPSHOT.pom
[JENKINS] Archiving <https://builds.apache.org/job/PDFBox-1.8.x/ws/1.8/parent/pom.xml>
to org.apache.pdfbox/pdfbox-parent/1.8.14-SNAPSHOT/pdfbox-parent-1.8.14-SNAPSHOT.pom
[JENKINS] Archiving <https://builds.apache.org/job/PDFBox-1.8.x/ws/1.8/pdfbox/pom.xml>
to org.apache.pdfbox/pdfbox/1.8.14-SNAPSHOT/pdfbox-1.8.14-SNAPSHOT.pom
[JENKINS] Archiving <https://builds.apache.org/job/PDFBox-1.8.x/ws/1.8/ant/pom.xml>
to org.apache.pdfbox/pdfbox-ant/1.8.14-SNAPSHOT/pdfbox-ant-1.8.14-SNAPSHOT.pom
[JENKINS] Archiving <https://builds.apache.org/job/PDFBox-1.8.x/ws/1.8/fontbox/pom.xml>
to org.apache.pdfbox/fontbox/1.8.14-SNAPSHOT/fontbox-1.8.14-SNAPSHOT.pom
[JENKINS] Archiving <https://builds.apache.org/job/PDFBox-1.8.x/ws/1.8/war/pom.xml>
to org.apache.pdfbox/pdfbox-war/1.8.14-SNAPSHOT/pdfbox-war-1.8.14-SNAPSHOT.pom
[JENKINS] Archiving <https://builds.apache.org/job/PDFBox-1.8.x/ws/1.8/xmpbox/pom.xml>
to org.apache.pdfbox/xmpbox/1.8.14-SNAPSHOT/xmpbox-1.8.14-SNAPSHOT.pom
[JENKINS] Archiving <https://builds.apache.org/job/PDFBox-1.8.x/ws/1.8/preflight-app/pom.xml>
to org.apache.pdfbox/preflight-app/1.8.14-SNAPSHOT/preflight-app-1.8.14-SNAPSHOT.pom
[JENKINS] Archiving <https://builds.apache.org/job/PDFBox-1.8.x/ws/1.8/app/pom.xml>
to org.apache.pdfbox/pdfbox-app/1.8.14-SNAPSHOT/pdfbox-app-1.8.14-SNAPSHOT.pom
[JENKINS] Archiving <https://builds.apache.org/job/PDFBox-1.8.x/ws/1.8/preflight/pom.xml>
to org.apache.pdfbox/preflight/1.8.14-SNAPSHOT/preflight-1.8.14-SNAPSHOT.pom
[JENKINS] Archiving <https://builds.apache.org/job/PDFBox-1.8.x/ws/1.8/pom.xml> to org.apache.pdfbox/pdfbox-reactor/1.8.14-SNAPSHOT/pdfbox-reactor-1.8.14-SNAPSHOT.pom
Sending e-mails to: dev@pdfbox.apache.org
channel stopped
Archiving artifacts

---------------------------------------------------------------------
To unsubscribe, e-mail: dev-unsubscribe@pdfbox.apache.org
For additional commands, e-mail: dev-help@pdfbox.apache.org


Mime
View raw message