pdfbox-dev mailing list archives

Site index · List index
Message view « Date » · « Thread »
Top « Date » · « Thread »
From Apache Jenkins Server <jenk...@builds.apache.org>
Subject Build failed in Jenkins: PDFBox-trunk » Apache PDFBox #2642
Date Tue, 01 Dec 2015 17:07:50 GMT
See <https://builds.apache.org/job/PDFBox-trunk/org.apache.pdfbox$pdfbox/2642/changes>

Changes:

[tilman] PDFBOX-3141: render border of link annotations

[tilman] PDFBOX-3141: add getter/setter /Border

------------------------------------------
[INFO]                                                                         
[INFO] ------------------------------------------------------------------------
[INFO] Building Apache PDFBox 2.0.0-SNAPSHOT
[INFO] ------------------------------------------------------------------------
[INFO] 
[INFO] --- maven-clean-plugin:2.5:clean (default-clean) @ pdfbox ---
[TASKS] Scanning folder '<https://builds.apache.org/job/PDFBox-trunk/org.apache.pdfbox$pdfbox/ws/'>
for files matching the pattern '**/*.java' - excludes: 
[TASKS] Found 631 files to scan for tasks
Found 221 open tasks.
[TASKS] Computing warning deltas based on reference build #2641
[INFO] 
[INFO] --- maven-remote-resources-plugin:1.5:process (default) @ pdfbox ---
[INFO] 
[INFO] --- maven-resources-plugin:2.6:resources (default-resources) @ pdfbox ---
[INFO] Using 'UTF-8' encoding to copy filtered resources.
[INFO] Copying 1 resource
[INFO] Copying 21 resources
[INFO] Copying 3 resources
[INFO] 
[INFO] --- maven-compiler-plugin:3.1:compile (default-compile) @ pdfbox ---
[INFO] Changes detected - recompiling the module!
[INFO] Compiling 547 source files to <https://builds.apache.org/job/PDFBox-trunk/org.apache.pdfbox$pdfbox/ws/target/classes>
[INFO] -------------------------------------------------------------
[WARNING] COMPILATION WARNING : 
[INFO] -------------------------------------------------------------
[WARNING] bootstrap class path not set in conjunction with -source 1.6
[WARNING] <https://builds.apache.org/job/PDFBox-trunk/org.apache.pdfbox$pdfbox/ws/src/main/java/org/apache/pdfbox/pdmodel/font/PDFont.java>:[268,27]
getHeight(int) in org.apache.pdfbox.pdmodel.font.PDFontLike has been deprecated
[WARNING] <https://builds.apache.org/job/PDFBox-trunk/org.apache.pdfbox$pdfbox/ws/src/main/java/org/apache/pdfbox/pdmodel/font/PDCIDFont.java>:[291,27]
getHeight(int) in org.apache.pdfbox.pdmodel.font.PDFontLike has been deprecated
[WARNING] <https://builds.apache.org/job/PDFBox-trunk/org.apache.pdfbox$pdfbox/ws/src/main/java/org/apache/pdfbox/pdmodel/fdf/FDFField.java>:
Some input files use unchecked or unsafe operations.
[WARNING] <https://builds.apache.org/job/PDFBox-trunk/org.apache.pdfbox$pdfbox/ws/src/main/java/org/apache/pdfbox/pdmodel/fdf/FDFField.java>:
Recompile with -Xlint:unchecked for details.
[INFO] 5 warnings 
[INFO] -------------------------------------------------------------
[INFO] -------------------------------------------------------------
[ERROR] COMPILATION ERROR : 
[INFO] -------------------------------------------------------------
[ERROR] <https://builds.apache.org/job/PDFBox-trunk/org.apache.pdfbox$pdfbox/ws/src/main/java/org/apache/pdfbox/rendering/PageDrawer.java>:[853,43]
cannot find symbol
  symbol:   class PDAnnotationLink
  location: class org.apache.pdfbox.rendering.PageDrawer
[ERROR] <https://builds.apache.org/job/PDFBox-trunk/org.apache.pdfbox$pdfbox/ws/src/main/java/org/apache/pdfbox/rendering/PageDrawer.java>:[847,35]
cannot find symbol
  symbol:   class PDAnnotationLink
  location: class org.apache.pdfbox.rendering.PageDrawer
[ERROR] <https://builds.apache.org/job/PDFBox-trunk/org.apache.pdfbox$pdfbox/ws/src/main/java/org/apache/pdfbox/rendering/PageDrawer.java>:[849,39]
cannot find symbol
  symbol:   class PDAnnotationLink
  location: class org.apache.pdfbox.rendering.PageDrawer
[ERROR] <https://builds.apache.org/job/PDFBox-trunk/org.apache.pdfbox$pdfbox/ws/src/main/java/org/apache/pdfbox/rendering/PageDrawer.java>:[859,9]
cannot find symbol
  symbol:   class COSArray
  location: class org.apache.pdfbox.rendering.PageDrawer
[ERROR] <https://builds.apache.org/job/PDFBox-trunk/org.apache.pdfbox$pdfbox/ws/src/main/java/org/apache/pdfbox/rendering/PageDrawer.java>:[860,9]
cannot find symbol
  symbol:   class PDBorderStyleDictionary
  location: class org.apache.pdfbox.rendering.PageDrawer
[ERROR] <https://builds.apache.org/job/PDFBox-trunk/org.apache.pdfbox$pdfbox/ws/src/main/java/org/apache/pdfbox/rendering/PageDrawer.java>:[866,42]
cannot find symbol
  symbol:   class COSNumber
  location: class org.apache.pdfbox.rendering.PageDrawer
[ERROR] <https://builds.apache.org/job/PDFBox-trunk/org.apache.pdfbox$pdfbox/ws/src/main/java/org/apache/pdfbox/rendering/PageDrawer.java>:[868,27]
cannot find symbol
  symbol:   class COSNumber
  location: class org.apache.pdfbox.rendering.PageDrawer
[ERROR] <https://builds.apache.org/job/PDFBox-trunk/org.apache.pdfbox$pdfbox/ws/src/main/java/org/apache/pdfbox/rendering/PageDrawer.java>:[872,17]
cannot find symbol
  symbol:   class COSBase
  location: class org.apache.pdfbox.rendering.PageDrawer
[ERROR] <https://builds.apache.org/job/PDFBox-trunk/org.apache.pdfbox$pdfbox/ws/src/main/java/org/apache/pdfbox/rendering/PageDrawer.java>:[873,38]
cannot find symbol
  symbol:   class COSArray
  location: class org.apache.pdfbox.rendering.PageDrawer
[ERROR] <https://builds.apache.org/job/PDFBox-trunk/org.apache.pdfbox$pdfbox/ws/src/main/java/org/apache/pdfbox/rendering/PageDrawer.java>:[875,35]
cannot find symbol
  symbol:   class COSArray
  location: class org.apache.pdfbox.rendering.PageDrawer
[ERROR] <https://builds.apache.org/job/PDFBox-trunk/org.apache.pdfbox$pdfbox/ws/src/main/java/org/apache/pdfbox/rendering/PageDrawer.java>:[882,47]
cannot find symbol
  symbol:   variable PDBorderStyleDictionary
  location: class org.apache.pdfbox.rendering.PageDrawer
[ERROR] <https://builds.apache.org/job/PDFBox-trunk/org.apache.pdfbox$pdfbox/ws/src/main/java/org/apache/pdfbox/rendering/PageDrawer.java>:[886,47]
cannot find symbol
  symbol:   variable PDBorderStyleDictionary
  location: class org.apache.pdfbox.rendering.PageDrawer
[ERROR] <https://builds.apache.org/job/PDFBox-trunk/org.apache.pdfbox$pdfbox/ws/src/main/java/org/apache/pdfbox/rendering/PageDrawer.java>:[899,52]
cannot find symbol
  symbol:   variable PDDeviceGray
  location: class org.apache.pdfbox.rendering.PageDrawer
[INFO] 13 errors 
[INFO] -------------------------------------------------------------

---------------------------------------------------------------------
To unsubscribe, e-mail: dev-unsubscribe@pdfbox.apache.org
For additional commands, e-mail: dev-help@pdfbox.apache.org


Mime
View raw message