pdfbox-dev mailing list archives

Site index · List index
Message view « Date » · « Thread »
Top « Date » · « Thread »
From Apache Jenkins Server <jenk...@builds.apache.org>
Subject Build failed in Jenkins: PDFBox 1.8.x #153
Date Mon, 02 Jun 2014 04:17:56 GMT
See <https://builds.apache.org/job/PDFBox%201.8.x/153/changes>

Changes:

[msahyoun] PDFBOX-2107 Make PDFBox XMP library agnostic - fix false commit

------------------------------------------
[...truncated 1938 lines...]
[INFO] Installing <https://builds.apache.org/job/PDFBox%201.8.x/ws/1.8/jempbox/pom.xml>
to /home/jenkins/jenkins-slave/maven-repositories/1/org/apache/pdfbox/jempbox/1.8.6-SNAPSHOT/jempbox-1.8.6-SNAPSHOT.pom
[INFO] 
[INFO] --- maven-bundle-plugin:2.3.7:install (default-install) @ jempbox ---
[INFO] Installing org/apache/pdfbox/jempbox/1.8.6-SNAPSHOT/jempbox-1.8.6-SNAPSHOT.jar
[INFO] Writing OBR metadata
[INFO] 
[INFO] --- maven-deploy-plugin:2.6:deploy (default-deploy) @ jempbox ---
Downloading: https://repository.apache.org/content/repositories/snapshots/org/apache/pdfbox/jempbox/1.8.6-SNAPSHOT/maven-metadata.xml
Downloaded: https://repository.apache.org/content/repositories/snapshots/org/apache/pdfbox/jempbox/1.8.6-SNAPSHOT/maven-metadata.xml
(777 B at 4.5 KB/sec)
Uploading: https://repository.apache.org/content/repositories/snapshots/org/apache/pdfbox/jempbox/1.8.6-SNAPSHOT/jempbox-1.8.6-20140602.041356-29.jar
Uploaded: https://repository.apache.org/content/repositories/snapshots/org/apache/pdfbox/jempbox/1.8.6-SNAPSHOT/jempbox-1.8.6-20140602.041356-29.jar
(50 KB at 214.7 KB/sec)
Uploading: https://repository.apache.org/content/repositories/snapshots/org/apache/pdfbox/jempbox/1.8.6-SNAPSHOT/jempbox-1.8.6-20140602.041356-29.pom
Uploaded: https://repository.apache.org/content/repositories/snapshots/org/apache/pdfbox/jempbox/1.8.6-SNAPSHOT/jempbox-1.8.6-20140602.041356-29.pom
(2 KB at 14.8 KB/sec)
Downloading: https://repository.apache.org/content/repositories/snapshots/org/apache/pdfbox/jempbox/maven-metadata.xml
Downloaded: https://repository.apache.org/content/repositories/snapshots/org/apache/pdfbox/jempbox/maven-metadata.xml
(384 B at 3.1 KB/sec)
Uploading: https://repository.apache.org/content/repositories/snapshots/org/apache/pdfbox/jempbox/1.8.6-SNAPSHOT/maven-metadata.xml
Uploaded: https://repository.apache.org/content/repositories/snapshots/org/apache/pdfbox/jempbox/1.8.6-SNAPSHOT/maven-metadata.xml
(777 B at 5.2 KB/sec)
Uploading: https://repository.apache.org/content/repositories/snapshots/org/apache/pdfbox/jempbox/maven-metadata.xml
Uploaded: https://repository.apache.org/content/repositories/snapshots/org/apache/pdfbox/jempbox/maven-metadata.xml
(384 B at 2.0 KB/sec)
[INFO] 
[INFO] --- maven-bundle-plugin:2.3.7:deploy (default-deploy) @ jempbox ---
[INFO] Remote OBR update disabled (enable with -DremoteOBR)
[INFO]                                                                         
[INFO] ------------------------------------------------------------------------
[INFO] Building Apache XmpBox 1.8.6-SNAPSHOT
[INFO] ------------------------------------------------------------------------
[INFO] 
[INFO] --- maven-clean-plugin:2.4.1:clean (default-clean) @ xmpbox ---
[INFO] 
[INFO] --- maven-remote-resources-plugin:1.2.1:process (default) @ xmpbox ---
[INFO] 
[INFO] --- maven-resources-plugin:2.5:resources (default-resources) @ xmpbox ---
[debug] execute contextualize
[INFO] Using 'ISO-8859-1' encoding to copy filtered resources.
[INFO] skip non existing resourceDirectory <https://builds.apache.org/job/PDFBox%201.8.x/ws/1.8/xmpbox/src/main/resources>
[INFO] Copying 3 resources
[INFO] 
[INFO] --- maven-compiler-plugin:2.3.2:compile (default-compile) @ xmpbox ---
[INFO] Compiling 62 source files to <https://builds.apache.org/job/PDFBox%201.8.x/ws/1.8/xmpbox/target/classes>
[INFO] 
[INFO] --- maven-resources-plugin:2.5:testResources (default-testResources) @ xmpbox ---
[debug] execute contextualize
[INFO] Using 'ISO-8859-1' encoding to copy filtered resources.
[INFO] Copying 23 resources
[INFO] Copying 3 resources
[INFO] 
[INFO] --- maven-compiler-plugin:2.3.2:testCompile (default-testCompile) @ xmpbox ---
[INFO] Compiling 31 source files to <https://builds.apache.org/job/PDFBox%201.8.x/ws/1.8/xmpbox/target/test-classes>
[INFO] 
[INFO] --- maven-surefire-plugin:2.9:test (default-test) @ xmpbox ---
[INFO] Surefire report directory: <https://builds.apache.org/job/PDFBox%201.8.x/ws/1.8/xmpbox/target/surefire-reports>

-------------------------------------------------------
 T E S T S
-------------------------------------------------------
Running org.apache.xmpbox.parser.DeserializationTest
Tests run: 17, Failures: 0, Errors: 0, Skipped: 0, Time elapsed: 0.455 sec
Running org.apache.xmpbox.type.TestResourceEventType
Tests run: 24, Failures: 0, Errors: 0, Skipped: 0, Time elapsed: 0.334 sec
Running org.apache.xmpbox.type.TestAbstractStructuredType
Tests run: 5, Failures: 0, Errors: 0, Skipped: 0, Time elapsed: 0.037 sec
Running org.apache.xmpbox.type.TestResourceRefType
Tests run: 60, Failures: 0, Errors: 0, Skipped: 0, Time elapsed: 0.466 sec
Running org.apache.xmpbox.type.TestThumbnailType
Tests run: 16, Failures: 0, Errors: 0, Skipped: 0, Time elapsed: 0.109 sec
Running org.apache.xmpbox.type.TestDerivedType
Tests run: 11, Failures: 0, Errors: 0, Skipped: 0, Time elapsed: 0.045 sec
Running org.apache.xmpbox.type.TestLayerType
Tests run: 8, Failures: 0, Errors: 0, Skipped: 0, Time elapsed: 0.037 sec
Running org.apache.xmpbox.type.TestVersionType
Tests run: 4, Failures: 0, Errors: 0, Skipped: 0, Time elapsed: 0.017 sec
Running org.apache.xmpbox.type.AttributeTest
Tests run: 2, Failures: 0, Errors: 0, Skipped: 0, Time elapsed: 0 sec
Running org.apache.xmpbox.type.TestSimpleMetadataProperties
Tests run: 10, Failures: 0, Errors: 0, Skipped: 0, Time elapsed: 0.049 sec
Running org.apache.xmpbox.type.TestJobType
Tests run: 12, Failures: 0, Errors: 0, Skipped: 0, Time elapsed: 0.061 sec
Running org.apache.xmpbox.schema.XMPSchemaTest
Tests run: 12, Failures: 0, Errors: 0, Skipped: 0, Time elapsed: 0.049 sec
Running org.apache.xmpbox.schema.XmpRightsSchemaTest
Tests run: 10, Failures: 0, Errors: 0, Skipped: 0, Time elapsed: 0.047 sec
Running org.apache.xmpbox.schema.BasicJobTicketSchemaTest
Tests run: 3, Failures: 0, Errors: 0, Skipped: 0, Time elapsed: 0.054 sec
Running org.apache.xmpbox.schema.PDFAIdentificationTest
Tests run: 6, Failures: 0, Errors: 0, Skipped: 0, Time elapsed: 0.026 sec
Running org.apache.xmpbox.schema.AdobePDFTest
Tests run: 12, Failures: 0, Errors: 0, Skipped: 0, Time elapsed: 0.065 sec
Running org.apache.xmpbox.schema.PDFAIdentificationOthersTest
Tests run: 3, Failures: 0, Errors: 0, Skipped: 0, Time elapsed: 0.017 sec
Running org.apache.xmpbox.schema.XMPBasicTest
Tests run: 22, Failures: 0, Errors: 0, Skipped: 0, Time elapsed: 0.143 sec
Running org.apache.xmpbox.schema.PhotoshopSchemaTest
Tests run: 90, Failures: 0, Errors: 0, Skipped: 0, Time elapsed: 0.504 sec
Running org.apache.xmpbox.schema.DublinCoreTest
Tests run: 60, Failures: 0, Errors: 0, Skipped: 0, Time elapsed: 0.291 sec
Running org.apache.xmpbox.schema.AdobePDFErrorsTest
Tests run: 3, Failures: 0, Errors: 0, Skipped: 0, Time elapsed: 0.012 sec
Running org.apache.xmpbox.schema.XMPMediaManagementTest
Tests run: 22, Failures: 0, Errors: 0, Skipped: 0, Time elapsed: 0.128 sec
Running org.apache.xmpbox.DoubleSameTypeSchemaTest
Tests run: 1, Failures: 0, Errors: 0, Skipped: 0, Time elapsed: 0.003 sec
Running org.apache.xmpbox.XMPMetaDataTest
Tests run: 4, Failures: 0, Errors: 0, Skipped: 0, Time elapsed: 0.018 sec
Running org.apache.xmpbox.SaveMetadataHelperTest
Tests run: 2, Failures: 0, Errors: 0, Skipped: 0, Time elapsed: 0.007 sec
Running org.apache.xmpbox.TestXMPWithDefinedSchemas
Tests run: 5, Failures: 0, Errors: 0, Skipped: 0, Time elapsed: 0.054 sec

Results :

Tests run: 424, Failures: 0, Errors: 0, Skipped: 0

[JENKINS] Recording test results
[INFO] 
[INFO] --- maven-bundle-plugin:2.3.7:bundle (default-bundle) @ xmpbox ---
[INFO] 
[INFO] --- maven-site-plugin:3.0:attach-descriptor (attach-descriptor) @ xmpbox ---
[INFO] 
[INFO] --- apache-rat-plugin:0.6:check (default) @ xmpbox ---
[INFO] Exclude: release.properties
[INFO] 
[INFO] --- maven-install-plugin:2.3.1:install (default-install) @ xmpbox ---
[INFO] Installing <https://builds.apache.org/job/PDFBox%201.8.x/ws/1.8/xmpbox/target/xmpbox-1.8.6-SNAPSHOT.jar>
to /home/jenkins/jenkins-slave/maven-repositories/1/org/apache/pdfbox/xmpbox/1.8.6-SNAPSHOT/xmpbox-1.8.6-SNAPSHOT.jar
[INFO] Installing <https://builds.apache.org/job/PDFBox%201.8.x/ws/1.8/xmpbox/pom.xml>
to /home/jenkins/jenkins-slave/maven-repositories/1/org/apache/pdfbox/xmpbox/1.8.6-SNAPSHOT/xmpbox-1.8.6-SNAPSHOT.pom
[INFO] 
[INFO] --- maven-bundle-plugin:2.3.7:install (default-install) @ xmpbox ---
[INFO] Installing org/apache/pdfbox/xmpbox/1.8.6-SNAPSHOT/xmpbox-1.8.6-SNAPSHOT.jar
[INFO] Writing OBR metadata
[INFO] 
[INFO] --- maven-deploy-plugin:2.6:deploy (default-deploy) @ xmpbox ---
Downloading: https://repository.apache.org/content/repositories/snapshots/org/apache/pdfbox/xmpbox/1.8.6-SNAPSHOT/maven-metadata.xml
Downloaded: https://repository.apache.org/content/repositories/snapshots/org/apache/pdfbox/xmpbox/1.8.6-SNAPSHOT/maven-metadata.xml
(776 B at 4.1 KB/sec)
Uploading: https://repository.apache.org/content/repositories/snapshots/org/apache/pdfbox/xmpbox/1.8.6-SNAPSHOT/xmpbox-1.8.6-20140602.041426-29.jar
Uploaded: https://repository.apache.org/content/repositories/snapshots/org/apache/pdfbox/xmpbox/1.8.6-SNAPSHOT/xmpbox-1.8.6-20140602.041426-29.jar
(112 KB at 321.6 KB/sec)
Uploading: https://repository.apache.org/content/repositories/snapshots/org/apache/pdfbox/xmpbox/1.8.6-SNAPSHOT/xmpbox-1.8.6-20140602.041426-29.pom
Uploaded: https://repository.apache.org/content/repositories/snapshots/org/apache/pdfbox/xmpbox/1.8.6-SNAPSHOT/xmpbox-1.8.6-20140602.041426-29.pom
(4 KB at 27.2 KB/sec)
Downloading: https://repository.apache.org/content/repositories/snapshots/org/apache/pdfbox/xmpbox/maven-metadata.xml
Downloaded: https://repository.apache.org/content/repositories/snapshots/org/apache/pdfbox/xmpbox/maven-metadata.xml
(383 B at 2.1 KB/sec)
Uploading: https://repository.apache.org/content/repositories/snapshots/org/apache/pdfbox/xmpbox/1.8.6-SNAPSHOT/maven-metadata.xml
Uploaded: https://repository.apache.org/content/repositories/snapshots/org/apache/pdfbox/xmpbox/1.8.6-SNAPSHOT/maven-metadata.xml
(776 B at 5.3 KB/sec)
Uploading: https://repository.apache.org/content/repositories/snapshots/org/apache/pdfbox/xmpbox/maven-metadata.xml
Uploaded: https://repository.apache.org/content/repositories/snapshots/org/apache/pdfbox/xmpbox/maven-metadata.xml
(383 B at 2.2 KB/sec)
[INFO] 
[INFO] --- maven-bundle-plugin:2.3.7:deploy (default-deploy) @ xmpbox ---
[INFO] Remote OBR update disabled (enable with -DremoteOBR)
[INFO]                                                                         
[INFO] ------------------------------------------------------------------------
[INFO] Building Apache PDFBox 1.8.6-SNAPSHOT
[INFO] ------------------------------------------------------------------------
Downloading: http://jbig2-imageio.googlecode.com/svn/maven-repository/net/java/dev/jai-imageio/jai-imageio-core-standalone/1.2-pre-dr-b04-2011-07-04/jai-imageio-core-standalone-1.2-pre-dr-b04-2011-07-04.pom
Downloading: http://www.mygrid.org.uk/maven/repository/net/java/dev/jai-imageio/jai-imageio-core-standalone/1.2-pre-dr-b04-2011-07-04/jai-imageio-core-standalone-1.2-pre-dr-b04-2011-07-04.pom
Downloaded: http://www.mygrid.org.uk/maven/repository/net/java/dev/jai-imageio/jai-imageio-core-standalone/1.2-pre-dr-b04-2011-07-04/jai-imageio-core-standalone-1.2-pre-dr-b04-2011-07-04.pom
(5 KB at 1.9 KB/sec)
Downloading: http://jbig2-imageio.googlecode.com/svn/maven-repository/net/java/dev/jai-imageio/jai-imageio-core-standalone/1.2-pre-dr-b04-2011-07-04/jai-imageio-core-standalone-1.2-pre-dr-b04-2011-07-04.jar
Downloading: http://www.mygrid.org.uk/maven/repository/net/java/dev/jai-imageio/jai-imageio-core-standalone/1.2-pre-dr-b04-2011-07-04/jai-imageio-core-standalone-1.2-pre-dr-b04-2011-07-04.jar
Downloaded: http://www.mygrid.org.uk/maven/repository/net/java/dev/jai-imageio/jai-imageio-core-standalone/1.2-pre-dr-b04-2011-07-04/jai-imageio-core-standalone-1.2-pre-dr-b04-2011-07-04.jar
(1008 KB at 356.8 KB/sec)
[INFO] 
[INFO] --- maven-clean-plugin:2.4.1:clean (default-clean) @ pdfbox ---
[INFO] 
[INFO] --- maven-remote-resources-plugin:1.2.1:process (default) @ pdfbox ---
[INFO] 
[INFO] --- maven-antrun-plugin:1.6:run (default) @ pdfbox ---
[INFO] Executing tasks

main:

find.adobefiles:

get.adobefiles:

testexist:

downloadfile:
    [unjar] Expanding: <https://builds.apache.org/job/PDFBox%201.8.x/ws/1.8/pdfbox/download/pcfi-2010.08.09.jar>
into <https://builds.apache.org/job/PDFBox%201.8.x/ws/1.8/pdfbox/target/classes/org/apache/pdfbox/resources/afm>
    [unjar] Expanding: <https://builds.apache.org/job/PDFBox%201.8.x/ws/1.8/pdfbox/download/pcfi-2010.08.09.jar>
into <https://builds.apache.org/job/PDFBox%201.8.x/ws/1.8/pdfbox/target/classes/org/apache/pdfbox/resources>
[INFO] Executed tasks
[INFO] 
[INFO] --- maven-resources-plugin:2.5:resources (default-resources) @ pdfbox ---
[debug] execute contextualize
[INFO] Using 'ISO-8859-1' encoding to copy filtered resources.
[INFO] Copying 192 resources
[INFO] Copying 3 resources
[INFO] 
[INFO] --- maven-compiler-plugin:2.3.2:compile (default-compile) @ pdfbox ---
[INFO] Compiling 527 source files to <https://builds.apache.org/job/PDFBox%201.8.x/ws/1.8/pdfbox/target/classes>
[INFO] -------------------------------------------------------------
[ERROR] COMPILATION ERROR : 
[INFO] -------------------------------------------------------------
[ERROR] <https://builds.apache.org/job/PDFBox%201.8.x/ws/1.8/pdfbox/src/main/java/org/apache/pdfbox/pdmodel/common/PDMetadata.java>:[103,26]
cannot find symbol
symbol  : variable createOutputStream
location: class org.apache.pdfbox.pdmodel.common.PDMetadata
[INFO] 1 error
[INFO] -------------------------------------------------------------
[INFO] ------------------------------------------------------------------------
[INFO] Reactor Summary:
[INFO] 
[INFO] PDFBox parent ..................................... SUCCESS [52.254s]
[INFO] Apache FontBox .................................... SUCCESS [36.241s]
[INFO] Apache JempBox .................................... SUCCESS [23.102s]
[INFO] Apache XmpBox ..................................... SUCCESS [29.007s]
[INFO] Apache PDFBox ..................................... FAILURE [20.924s]
[INFO] Apache Preflight .................................. SKIPPED
[INFO] Apache Preflight application ...................... SKIPPED
[INFO] Apache PDFBox for Lucene .......................... SKIPPED
[INFO] Apache PDFBox for Ant ............................. SKIPPED
[INFO] Apache PDFBox webapp .............................. SKIPPED
[INFO] Apache PDFBox application ......................... SKIPPED
[INFO] Apache PDFBox examples ............................ SKIPPED
[INFO] PDFBox reactor .................................... SKIPPED
[INFO] ------------------------------------------------------------------------
[INFO] BUILD FAILURE
[INFO] ------------------------------------------------------------------------
[INFO] Total time: 2:53.454s
[INFO] Finished at: Mon Jun 02 04:14:53 UTC 2014
[INFO] Final Memory: 28M/500M
[INFO] ------------------------------------------------------------------------
Waiting for Jenkins to finish collecting data
[ERROR] Failed to execute goal org.apache.maven.plugins:maven-compiler-plugin:2.3.2:compile
(default-compile) on project pdfbox: Compilation failure
[JENKINS] Archiving <https://builds.apache.org/job/PDFBox%201.8.x/ws/1.8/app/pom.xml>
to org.apache.pdfbox/pdfbox-app/1.8.6-SNAPSHOT/pdfbox-app-1.8.6-SNAPSHOT.pom
[ERROR] <https://builds.apache.org/job/PDFBox%201.8.x/ws/1.8/pdfbox/src/main/java/org/apache/pdfbox/pdmodel/common/PDMetadata.java>:[103,26]
cannot find symbol
[ERROR] symbol  : variable createOutputStream
[ERROR] location: class org.apache.pdfbox.pdmodel.common.PDMetadata
[ERROR] -> [Help 1]
[ERROR] 
[ERROR] To see the full stack trace of the errors, re-run Maven with the -e switch.
[ERROR] Re-run Maven using the -X switch to enable full debug logging.
[ERROR] 
[ERROR] For more information about the errors and possible solutions, please read the following
articles:
[ERROR] [Help 1] http://cwiki.apache.org/confluence/display/MAVEN/MojoFailureException
[ERROR] 
[ERROR] After correcting the problems, you can resume the build with the command
[ERROR]   mvn <goals> -rf :pdfbox
[JENKINS] Archiving <https://builds.apache.org/job/PDFBox%201.8.x/ws/1.8/war/pom.xml>
to org.apache.pdfbox/pdfbox-war/1.8.6-SNAPSHOT/pdfbox-war-1.8.6-SNAPSHOT.pom
[JENKINS] Archiving <https://builds.apache.org/job/PDFBox%201.8.x/ws/1.8/pom.xml> to
org.apache.pdfbox/pdfbox-reactor/1.8.6-SNAPSHOT/pdfbox-reactor-1.8.6-SNAPSHOT.pom
[JENKINS] Archiving <https://builds.apache.org/job/PDFBox%201.8.x/ws/1.8/fontbox/pom.xml>
to org.apache.pdfbox/fontbox/1.8.6-SNAPSHOT/fontbox-1.8.6-SNAPSHOT.pom
[JENKINS] Archiving <https://builds.apache.org/job/PDFBox%201.8.x/ws/1.8/fontbox/target/fontbox-1.8.6-SNAPSHOT.jar>
to org.apache.pdfbox/fontbox/1.8.6-20140602.041332-29/fontbox-1.8.6-20140602.041332-29.jar
[JENKINS] Archiving <https://builds.apache.org/job/PDFBox%201.8.x/ws/1.8/pdfbox/pom.xml>
to org.apache.pdfbox/pdfbox/1.8.6-SNAPSHOT/pdfbox-1.8.6-SNAPSHOT.pom
[JENKINS] Archiving <https://builds.apache.org/job/PDFBox%201.8.x/ws/1.8/xmpbox/pom.xml>
to org.apache.pdfbox/xmpbox/1.8.6-SNAPSHOT/xmpbox-1.8.6-SNAPSHOT.pom
[JENKINS] Archiving <https://builds.apache.org/job/PDFBox%201.8.x/ws/1.8/xmpbox/target/xmpbox-1.8.6-SNAPSHOT.jar>
to org.apache.pdfbox/xmpbox/1.8.6-20140602.041426-29/xmpbox-1.8.6-20140602.041426-29.jar
[JENKINS] Archiving <https://builds.apache.org/job/PDFBox%201.8.x/ws/1.8/preflight-app/pom.xml>
to org.apache.pdfbox/preflight-app/1.8.6-SNAPSHOT/preflight-app-1.8.6-SNAPSHOT.pom
[JENKINS] Archiving <https://builds.apache.org/job/PDFBox%201.8.x/ws/1.8/ant/pom.xml>
to org.apache.pdfbox/pdfbox-ant/1.8.6-SNAPSHOT/pdfbox-ant-1.8.6-SNAPSHOT.pom
[JENKINS] Archiving <https://builds.apache.org/job/PDFBox%201.8.x/ws/1.8/examples/pom.xml>
to org.apache.pdfbox/pdfbox-examples/1.8.6-SNAPSHOT/pdfbox-examples-1.8.6-SNAPSHOT.pom
[JENKINS] Archiving <https://builds.apache.org/job/PDFBox%201.8.x/ws/1.8/lucene/pom.xml>
to org.apache.pdfbox/pdfbox-lucene/1.8.6-SNAPSHOT/pdfbox-lucene-1.8.6-SNAPSHOT.pom
[JENKINS] Archiving <https://builds.apache.org/job/PDFBox%201.8.x/ws/1.8/preflight/pom.xml>
to org.apache.pdfbox/preflight/1.8.6-SNAPSHOT/preflight-1.8.6-SNAPSHOT.pom
[JENKINS] Archiving <https://builds.apache.org/job/PDFBox%201.8.x/ws/1.8/parent/pom.xml>
to org.apache.pdfbox/pdfbox-parent/1.8.6-SNAPSHOT/pdfbox-parent-1.8.6-SNAPSHOT.pom
[JENKINS] Archiving <https://builds.apache.org/job/PDFBox%201.8.x/ws/1.8/jempbox/pom.xml>
to org.apache.pdfbox/jempbox/1.8.6-SNAPSHOT/jempbox-1.8.6-SNAPSHOT.pom
[JENKINS] Archiving <https://builds.apache.org/job/PDFBox%201.8.x/ws/1.8/jempbox/target/jempbox-1.8.6-SNAPSHOT.jar>
to org.apache.pdfbox/jempbox/1.8.6-20140602.041356-29/jempbox-1.8.6-20140602.041356-29.jar
Sending e-mails to: dev@pdfbox.apache.org
channel stopped
Archiving artifacts

Mime
View raw message