pdfbox-dev mailing list archives

Site index · List index
Message view « Date » · « Thread »
Top « Date » · « Thread »
From Apache Jenkins Server <jenk...@builds.apache.org>
Subject Build failed in Jenkins: PDFBox-trunk #1003
Date Mon, 02 Jun 2014 16:26:02 GMT
See <https://builds.apache.org/job/PDFBox-trunk/1003/changes>

Changes:

[tilman] PDFBOX-2068: added width, height, bpc and colorspace to PDImageXObject constructor

------------------------------------------
[...truncated 1027 lines...]
[INFO] 
[INFO] --- maven-bundle-plugin:2.4.0:deploy (default-deploy) @ pdfbox-app ---
[INFO] Remote OBR update disabled (enable with -DremoteOBR)
[INFO]                                                                         
[INFO] ------------------------------------------------------------------------
[INFO] Building Apache PDFBox examples 2.0.0-SNAPSHOT
[INFO] ------------------------------------------------------------------------
Downloading: http://jbig2-imageio.googlecode.com/svn/maven-repository/org/apache/lucene/lucene-core/4.7.2/lucene-core-4.7.2.pom
Downloading: http://www.mygrid.org.uk/maven/repository/org/apache/lucene/lucene-core/4.7.2/lucene-core-4.7.2.pom
Downloading: http://repo.maven.apache.org/maven2/org/apache/lucene/lucene-core/4.7.2/lucene-core-4.7.2.pom
Downloaded: http://repo.maven.apache.org/maven2/org/apache/lucene/lucene-core/4.7.2/lucene-core-4.7.2.pom
(5 KB at 324.7 KB/sec)
Downloading: http://jbig2-imageio.googlecode.com/svn/maven-repository/org/apache/lucene/lucene-parent/4.7.2/lucene-parent-4.7.2.pom
Downloading: http://www.mygrid.org.uk/maven/repository/org/apache/lucene/lucene-parent/4.7.2/lucene-parent-4.7.2.pom
Downloading: http://repo.maven.apache.org/maven2/org/apache/lucene/lucene-parent/4.7.2/lucene-parent-4.7.2.pom
Downloaded: http://repo.maven.apache.org/maven2/org/apache/lucene/lucene-parent/4.7.2/lucene-parent-4.7.2.pom
(5 KB at 466.6 KB/sec)
Downloading: http://jbig2-imageio.googlecode.com/svn/maven-repository/org/apache/lucene/lucene-solr-grandparent/4.7.2/lucene-solr-grandparent-4.7.2.pom
Downloading: http://www.mygrid.org.uk/maven/repository/org/apache/lucene/lucene-solr-grandparent/4.7.2/lucene-solr-grandparent-4.7.2.pom
Downloading: http://repo.maven.apache.org/maven2/org/apache/lucene/lucene-solr-grandparent/4.7.2/lucene-solr-grandparent-4.7.2.pom
Downloaded: http://repo.maven.apache.org/maven2/org/apache/lucene/lucene-solr-grandparent/4.7.2/lucene-solr-grandparent-4.7.2.pom
(292 KB at 10064.3 KB/sec)
Downloading: http://jbig2-imageio.googlecode.com/svn/maven-repository/org/apache/lucene/lucene-analyzers-common/4.7.2/lucene-analyzers-common-4.7.2.pom
Downloading: http://www.mygrid.org.uk/maven/repository/org/apache/lucene/lucene-analyzers-common/4.7.2/lucene-analyzers-common-4.7.2.pom
Downloading: http://repo.maven.apache.org/maven2/org/apache/lucene/lucene-analyzers-common/4.7.2/lucene-analyzers-common-4.7.2.pom
Downloaded: http://repo.maven.apache.org/maven2/org/apache/lucene/lucene-analyzers-common/4.7.2/lucene-analyzers-common-4.7.2.pom
(3 KB at 328.3 KB/sec)
Downloading: http://jbig2-imageio.googlecode.com/svn/maven-repository/org/apache/ant/ant/1.9.3/ant-1.9.3.pom
Downloading: http://www.mygrid.org.uk/maven/repository/org/apache/ant/ant/1.9.3/ant-1.9.3.pom
Downloading: http://repo.maven.apache.org/maven2/org/apache/ant/ant/1.9.3/ant-1.9.3.pom
Downloaded: http://repo.maven.apache.org/maven2/org/apache/ant/ant/1.9.3/ant-1.9.3.pom (10
KB at 58.1 KB/sec)
Downloading: http://jbig2-imageio.googlecode.com/svn/maven-repository/org/apache/ant/ant-parent/1.9.3/ant-parent-1.9.3.pom
Downloading: http://www.mygrid.org.uk/maven/repository/org/apache/ant/ant-parent/1.9.3/ant-parent-1.9.3.pom
Downloading: http://repo.maven.apache.org/maven2/org/apache/ant/ant-parent/1.9.3/ant-parent-1.9.3.pom
Downloaded: http://repo.maven.apache.org/maven2/org/apache/ant/ant-parent/1.9.3/ant-parent-1.9.3.pom
(6 KB at 34.2 KB/sec)
Downloading: http://jbig2-imageio.googlecode.com/svn/maven-repository/org/apache/ant/ant-launcher/1.9.3/ant-launcher-1.9.3.pom
Downloading: http://www.mygrid.org.uk/maven/repository/org/apache/ant/ant-launcher/1.9.3/ant-launcher-1.9.3.pom
Downloading: http://repo.maven.apache.org/maven2/org/apache/ant/ant-launcher/1.9.3/ant-launcher-1.9.3.pom
Downloaded: http://repo.maven.apache.org/maven2/org/apache/ant/ant-launcher/1.9.3/ant-launcher-1.9.3.pom
(3 KB at 14.3 KB/sec)
Downloading: http://jbig2-imageio.googlecode.com/svn/maven-repository/org/apache/wink/wink-component-test-support/1.4/wink-component-test-support-1.4.pom
Downloading: http://www.mygrid.org.uk/maven/repository/org/apache/wink/wink-component-test-support/1.4/wink-component-test-support-1.4.pom
Downloading: http://repo.maven.apache.org/maven2/org/apache/wink/wink-component-test-support/1.4/wink-component-test-support-1.4.pom
Downloaded: http://repo.maven.apache.org/maven2/org/apache/wink/wink-component-test-support/1.4/wink-component-test-support-1.4.pom
(3 KB at 17.4 KB/sec)
Downloading: http://jbig2-imageio.googlecode.com/svn/maven-repository/org/apache/wink/wink/1.4/wink-1.4.pom
Downloading: http://www.mygrid.org.uk/maven/repository/org/apache/wink/wink/1.4/wink-1.4.pom
Downloading: http://repo.maven.apache.org/maven2/org/apache/wink/wink/1.4/wink-1.4.pom
Downloaded: http://repo.maven.apache.org/maven2/org/apache/wink/wink/1.4/wink-1.4.pom (42
KB at 135.9 KB/sec)
Downloading: http://jbig2-imageio.googlecode.com/svn/maven-repository/xmlunit/xmlunit/1.1/xmlunit-1.1.pom
Downloading: http://www.mygrid.org.uk/maven/repository/xmlunit/xmlunit/1.1/xmlunit-1.1.pom
Downloading: http://repo.maven.apache.org/maven2/xmlunit/xmlunit/1.1/xmlunit-1.1.pom
Downloaded: http://repo.maven.apache.org/maven2/xmlunit/xmlunit/1.1/xmlunit-1.1.pom (0 B at
0.0 KB/sec)
Downloading: http://jbig2-imageio.googlecode.com/svn/maven-repository/org/apache/geronimo/specs/geronimo-jaxrs_1.1_spec/1.0/geronimo-jaxrs_1.1_spec-1.0.pom
Downloading: http://www.mygrid.org.uk/maven/repository/org/apache/geronimo/specs/geronimo-jaxrs_1.1_spec/1.0/geronimo-jaxrs_1.1_spec-1.0.pom
Downloading: http://repo.maven.apache.org/maven2/org/apache/geronimo/specs/geronimo-jaxrs_1.1_spec/1.0/geronimo-jaxrs_1.1_spec-1.0.pom
Downloaded: http://repo.maven.apache.org/maven2/org/apache/geronimo/specs/geronimo-jaxrs_1.1_spec/1.0/geronimo-jaxrs_1.1_spec-1.0.pom
(4 KB at 307.4 KB/sec)
Downloading: http://jbig2-imageio.googlecode.com/svn/maven-repository/org/apache/lucene/lucene-core/4.7.2/lucene-core-4.7.2.jar
Downloading: http://jbig2-imageio.googlecode.com/svn/maven-repository/org/apache/lucene/lucene-analyzers-common/4.7.2/lucene-analyzers-common-4.7.2.jar
Downloading: http://jbig2-imageio.googlecode.com/svn/maven-repository/org/apache/ant/ant/1.9.3/ant-1.9.3.jar
Downloading: http://jbig2-imageio.googlecode.com/svn/maven-repository/org/apache/ant/ant-launcher/1.9.3/ant-launcher-1.9.3.jar
Downloading: http://jbig2-imageio.googlecode.com/svn/maven-repository/org/apache/wink/wink-component-test-support/1.4/wink-component-test-support-1.4.jar
Downloading: http://jbig2-imageio.googlecode.com/svn/maven-repository/org/springframework/spring-context/3.0.5.RELEASE/spring-context-3.0.5.RELEASE.jar
Downloading: http://jbig2-imageio.googlecode.com/svn/maven-repository/org/springframework/spring-aop/3.0.5.RELEASE/spring-aop-3.0.5.RELEASE.jar
Downloading: http://jbig2-imageio.googlecode.com/svn/maven-repository/org/springframework/spring-beans/3.0.5.RELEASE/spring-beans-3.0.5.RELEASE.jar
Downloading: http://jbig2-imageio.googlecode.com/svn/maven-repository/xmlunit/xmlunit/1.1/xmlunit-1.1.jar
Downloading: http://jbig2-imageio.googlecode.com/svn/maven-repository/org/apache/geronimo/specs/geronimo-jaxrs_1.1_spec/1.0/geronimo-jaxrs_1.1_spec-1.0.jar
Downloading: http://www.mygrid.org.uk/maven/repository/org/apache/lucene/lucene-core/4.7.2/lucene-core-4.7.2.jar
Downloading: http://www.mygrid.org.uk/maven/repository/org/apache/lucene/lucene-analyzers-common/4.7.2/lucene-analyzers-common-4.7.2.jar
Downloading: http://www.mygrid.org.uk/maven/repository/org/apache/ant/ant/1.9.3/ant-1.9.3.jar
Downloading: http://www.mygrid.org.uk/maven/repository/org/apache/ant/ant-launcher/1.9.3/ant-launcher-1.9.3.jar
Downloading: http://www.mygrid.org.uk/maven/repository/org/apache/wink/wink-component-test-support/1.4/wink-component-test-support-1.4.jar
Downloading: http://www.mygrid.org.uk/maven/repository/org/springframework/spring-context/3.0.5.RELEASE/spring-context-3.0.5.RELEASE.jar
Downloading: http://www.mygrid.org.uk/maven/repository/org/springframework/spring-aop/3.0.5.RELEASE/spring-aop-3.0.5.RELEASE.jar
Downloading: http://www.mygrid.org.uk/maven/repository/org/springframework/spring-beans/3.0.5.RELEASE/spring-beans-3.0.5.RELEASE.jar
Downloading: http://www.mygrid.org.uk/maven/repository/xmlunit/xmlunit/1.1/xmlunit-1.1.jar
Downloading: http://www.mygrid.org.uk/maven/repository/org/apache/geronimo/specs/geronimo-jaxrs_1.1_spec/1.0/geronimo-jaxrs_1.1_spec-1.0.jar
Downloading: http://repo.maven.apache.org/maven2/org/apache/lucene/lucene-core/4.7.2/lucene-core-4.7.2.jar
Downloading: http://repo.maven.apache.org/maven2/org/apache/lucene/lucene-analyzers-common/4.7.2/lucene-analyzers-common-4.7.2.jar
Downloading: http://repo.maven.apache.org/maven2/org/apache/ant/ant/1.9.3/ant-1.9.3.jar
Downloading: http://repo.maven.apache.org/maven2/org/apache/ant/ant-launcher/1.9.3/ant-launcher-1.9.3.jar
Downloading: http://repo.maven.apache.org/maven2/org/apache/wink/wink-component-test-support/1.4/wink-component-test-support-1.4.jar
Downloaded: http://repo.maven.apache.org/maven2/org/apache/ant/ant-launcher/1.9.3/ant-launcher-1.9.3.jar
(18 KB at 1795.0 KB/sec)
Downloading: http://repo.maven.apache.org/maven2/org/springframework/spring-context/3.0.5.RELEASE/spring-context-3.0.5.RELEASE.jar
Downloaded: http://repo.maven.apache.org/maven2/org/apache/wink/wink-component-test-support/1.4/wink-component-test-support-1.4.jar
(40 KB at 3054.2 KB/sec)
Downloading: http://repo.maven.apache.org/maven2/org/springframework/spring-aop/3.0.5.RELEASE/spring-aop-3.0.5.RELEASE.jar
Downloaded: http://repo.maven.apache.org/maven2/org/apache/lucene/lucene-analyzers-common/4.7.2/lucene-analyzers-common-4.7.2.jar
(1620 KB at 27924.6 KB/sec)
Downloading: http://repo.maven.apache.org/maven2/org/springframework/spring-beans/3.0.5.RELEASE/spring-beans-3.0.5.RELEASE.jar
Downloaded: http://repo.maven.apache.org/maven2/org/springframework/spring-beans/3.0.5.RELEASE/spring-beans-3.0.5.RELEASE.jar
(543 KB at 30132.9 KB/sec)
Downloading: http://repo.maven.apache.org/maven2/xmlunit/xmlunit/1.1/xmlunit-1.1.jar
Downloaded: http://repo.maven.apache.org/maven2/org/apache/lucene/lucene-core/4.7.2/lucene-core-4.7.2.jar
(2303 KB at 28083.5 KB/sec)
Downloading: http://repo.maven.apache.org/maven2/org/apache/geronimo/specs/geronimo-jaxrs_1.1_spec/1.0/geronimo-jaxrs_1.1_spec-1.0.jar
Downloaded: http://repo.maven.apache.org/maven2/org/springframework/spring-aop/3.0.5.RELEASE/spring-aop-3.0.5.RELEASE.jar
(314 KB at 4480.9 KB/sec)
Downloaded: http://repo.maven.apache.org/maven2/org/apache/geronimo/specs/geronimo-jaxrs_1.1_spec/1.0/geronimo-jaxrs_1.1_spec-1.0.jar
(54 KB at 5959.3 KB/sec)
Downloaded: http://repo.maven.apache.org/maven2/org/springframework/spring-context/3.0.5.RELEASE/spring-context-3.0.5.RELEASE.jar
(654 KB at 7869.7 KB/sec)
Downloaded: http://repo.maven.apache.org/maven2/xmlunit/xmlunit/1.1/xmlunit-1.1.jar (0 B at
0.0 KB/sec)
Downloaded: http://repo.maven.apache.org/maven2/org/apache/ant/ant/1.9.3/ant-1.9.3.jar (1961
KB at 2943.4 KB/sec)
[INFO] 
[INFO] --- maven-clean-plugin:2.5:clean (default-clean) @ pdfbox-examples ---
[INFO] Deleting <https://builds.apache.org/job/PDFBox-trunk/ws/trunk/examples/target>
[TASKS] Scanning folder '<https://builds.apache.org/job/PDFBox-trunk/ws/trunk/examples'>
for files matching the pattern '**/*.java' - excludes: 
[TASKS] Found 44 files to scan for tasks
Found 12 open tasks.
[TASKS] Computing warning deltas based on reference build #1001
[INFO] 
[INFO] --- maven-remote-resources-plugin:1.5:process (default) @ pdfbox-examples ---
[INFO] 
[INFO] --- maven-resources-plugin:2.6:resources (default-resources) @ pdfbox-examples ---
[INFO] Using 'ISO-8859-1' encoding to copy filtered resources.
[INFO] Copying 2 resources
[INFO] Copying 3 resources
[INFO] 
[INFO] --- maven-compiler-plugin:3.1:compile (default-compile) @ pdfbox-examples ---
[INFO] Changes detected - recompiling the module!
[INFO] Compiling 42 source files to <https://builds.apache.org/job/PDFBox-trunk/ws/trunk/examples/target/classes>
[WARNING] <https://builds.apache.org/job/PDFBox-trunk/ws/trunk/examples/src/main/java/org/apache/pdfbox/examples/signature/CreateVisibleSignature.java>:[192,16]
warning: [deprecation] addSigner(java.security.PrivateKey,java.security.cert.X509Certificate,java.lang.String)
in org.bouncycastle.cms.CMSSignedDataGenerator has been deprecated
[WARNING] <https://builds.apache.org/job/PDFBox-trunk/ws/trunk/examples/src/main/java/org/apache/pdfbox/examples/signature/CreateVisibleSignature.java>:[194,43]
warning: [deprecation] generate(org.bouncycastle.cms.CMSProcessable,boolean,java.security.Provider)
in org.bouncycastle.cms.CMSSignedDataGenerator has been deprecated
[WARNING] <https://builds.apache.org/job/PDFBox-trunk/ws/trunk/examples/src/main/java/org/apache/pdfbox/examples/signature/CreateSignature.java>:[271,16]
warning: [deprecation] addSigner(java.security.PrivateKey,java.security.cert.X509Certificate,java.lang.String)
in org.bouncycastle.cms.CMSSignedDataGenerator has been deprecated
[WARNING] <https://builds.apache.org/job/PDFBox-trunk/ws/trunk/examples/src/main/java/org/apache/pdfbox/examples/signature/CreateSignature.java>:[273,43]
warning: [deprecation] generate(org.bouncycastle.cms.CMSProcessable,boolean,java.security.Provider)
in org.bouncycastle.cms.CMSSignedDataGenerator has been deprecated
[WARNING] Note: Some input files use unchecked or unsafe operations.
[WARNING] Note: Recompile with -Xlint:unchecked for details.
[INFO] 
[INFO] --- maven-resources-plugin:2.6:testResources (default-testResources) @ pdfbox-examples
---
[INFO] Using 'ISO-8859-1' encoding to copy filtered resources.
[INFO] Copying 9 resources
[INFO] Copying 3 resources
[INFO] 
[INFO] --- maven-compiler-plugin:3.1:testCompile (default-testCompile) @ pdfbox-examples ---
[INFO] Changes detected - recompiling the module!
[INFO] Compiling 2 source files to <https://builds.apache.org/job/PDFBox-trunk/ws/trunk/examples/target/test-classes>
[INFO] 
[INFO] --- maven-surefire-plugin:2.16:test (default-test) @ pdfbox-examples ---
[INFO] Surefire report directory: <https://builds.apache.org/job/PDFBox-trunk/ws/trunk/examples/target/surefire-reports>

-------------------------------------------------------
 T E S T S
-------------------------------------------------------
Running org.apache.pdfbox.examples.pdmodel.TestRubberStampWithImage
SLF4J: Failed to load class "org.slf4j.impl.StaticLoggerBinder".
SLF4J: Defaulting to no-operation (NOP) logger implementation
SLF4J: See http://www.slf4j.org/codes.html#StaticLoggerBinder for further details.
Tests run: 1, Failures: 0, Errors: 0, Skipped: 0, Time elapsed: 0.198 sec - in org.apache.pdfbox.examples.pdmodel.TestRubberStampWithImage
Running org.apache.pdfbox.examples.pdmodel.TestCreateSignature
Tests run: 2, Failures: 0, Errors: 0, Skipped: 0, Time elapsed: 0.831 sec - in org.apache.pdfbox.examples.pdmodel.TestCreateSignature

Results :

Tests run: 3, Failures: 0, Errors: 0, Skipped: 0

[JENKINS] Recording test results
[INFO] 
[INFO] --- maven-jar-plugin:2.4:jar (default-jar) @ pdfbox-examples ---
[INFO] Building jar: <https://builds.apache.org/job/PDFBox-trunk/ws/trunk/examples/target/pdfbox-examples-2.0.0-SNAPSHOT.jar>
[INFO] 
[INFO] --- maven-site-plugin:3.3:attach-descriptor (attach-descriptor) @ pdfbox-examples ---
[INFO] 
[INFO] --- apache-rat-plugin:0.10:check (default) @ pdfbox-examples ---
[INFO] 51 implicit excludes (use -debug for more details).
[INFO] Exclude: release.properties
[INFO] 65 resources included (use -debug for more details)
[INFO] Rat check: Summary of files. Unapproved: 0 unknown: 0 generated: 0 approved: 52 licence.
[INFO] 
[INFO] --- maven-install-plugin:2.5.1:install (default-install) @ pdfbox-examples ---
[INFO] Installing <https://builds.apache.org/job/PDFBox-trunk/ws/trunk/examples/target/pdfbox-examples-2.0.0-SNAPSHOT.jar>
to /home/jenkins/jenkins-slave/maven-repositories/1/org/apache/pdfbox/pdfbox-examples/2.0.0-SNAPSHOT/pdfbox-examples-2.0.0-SNAPSHOT.jar
[INFO] Installing <https://builds.apache.org/job/PDFBox-trunk/ws/trunk/examples/pom.xml>
to /home/jenkins/jenkins-slave/maven-repositories/1/org/apache/pdfbox/pdfbox-examples/2.0.0-SNAPSHOT/pdfbox-examples-2.0.0-SNAPSHOT.pom
[INFO] 
[INFO] --- maven-deploy-plugin:2.8.1:deploy (default-deploy) @ pdfbox-examples ---
Downloading: https://repository.apache.org/content/repositories/snapshots/org/apache/pdfbox/pdfbox-examples/2.0.0-SNAPSHOT/maven-metadata.xml
Downloaded: https://repository.apache.org/content/repositories/snapshots/org/apache/pdfbox/pdfbox-examples/2.0.0-SNAPSHOT/maven-metadata.xml
(788 B at 1.7 KB/sec)
Uploading: https://repository.apache.org/content/repositories/snapshots/org/apache/pdfbox/pdfbox-examples/2.0.0-SNAPSHOT/pdfbox-examples-2.0.0-20140602.162432-318.jar
Uploaded: https://repository.apache.org/content/repositories/snapshots/org/apache/pdfbox/pdfbox-examples/2.0.0-SNAPSHOT/pdfbox-examples-2.0.0-20140602.162432-318.jar
(108 KB at 235.9 KB/sec)
Uploading: https://repository.apache.org/content/repositories/snapshots/org/apache/pdfbox/pdfbox-examples/2.0.0-SNAPSHOT/pdfbox-examples-2.0.0-20140602.162432-318.pom
Uploaded: https://repository.apache.org/content/repositories/snapshots/org/apache/pdfbox/pdfbox-examples/2.0.0-SNAPSHOT/pdfbox-examples-2.0.0-20140602.162432-318.pom
(4 KB at 9.6 KB/sec)
Downloading: https://repository.apache.org/content/repositories/snapshots/org/apache/pdfbox/pdfbox-examples/maven-metadata.xml
Downloaded: https://repository.apache.org/content/repositories/snapshots/org/apache/pdfbox/pdfbox-examples/maven-metadata.xml
(392 B at 1.7 KB/sec)
Uploading: https://repository.apache.org/content/repositories/snapshots/org/apache/pdfbox/pdfbox-examples/2.0.0-SNAPSHOT/maven-metadata.xml
Uploaded: https://repository.apache.org/content/repositories/snapshots/org/apache/pdfbox/pdfbox-examples/2.0.0-SNAPSHOT/maven-metadata.xml
(788 B at 2.7 KB/sec)
Uploading: https://repository.apache.org/content/repositories/snapshots/org/apache/pdfbox/pdfbox-examples/maven-metadata.xml
Uploaded: https://repository.apache.org/content/repositories/snapshots/org/apache/pdfbox/pdfbox-examples/maven-metadata.xml
(392 B at 1.1 KB/sec)
[INFO]                                                                         
[INFO] ------------------------------------------------------------------------
[INFO] Building PDFBox reactor 2.0.0-SNAPSHOT
[INFO] ------------------------------------------------------------------------
[INFO] 
[INFO] --- maven-clean-plugin:2.5:clean (default-clean) @ pdfbox-reactor ---
[INFO] Deleting <https://builds.apache.org/job/PDFBox-trunk/ws/trunk/target>
[TASKS] Scanning folder '<https://builds.apache.org/job/PDFBox-trunk/ws/trunk'> for
files matching the pattern '**/*.java' - excludes: parent/**/*, fontbox/**/*, jempbox/**/*,
xmpbox/**/*, pdfbox/**/*, preflight/**/*, preflight-app/**/*, tools/**/*, app/**/*, examples/**/*
[TASKS] Found 0 files to scan for tasks
Found 0 open tasks.
[TASKS] Computing warning deltas based on reference build #1001
[INFO] 
[INFO] --- maven-remote-resources-plugin:1.5:process (default) @ pdfbox-reactor ---
[INFO] 
[INFO] --- maven-site-plugin:3.3:attach-descriptor (attach-descriptor) @ pdfbox-reactor ---
[INFO] 
[INFO] --- apache-rat-plugin:0.10:check (default) @ pdfbox-reactor ---
[INFO] 61 implicit excludes (use -debug for more details).
[INFO] Exclude: release.properties
[INFO] 34 resources included (use -debug for more details)
[INFO] Rat check: Summary of files. Unapproved: 2 unknown: 2 generated: 0 approved: 13 licence.
[INFO] ------------------------------------------------------------------------
[INFO] Reactor Summary:
[INFO] 
[INFO] PDFBox parent ..................................... SUCCESS [53.365s]
[INFO] Apache FontBox .................................... SUCCESS [51.332s]
[INFO] Apache JempBox .................................... SUCCESS [29.475s]
[INFO] Apache XmpBox ..................................... SUCCESS [39.873s]
[INFO] Apache PDFBox ..................................... SUCCESS [2:30.234s]
[INFO] Apache Preflight .................................. SUCCESS [50.778s]
[INFO] Apache Preflight application ...................... SUCCESS [31.603s]
[INFO] Apache PDFBox tools ............................... SUCCESS [30.374s]
[INFO] Apache PDFBox application ......................... SUCCESS [36.772s]
[INFO] Apache PDFBox examples ............................ SUCCESS [36.446s]
[INFO] PDFBox reactor .................................... FAILURE [22.346s]
[INFO] ------------------------------------------------------------------------
[INFO] BUILD FAILURE
[INFO] ------------------------------------------------------------------------
[INFO] Total time: 9:45.113s
[INFO] Finished at: Mon Jun 02 16:24:59 UTC 2014
[INFO] Final Memory: 31M/180M
[INFO] ------------------------------------------------------------------------
Waiting for Jenkins to finish collecting data
[ERROR] Failed to execute goal org.apache.rat:apache-rat-plugin:0.10:check (default) on project
pdfbox-reactor: Too many files with unapproved license: 2 See RAT report in: <https://builds.apache.org/job/PDFBox-trunk/ws/trunk/target/rat.txt>
-> [Help 1]
[ERROR] 
[ERROR] To see the full stack trace of the errors, re-run Maven with the -e switch.
[ERROR] Re-run Maven using the -X switch to enable full debug logging.
[ERROR] 
[JENKINS] Archiving <https://builds.apache.org/job/PDFBox-trunk/ws/trunk/app/pom.xml>
to org.apache.pdfbox/pdfbox-app/2.0.0-SNAPSHOT/pdfbox-app-2.0.0-SNAPSHOT.pom
[JENKINS] Archiving <https://builds.apache.org/job/PDFBox-trunk/ws/trunk/app/target/pdfbox-app-2.0.0-SNAPSHOT.jar>
to org.apache.pdfbox/pdfbox-app/2.0.0-20140602.162349-323/pdfbox-app-2.0.0-20140602.162349-323.jar
[ERROR] For more information about the errors and possible solutions, please read the following
articles:
[ERROR] [Help 1] http://cwiki.apache.org/confluence/display/MAVEN/MojoFailureException
[ERROR] 
[ERROR] After correcting the problems, you can resume the build with the command
[ERROR]   mvn <goals> -rf :pdfbox-reactor
[JENKINS] Archiving <https://builds.apache.org/job/PDFBox-trunk/ws/trunk/pom.xml> to
org.apache.pdfbox/pdfbox-reactor/2.0.0-SNAPSHOT/pdfbox-reactor-2.0.0-SNAPSHOT.pom
[JENKINS] Archiving <https://builds.apache.org/job/PDFBox-trunk/ws/trunk/fontbox/pom.xml>
to org.apache.pdfbox/fontbox/2.0.0-SNAPSHOT/fontbox-2.0.0-SNAPSHOT.pom
[JENKINS] Archiving <https://builds.apache.org/job/PDFBox-trunk/ws/trunk/fontbox/target/fontbox-2.0.0-SNAPSHOT.jar>
to org.apache.pdfbox/fontbox/2.0.0-20140602.161726-352/fontbox-2.0.0-20140602.161726-352.jar
[JENKINS] Archiving <https://builds.apache.org/job/PDFBox-trunk/ws/trunk/pdfbox/pom.xml>
to org.apache.pdfbox/pdfbox/2.0.0-SNAPSHOT/pdfbox-2.0.0-SNAPSHOT.pom
[JENKINS] Archiving <https://builds.apache.org/job/PDFBox-trunk/ws/trunk/pdfbox/target/pdfbox-2.0.0-SNAPSHOT.jar>
to org.apache.pdfbox/pdfbox/2.0.0-20140602.162112-333/pdfbox-2.0.0-20140602.162112-333.jar
[JENKINS] Archiving <https://builds.apache.org/job/PDFBox-trunk/ws/trunk/xmpbox/pom.xml>
to org.apache.pdfbox/xmpbox/2.0.0-SNAPSHOT/xmpbox-2.0.0-SNAPSHOT.pom
[JENKINS] Archiving <https://builds.apache.org/job/PDFBox-trunk/ws/trunk/xmpbox/target/xmpbox-2.0.0-SNAPSHOT.jar>
to org.apache.pdfbox/xmpbox/2.0.0-20140602.161840-346/xmpbox-2.0.0-20140602.161840-346.jar
[JENKINS] Archiving <https://builds.apache.org/job/PDFBox-trunk/ws/trunk/preflight-app/pom.xml>
to org.apache.pdfbox/preflight-app/2.0.0-SNAPSHOT/preflight-app-2.0.0-SNAPSHOT.pom
[JENKINS] Archiving <https://builds.apache.org/job/PDFBox-trunk/ws/trunk/preflight-app/target/preflight-app-2.0.0-SNAPSHOT.jar>
to org.apache.pdfbox/preflight-app/2.0.0-20140602.162240-330/preflight-app-2.0.0-20140602.162240-330.jar
[JENKINS] Archiving <https://builds.apache.org/job/PDFBox-trunk/ws/trunk/tools/pom.xml>
to org.apache.pdfbox/pdfbox-tools/2.0.0-SNAPSHOT/pdfbox-tools-2.0.0-SNAPSHOT.pom
[JENKINS] Archiving <https://builds.apache.org/job/PDFBox-trunk/ws/trunk/tools/target/pdfbox-tools-2.0.0-SNAPSHOT.jar>
to org.apache.pdfbox/pdfbox-tools/2.0.0-20140602.162314-193/pdfbox-tools-2.0.0-20140602.162314-193.jar
[JENKINS] Archiving <https://builds.apache.org/job/PDFBox-trunk/ws/trunk/examples/pom.xml>
to org.apache.pdfbox/pdfbox-examples/2.0.0-SNAPSHOT/pdfbox-examples-2.0.0-SNAPSHOT.pom
[JENKINS] Archiving <https://builds.apache.org/job/PDFBox-trunk/ws/trunk/examples/target/pdfbox-examples-2.0.0-SNAPSHOT.jar>
to org.apache.pdfbox/pdfbox-examples/2.0.0-20140602.162432-318/pdfbox-examples-2.0.0-20140602.162432-318.jar
[JENKINS] Archiving <https://builds.apache.org/job/PDFBox-trunk/ws/trunk/preflight/pom.xml>
to org.apache.pdfbox/preflight/2.0.0-SNAPSHOT/preflight-2.0.0-SNAPSHOT.pom
[JENKINS] Archiving <https://builds.apache.org/job/PDFBox-trunk/ws/trunk/preflight/target/preflight-2.0.0-SNAPSHOT.jar>
to org.apache.pdfbox/preflight/2.0.0-20140602.162205-332/preflight-2.0.0-20140602.162205-332.jar
[JENKINS] Archiving <https://builds.apache.org/job/PDFBox-trunk/ws/trunk/parent/pom.xml>
to org.apache.pdfbox/pdfbox-parent/2.0.0-SNAPSHOT/pdfbox-parent-2.0.0-SNAPSHOT.pom
[JENKINS] Archiving <https://builds.apache.org/job/PDFBox-trunk/ws/trunk/jempbox/pom.xml>
to org.apache.pdfbox/jempbox/2.0.0-SNAPSHOT/jempbox-2.0.0-SNAPSHOT.pom
[JENKINS] Archiving <https://builds.apache.org/job/PDFBox-trunk/ws/trunk/jempbox/target/jempbox-2.0.0-SNAPSHOT.jar>
to org.apache.pdfbox/jempbox/2.0.0-20140602.161758-347/jempbox-2.0.0-20140602.161758-347.jar
Sending e-mails to: dev@pdfbox.apache.org
channel stopped
Archiving artifacts

Mime
View raw message