pdfbox-dev mailing list archives

Site index · List index
Message view « Date » · « Thread »
Top « Date » · « Thread »
From Apache Jenkins Server <jenk...@builds.apache.org>
Subject Build failed in Jenkins: PDFBox-trunk #485
Date Sat, 26 May 2012 17:07:12 GMT
See <https://builds.apache.org/job/PDFBox-trunk/485/changes>

Changes:

[jeremias] PDFBOX-1323: Fix for wrong glyphs being painted when a CIDFontType2 for a subset
TTF is substituted.

------------------------------------------
[...truncated 842 lines...]
[INFO] --- maven-bundle-plugin:2.0.0:bundle (default-bundle) @ pdfbox-app ---
mojoSucceeded org.apache.felix:maven-bundle-plugin:2.0.0(default-bundle)
mojoStarted org.apache.maven.plugins:maven-site-plugin:3.0(attach-descriptor)
[INFO] 
[INFO] --- maven-site-plugin:3.0:attach-descriptor (attach-descriptor) @ pdfbox-app ---
mojoSucceeded org.apache.maven.plugins:maven-site-plugin:3.0(attach-descriptor)
mojoStarted org.apache.rat:apache-rat-plugin:0.6(default)[INFO] Exclude: release.properties
[INFO] Exclude: preflight/src/test/resources/org/apache/padaf/preflight/font/*.font

[INFO] 
[INFO] --- apache-rat-plugin:0.6:check (default) @ pdfbox-app ---
mojoSucceeded org.apache.rat:apache-rat-plugin:0.6(default)
mojoStarted org.apache.maven.plugins:maven-install-plugin:2.3.1(default-install)[INFO] Installing
<https://builds.apache.org/job/PDFBox-trunk/ws/trunk/app/target/pdfbox-app-1.8.0-SNAPSHOT.jar>
to /home/jenkins/jenkins-slave/maven-repositories/0/org/apache/pdfbox/pdfbox-app/1.8.0-SNAPSHOT/pdfbox-app-1.8.0-SNAPSHOT.jar
[INFO] Installing <https://builds.apache.org/job/PDFBox-trunk/ws/trunk/app/pom.xml>
to /home/jenkins/jenkins-slave/maven-repositories/0/org/apache/pdfbox/pdfbox-app/1.8.0-SNAPSHOT/pdfbox-app-1.8.0-SNAPSHOT.pom

[INFO] 
[INFO] --- maven-install-plugin:2.3.1:install (default-install) @ pdfbox-app ---
mojoSucceeded org.apache.maven.plugins:maven-install-plugin:2.3.1(default-install)
mojoStarted org.apache.felix:maven-bundle-plugin:2.0.0(default-install)[INFO] Parsing file:/home/jenkins/jenkins-slave/maven-repositories/0/repository.xml

[INFO] 
[INFO] --- maven-bundle-plugin:2.0.0:install (default-install) @ pdfbox-app ---
[INFO] Installing org/apache/pdfbox/pdfbox-app/1.8.0-SNAPSHOT/pdfbox-app-1.8.0-SNAPSHOT.jar
[INFO] Writing OBR metadata
mojoSucceeded org.apache.felix:maven-bundle-plugin:2.0.0(default-install)
mojoStarted org.apache.maven.plugins:maven-deploy-plugin:2.6(default-deploy)Downloading: https://repository.apache.org/content/repositories/snapshots/org/apache/pdfbox/pdfbox-app/1.8.0-SNAPSHOT/maven-metadata.xml

[INFO] 
[INFO] --- maven-deploy-plugin:2.6:deploy (default-deploy) @ pdfbox-app ---
Downloaded: https://repository.apache.org/content/repositories/snapshots/org/apache/pdfbox/pdfbox-app/1.8.0-SNAPSHOT/maven-metadata.xml
(777 B at 2.5 KB/sec)
Uploading: https://repository.apache.org/content/repositories/snapshots/org/apache/pdfbox/pdfbox-app/1.8.0-SNAPSHOT/pdfbox-app-1.8.0-20120526.170517-2.jar
Uploaded: https://repository.apache.org/content/repositories/snapshots/org/apache/pdfbox/pdfbox-app/1.8.0-SNAPSHOT/pdfbox-app-1.8.0-20120526.170517-2.jar
(10161 KB at 5524.9 KB/sec)
Uploading: https://repository.apache.org/content/repositories/snapshots/org/apache/pdfbox/pdfbox-app/1.8.0-SNAPSHOT/pdfbox-app-1.8.0-20120526.170517-2.pom
Uploaded: https://repository.apache.org/content/repositories/snapshots/org/apache/pdfbox/pdfbox-app/1.8.0-SNAPSHOT/pdfbox-app-1.8.0-20120526.170517-2.pom
(4 KB at 19.0 KB/sec)
Downloading: https://repository.apache.org/content/repositories/snapshots/org/apache/pdfbox/pdfbox-app/maven-metadata.xml
Downloaded: https://repository.apache.org/content/repositories/snapshots/org/apache/pdfbox/pdfbox-app/maven-metadata.xml
(488 B at 2.3 KB/sec)
Uploading: https://repository.apache.org/content/repositories/snapshots/org/apache/pdfbox/pdfbox-app/1.8.0-SNAPSHOT/maven-metadata.xml
Uploaded: https://repository.apache.org/content/repositories/snapshots/org/apache/pdfbox/pdfbox-app/1.8.0-SNAPSHOT/maven-metadata.xml
(777 B at 3.2 KB/sec)
Uploading: https://repository.apache.org/content/repositories/snapshots/org/apache/pdfbox/pdfbox-app/maven-metadata.xml
Uploaded: https://repository.apache.org/content/repositories/snapshots/org/apache/pdfbox/pdfbox-app/maven-metadata.xml
(467 B at 2.8 KB/sec)
mojoSucceeded org.apache.maven.plugins:maven-deploy-plugin:2.6(default-deploy)
mojoStarted org.apache.felix:maven-bundle-plugin:2.0.0(default-deploy)[INFO] Remote OBR update
disabled (enable with -DremoteOBR)

[INFO] 
[INFO] --- maven-bundle-plugin:2.0.0:deploy (default-deploy) @ pdfbox-app ---
mojoSucceeded org.apache.felix:maven-bundle-plugin:2.0.0(default-deploy)
projectSucceeded org.apache.pdfbox:pdfbox-app:1.8.0-SNAPSHOT
projectStarted org.apache.pdfbox:pdfbox-examples:1.8.0-SNAPSHOT
[INFO] [INFO] Deleting <https://builds.apache.org/job/PDFBox-trunk/ws/trunk/examples/target>
                                                                        
[INFO] ------------------------------------------------------------------------
[INFO] Building Apache PDFBox examples 1.8.0-SNAPSHOT
[INFO] ------------------------------------------------------------------------
mojoStarted org.apache.maven.plugins:maven-clean-plugin:2.4.1(default-clean)
[INFO] 
[INFO] --- maven-clean-plugin:2.4.1:clean (default-clean) @ pdfbox-examples ---
mojoSucceeded org.apache.maven.plugins:maven-clean-plugin:2.4.1(default-clean)
mojoStarted org.apache.maven.plugins:maven-remote-resources-plugin:1.2.1(default)
[INFO] 
[INFO] --- maven-remote-resources-plugin:1.2.1:process (default) @ pdfbox-examples ---
mojoSucceeded org.apache.maven.plugins:maven-remote-resources-plugin:1.2.1(default)
[debug] execute contextualize
mojoStarted org.apache.maven.plugins:maven-resources-plugin:2.5(default-resources)[INFO] Using
'ISO-8859-1' encoding to copy filtered resources.
[INFO] skip non existing resourceDirectory <https://builds.apache.org/job/PDFBox-trunk/ws/trunk/examples/src/main/resources>
[INFO] Copying 3 resources

[INFO] 
[INFO] --- maven-resources-plugin:2.5:resources (default-resources) @ pdfbox-examples ---
mojoSucceeded org.apache.maven.plugins:maven-resources-plugin:2.5(default-resources)
mojoStarted org.apache.maven.plugins:maven-compiler-plugin:2.3.2(default-compile)
[INFO] 
[INFO] --- maven-compiler-plugin:2.3.2:compile (default-compile) @ pdfbox-examples ---
[INFO] Compiling 34 source files to <https://builds.apache.org/job/PDFBox-trunk/ws/trunk/examples/target/classes>
mojoSucceeded org.apache.maven.plugins:maven-compiler-plugin:2.3.2(default-compile)
mojoStarted org.apache.maven.plugins:maven-resources-plugin:2.5(default-testResources)[debug]
execute contextualize
[INFO] Using 'ISO-8859-1' encoding to copy filtered resources.
[INFO] skip non existing resourceDirectory <https://builds.apache.org/job/PDFBox-trunk/ws/trunk/examples/src/test/resources>
[INFO] Copying 3 resources

[INFO] 
[INFO] --- maven-resources-plugin:2.5:testResources (default-testResources) @ pdfbox-examples
---
mojoSucceeded org.apache.maven.plugins:maven-resources-plugin:2.5(default-testResources)
mojoStarted org.apache.maven.plugins:maven-compiler-plugin:2.3.2(default-testCompile)[INFO]
No sources to compile

[INFO] 
[INFO] --- maven-compiler-plugin:2.3.2:testCompile (default-testCompile) @ pdfbox-examples
---
mojoSucceeded org.apache.maven.plugins:maven-compiler-plugin:2.3.2(default-testCompile)
mojoStarted org.apache.maven.plugins:maven-surefire-plugin:2.9(default-test)[INFO] Surefire
report directory: <https://builds.apache.org/job/PDFBox-trunk/ws/trunk/examples/target/surefire-reports>

-------------------------------------------------------
 T E S T S
-------------------------------------------------------

[INFO] 
[INFO] --- maven-surefire-plugin:2.9:test (default-test) @ pdfbox-examples ---

Results :

Tests run: 0, Failures: 0, Errors: 0, Skipped: 0

mojoSucceeded org.apache.maven.plugins:maven-surefire-plugin:2.9(default-test)
[JENKINS] Recording test results
mojoStarted org.apache.maven.plugins:maven-jar-plugin:2.3.1(default-jar)
[INFO] 
[INFO] --- maven-jar-plugin:2.3.1:jar (default-jar) @ pdfbox-examples ---
[INFO] Building jar: <https://builds.apache.org/job/PDFBox-trunk/ws/trunk/examples/target/pdfbox-examples-1.8.0-SNAPSHOT.jar>
mojoSucceeded org.apache.maven.plugins:maven-jar-plugin:2.3.1(default-jar)
mojoStarted org.apache.maven.plugins:maven-site-plugin:3.0(attach-descriptor)
[INFO] 
[INFO] --- maven-site-plugin:3.0:attach-descriptor (attach-descriptor) @ pdfbox-examples ---
mojoSucceeded org.apache.maven.plugins:maven-site-plugin:3.0(attach-descriptor)
mojoStarted org.apache.rat:apache-rat-plugin:0.6(default)[INFO] Exclude: release.properties
[INFO] Exclude: preflight/src/test/resources/org/apache/padaf/preflight/font/*.font

[INFO] 
[INFO] --- apache-rat-plugin:0.6:check (default) @ pdfbox-examples ---
mojoSucceeded org.apache.rat:apache-rat-plugin:0.6(default)
mojoStarted org.apache.maven.plugins:maven-install-plugin:2.3.1(default-install)[INFO] Installing
<https://builds.apache.org/job/PDFBox-trunk/ws/trunk/examples/target/pdfbox-examples-1.8.0-SNAPSHOT.jar>
to /home/jenkins/jenkins-slave/maven-repositories/0/org/apache/pdfbox/pdfbox-examples/1.8.0-SNAPSHOT/pdfbox-examples-1.8.0-SNAPSHOT.jar
[INFO] Installing <https://builds.apache.org/job/PDFBox-trunk/ws/trunk/examples/pom.xml>
to /home/jenkins/jenkins-slave/maven-repositories/0/org/apache/pdfbox/pdfbox-examples/1.8.0-SNAPSHOT/pdfbox-examples-1.8.0-SNAPSHOT.pom

[INFO] 
[INFO] --- maven-install-plugin:2.3.1:install (default-install) @ pdfbox-examples ---
mojoSucceeded org.apache.maven.plugins:maven-install-plugin:2.3.1(default-install)
mojoStarted org.apache.maven.plugins:maven-deploy-plugin:2.6(default-deploy)Downloading: https://repository.apache.org/content/repositories/snapshots/org/apache/pdfbox/pdfbox-examples/1.8.0-SNAPSHOT/maven-metadata.xml

[INFO] 
[INFO] --- maven-deploy-plugin:2.6:deploy (default-deploy) @ pdfbox-examples ---
Downloaded: https://repository.apache.org/content/repositories/snapshots/org/apache/pdfbox/pdfbox-examples/1.8.0-SNAPSHOT/maven-metadata.xml
(782 B at 1.0 KB/sec)
Uploading: https://repository.apache.org/content/repositories/snapshots/org/apache/pdfbox/pdfbox-examples/1.8.0-SNAPSHOT/pdfbox-examples-1.8.0-20120526.170525-2.jar
Uploaded: https://repository.apache.org/content/repositories/snapshots/org/apache/pdfbox/pdfbox-examples/1.8.0-SNAPSHOT/pdfbox-examples-1.8.0-20120526.170525-2.jar
(70 KB at 206.2 KB/sec)
Uploading: https://repository.apache.org/content/repositories/snapshots/org/apache/pdfbox/pdfbox-examples/1.8.0-SNAPSHOT/pdfbox-examples-1.8.0-20120526.170525-2.pom
Uploaded: https://repository.apache.org/content/repositories/snapshots/org/apache/pdfbox/pdfbox-examples/1.8.0-SNAPSHOT/pdfbox-examples-1.8.0-20120526.170525-2.pom
(2 KB at 14.9 KB/sec)
Downloading: https://repository.apache.org/content/repositories/snapshots/org/apache/pdfbox/pdfbox-examples/maven-metadata.xml
Downloaded: https://repository.apache.org/content/repositories/snapshots/org/apache/pdfbox/pdfbox-examples/maven-metadata.xml
(413 B at 1.6 KB/sec)
Uploading: https://repository.apache.org/content/repositories/snapshots/org/apache/pdfbox/pdfbox-examples/1.8.0-SNAPSHOT/maven-metadata.xml
Uploaded: https://repository.apache.org/content/repositories/snapshots/org/apache/pdfbox/pdfbox-examples/1.8.0-SNAPSHOT/maven-metadata.xml
(782 B at 3.5 KB/sec)
Uploading: https://repository.apache.org/content/repositories/snapshots/org/apache/pdfbox/pdfbox-examples/maven-metadata.xml
Uploaded: https://repository.apache.org/content/repositories/snapshots/org/apache/pdfbox/pdfbox-examples/maven-metadata.xml
(392 B at 2.3 KB/sec)
mojoSucceeded org.apache.maven.plugins:maven-deploy-plugin:2.6(default-deploy)
projectSucceeded org.apache.pdfbox:pdfbox-examples:1.8.0-SNAPSHOT
projectStarted org.apache.pdfbox:pdfbox-reactor:1.8.0-SNAPSHOT
[INFO] [INFO] Deleting <https://builds.apache.org/job/PDFBox-trunk/ws/trunk/target>
                                                                        
[INFO] ------------------------------------------------------------------------
[INFO] Building PDFBox reactor 1.8.0-SNAPSHOT
[INFO] ------------------------------------------------------------------------
mojoStarted org.apache.maven.plugins:maven-clean-plugin:2.4.1(default-clean)
[INFO] 
[INFO] --- maven-clean-plugin:2.4.1:clean (default-clean) @ pdfbox-reactor ---
mojoSucceeded org.apache.maven.plugins:maven-clean-plugin:2.4.1(default-clean)
mojoStarted org.apache.maven.plugins:maven-remote-resources-plugin:1.2.1(default)
[INFO] 
[INFO] --- maven-remote-resources-plugin:1.2.1:process (default) @ pdfbox-reactor ---
mojoSucceeded org.apache.maven.plugins:maven-remote-resources-plugin:1.2.1(default)
mojoStarted org.apache.maven.plugins:maven-site-plugin:3.0(attach-descriptor)
[INFO] 
[INFO] --- maven-site-plugin:3.0:attach-descriptor (attach-descriptor) @ pdfbox-reactor ---
mojoSucceeded org.apache.maven.plugins:maven-site-plugin:3.0(attach-descriptor)
mojoStarted org.apache.rat:apache-rat-plugin:0.6(default)[INFO] Exclude: release.properties
[INFO] Exclude: preflight/src/test/resources/org/apache/padaf/preflight/font/*.font

[INFO] 
[INFO] --- apache-rat-plugin:0.6:check (default) @ pdfbox-reactor ---
mojoFailed org.apache.rat:apache-rat-plugin:0.6(default)
projectFailed org.apache.pdfbox:pdfbox-reactor:1.8.0-SNAPSHOT
sessionEnded
[INFO] ------------------------------------------------------------------------
[INFO] Reactor Summary:
[INFO] 
[INFO] PDFBox parent ..................................... SUCCESS [21.479s]
[INFO] Apache FontBox .................................... SUCCESS [23.556s]
[INFO] Apache JempBox .................................... SUCCESS [9.456s]
[INFO] Apache PDFBox ..................................... SUCCESS [58.149s]
[INFO] Apache PDFBox for Lucene .......................... SUCCESS [10.331s]
[INFO] Apache PDFBox for Ant ............................. SUCCESS [10.007s]
[INFO] Apache PDFBox webapp .............................. SUCCESS [11.354s]
[INFO] Apache PDFBox application ......................... SUCCESS [12.427s]
[INFO] Apache PDFBox examples ............................ SUCCESS [5.967s]
[INFO] PDFBox reactor .................................... FAILURE [4.888s]
[INFO] ------------------------------------------------------------------------
[INFO] BUILD FAILURE
[INFO] ------------------------------------------------------------------------
[INFO] Total time: 2:54.297s
[INFO] Finished at: Sat May 26 17:05:31 UTC 2012
[INFO] Final Memory: 36M/305M
[INFO] ------------------------------------------------------------------------
Projects to build: [MavenProject: org.apache.pdfbox:pdfbox-parent:1.8.0-SNAPSHOT @ <https://builds.apache.org/job/PDFBox-trunk/ws/trunk/parent/pom.xml,>
MavenProject: org.apache.pdfbox:fontbox:1.8.0-SNAPSHOT @ <https://builds.apache.org/job/PDFBox-trunk/ws/trunk/fontbox/pom.xml,>
MavenProject: org.apache.pdfbox:jempbox:1.8.0-SNAPSHOT @ <https://builds.apache.org/job/PDFBox-trunk/ws/trunk/jempbox/pom.xml,>
MavenProject: org.apache.pdfbox:pdfbox:1.8.0-SNAPSHOT @ <https://builds.apache.org/job/PDFBox-trunk/ws/trunk/pdfbox/pom.xml,>
MavenProject: org.apache.pdfbox:pdfbox-lucene:1.8.0-SNAPSHOT @ <https://builds.apache.org/job/PDFBox-trunk/ws/trunk/lucene/pom.xml,>
MavenProject: org.apache.pdfbox:pdfbox-ant:1.8.0-SNAPSHOT @ <https://builds.apache.org/job/PDFBox-trunk/ws/trunk/ant/pom.xml,>
MavenProject: org.apache.pdfbox:pdfbox-war:1.8.0-SNAPSHOT @ <https://builds.apache.org/job/PDFBox-trunk/ws/trunk/war/pom.xml,>
MavenProject: org.apache.pdfbox:pdfbox-app:1.8.0-SNAPSHOT @ <https://builds.apache.org/job/PDFBox-trunk/ws/trunk/app/pom.xml,>
MavenProject: org.apache.pdfbox:pdfbox-examples:1.8.0-SNAPSHOT @ <https://builds.apache.org/job/PDFBox-trunk/ws/trunk/examples/pom.xml,>
MavenProject: org.apache.pdfbox:pdfbox-reactor:1.8.0-SNAPSHOT @ <https://builds.apache.org/job/PDFBox-trunk/ws/trunk/pom.xml]>
[JENKINS] Archiving <https://builds.apache.org/job/PDFBox-trunk/ws/trunk/pom.xml> to
/home/hudson/hudson/jobs/PDFBox-trunk/modules/org.apache.pdfbox$pdfbox-reactor/builds/2012-05-26_17-02-25/archive/org.apache.pdfbox/pdfbox-reactor/1.8.0-SNAPSHOT/pdfbox-reactor-1.8.0-SNAPSHOT.pom
[JENKINS] Archiving <https://builds.apache.org/job/PDFBox-trunk/ws/trunk/lucene/pom.xml>
to /home/hudson/hudson/jobs/PDFBox-trunk/modules/org.apache.pdfbox$pdfbox-lucene/builds/2012-05-26_17-02-25/archive/org.apache.pdfbox/pdfbox-lucene/1.8.0-SNAPSHOT/pdfbox-lucene-1.8.0-SNAPSHOT.pom
[JENKINS] Archiving <https://builds.apache.org/job/PDFBox-trunk/ws/trunk/lucene/target/pdfbox-lucene-1.8.0-SNAPSHOT.jar>
to /home/hudson/hudson/jobs/PDFBox-trunk/modules/org.apache.pdfbox$pdfbox-lucene/builds/2012-05-26_17-02-25/archive/org.apache.pdfbox/pdfbox-lucene/1.8.0-20120526.170443-2/pdfbox-lucene-1.8.0-20120526.170443-2.jar
[JENKINS] Archiving <https://builds.apache.org/job/PDFBox-trunk/ws/trunk/examples/pom.xml>
to /home/hudson/hudson/jobs/PDFBox-trunk/modules/org.apache.pdfbox$pdfbox-examples/builds/2012-05-26_17-02-25/archive/org.apache.pdfbox/pdfbox-examples/1.8.0-SNAPSHOT/pdfbox-examples-1.8.0-SNAPSHOT.pom
[JENKINS] Archiving <https://builds.apache.org/job/PDFBox-trunk/ws/trunk/examples/target/pdfbox-examples-1.8.0-SNAPSHOT.jar>
to /home/hudson/hudson/jobs/PDFBox-trunk/modules/org.apache.pdfbox$pdfbox-examples/builds/2012-05-26_17-02-25/archive/org.apache.pdfbox/pdfbox-examples/1.8.0-20120526.170525-2/pdfbox-examples-1.8.0-20120526.170525-2.jar
[JENKINS] Archiving <https://builds.apache.org/job/PDFBox-trunk/ws/trunk/pdfbox/pom.xml>
to /home/hudson/hudson/jobs/PDFBox-trunk/modules/org.apache.pdfbox$pdfbox/builds/2012-05-26_17-02-25/archive/org.apache.pdfbox/pdfbox/1.8.0-SNAPSHOT/pdfbox-1.8.0-SNAPSHOT.pom
[JENKINS] Archiving <https://builds.apache.org/job/PDFBox-trunk/ws/trunk/pdfbox/target/pdfbox-1.8.0-SNAPSHOT.jar>
to /home/hudson/hudson/jobs/PDFBox-trunk/modules/org.apache.pdfbox$pdfbox/builds/2012-05-26_17-02-25/archive/org.apache.pdfbox/pdfbox/1.8.0-20120526.170430-2/pdfbox-1.8.0-20120526.170430-2.jar
[JENKINS] Archiving <https://builds.apache.org/job/PDFBox-trunk/ws/trunk/parent/pom.xml>
to /home/hudson/hudson/jobs/PDFBox-trunk/modules/org.apache.pdfbox$pdfbox-parent/builds/2012-05-26_17-02-25/archive/org.apache.pdfbox/pdfbox-parent/1.8.0-SNAPSHOT/pdfbox-parent-1.8.0-SNAPSHOT.pom
[JENKINS] Archiving <https://builds.apache.org/job/PDFBox-trunk/ws/trunk/app/pom.xml>
to /home/hudson/hudson/jobs/PDFBox-trunk/modules/org.apache.pdfbox$pdfbox-app/builds/2012-05-26_17-02-25/archive/org.apache.pdfbox/pdfbox-app/1.8.0-SNAPSHOT/pdfbox-app-1.8.0-SNAPSHOT.pom
[JENKINS] Archiving <https://builds.apache.org/job/PDFBox-trunk/ws/trunk/app/target/pdfbox-app-1.8.0-SNAPSHOT.jar>
to /home/hudson/hudson/jobs/PDFBox-trunk/modules/org.apache.pdfbox$pdfbox-app/builds/2012-05-26_17-02-25/archive/org.apache.pdfbox/pdfbox-app/1.8.0-20120526.170517-2/pdfbox-app-1.8.0-20120526.170517-2.jar
[JENKINS] Archiving <https://builds.apache.org/job/PDFBox-trunk/ws/trunk/war/pom.xml>
to /home/hudson/hudson/jobs/PDFBox-trunk/modules/org.apache.pdfbox$pdfbox-war/builds/2012-05-26_17-02-25/archive/org.apache.pdfbox/pdfbox-war/1.8.0-SNAPSHOT/pdfbox-war-1.8.0-SNAPSHOT.pom
[JENKINS] Archiving <https://builds.apache.org/job/PDFBox-trunk/ws/trunk/war/target/pdfbox-war-1.8.0-SNAPSHOT.war>
to /home/hudson/hudson/jobs/PDFBox-trunk/modules/org.apache.pdfbox$pdfbox-war/builds/2012-05-26_17-02-25/archive/org.apache.pdfbox/pdfbox-war/1.8.0-20120526.170505-2/pdfbox-war-1.8.0-20120526.170505-2.war
[JENKINS] Archiving <https://builds.apache.org/job/PDFBox-trunk/ws/trunk/ant/pom.xml>
to /home/hudson/hudson/jobs/PDFBox-trunk/modules/org.apache.pdfbox$pdfbox-ant/builds/2012-05-26_17-02-25/archive/org.apache.pdfbox/pdfbox-ant/1.8.0-SNAPSHOT/pdfbox-ant-1.8.0-SNAPSHOT.pom
[JENKINS] Archiving <https://builds.apache.org/job/PDFBox-trunk/ws/trunk/ant/target/pdfbox-ant-1.8.0-SNAPSHOT.jar>
to /home/hudson/hudson/jobs/PDFBox-trunk/modules/org.apache.pdfbox$pdfbox-ant/builds/2012-05-26_17-02-25/archive/org.apache.pdfbox/pdfbox-ant/1.8.0-20120526.170453-2/pdfbox-ant-1.8.0-20120526.170453-2.jar
[JENKINS] Archiving <https://builds.apache.org/job/PDFBox-trunk/ws/trunk/fontbox/pom.xml>
to /home/hudson/hudson/jobs/PDFBox-trunk/modules/org.apache.pdfbox$fontbox/builds/2012-05-26_17-02-25/archive/org.apache.pdfbox/fontbox/1.8.0-SNAPSHOT/fontbox-1.8.0-SNAPSHOT.pom
[JENKINS] Archiving <https://builds.apache.org/job/PDFBox-trunk/ws/trunk/fontbox/target/fontbox-1.8.0-SNAPSHOT.jar>
to /home/hudson/hudson/jobs/PDFBox-trunk/modules/org.apache.pdfbox$fontbox/builds/2012-05-26_17-02-25/archive/org.apache.pdfbox/fontbox/1.8.0-20120526.170323-2/fontbox-1.8.0-20120526.170323-2.jar
[JENKINS] Archiving <https://builds.apache.org/job/PDFBox-trunk/ws/trunk/jempbox/pom.xml>
to /home/hudson/hudson/jobs/PDFBox-trunk/modules/org.apache.pdfbox$jempbox/builds/2012-05-26_17-02-25/archive/org.apache.pdfbox/jempbox/1.8.0-SNAPSHOT/jempbox-1.8.0-SNAPSHOT.pom
[JENKINS] Archiving <https://builds.apache.org/job/PDFBox-trunk/ws/trunk/jempbox/target/jempbox-1.8.0-SNAPSHOT.jar>
to /home/hudson/hudson/jobs/PDFBox-trunk/modules/org.apache.pdfbox$jempbox/builds/2012-05-26_17-02-25/archive/org.apache.pdfbox/jempbox/1.8.0-20120526.170333-2/jempbox-1.8.0-20120526.170333-2.jar
Waiting for Jenkins to finish collecting data
mavenExecutionResult exceptions not empty
message : Failed to execute goal org.apache.rat:apache-rat-plugin:0.6:check (default) on project
pdfbox-reactor: Too many unapproved licenses: 82
cause : Too many unapproved licenses: 82
Stack trace : 
org.apache.maven.lifecycle.LifecycleExecutionException: Failed to execute goal org.apache.rat:apache-rat-plugin:0.6:check
(default) on project pdfbox-reactor: Too many unapproved licenses: 82
	at org.apache.maven.lifecycle.internal.MojoExecutor.execute(MojoExecutor.java:213)
	at org.apache.maven.lifecycle.internal.MojoExecutor.execute(MojoExecutor.java:153)
	at org.apache.maven.lifecycle.internal.MojoExecutor.execute(MojoExecutor.java:145)
	at org.apache.maven.lifecycle.internal.LifecycleModuleBuilder.buildProject(LifecycleModuleBuilder.java:84)
	at org.apache.maven.lifecycle.internal.LifecycleModuleBuilder.buildProject(LifecycleModuleBuilder.java:59)
	at org.apache.maven.lifecycle.internal.LifecycleStarter.singleThreadedBuild(LifecycleStarter.java:183)
	at org.apache.maven.lifecycle.internal.LifecycleStarter.execute(LifecycleStarter.java:161)
	at org.apache.maven.DefaultMaven.doExecute(DefaultMaven.java:319)
	at org.apache.maven.DefaultMaven.execute(DefaultMaven.java:156)
	at org.jvnet.hudson.maven3.launcher.Maven3Launcher.main(Maven3Launcher.java:79)
	at sun.reflect.NativeMethodAccessorImpl.invoke0(Native Method)
	at sun.reflect.NativeMethodAccessorImpl.invoke(NativeMethodAccessorImpl.java:39)
	at sun.reflect.DelegatingMethodAccessorImpl.invoke(DelegatingMethodAccessorImpl.java:25)
	at java.lang.reflect.Method.invoke(Method.java:592)
	at org.codehaus.plexus.classworlds.launcher.Launcher.launchStandard(Launcher.java:329)
	at org.codehaus.plexus.classworlds.launcher.Launcher.launch(Launcher.java:239)
	at org.jvnet.hudson.maven3.agent.Maven3Main.launch(Maven3Main.java:158)
	at hudson.maven.Maven3Builder.call(Maven3Builder.java:98)
	at hudson.maven.Maven3Builder.call(Maven3Builder.java:64)
	at hudson.remoting.UserRequest.perform(UserRequest.java:118)
	at hudson.remoting.UserRequest.perform(UserRequest.java:48)
	at hudson.remoting.Request$2.run(Request.java:287)
	at hudson.remoting.InterceptingExecutorService$1.call(InterceptingExecutorService.java:72)
	at java.util.concurrent.FutureTask$Sync.innerRun(FutureTask.java:269)
	at java.util.concurrent.FutureTask.run(FutureTask.java:123)
	at java.util.concurrent.ThreadPoolExecutor$Worker.runTask(ThreadPoolExecutor.java:651)
	at java.util.concurrent.ThreadPoolExecutor$Worker.run(ThreadPoolExecutor.java:676)
	at java.lang.Thread.run(Thread.java:595)
Caused by: org.apache.rat.mp.RatCheckException: Too many unapproved licenses: 82
	at org.apache.rat.mp.RatCheckMojo.check(RatCheckMojo.java:223)
	at org.apache.rat.mp.RatCheckMojo.check(RatCheckMojo.java:215)
	at org.apache.rat.mp.RatCheckMojo.execute(RatCheckMojo.java:171)
	at org.apache.maven.plugin.DefaultBuildPluginManager.executeMojo(DefaultBuildPluginManager.java:101)
	at org.apache.maven.lifecycle.internal.MojoExecutor.execute(MojoExecutor.java:209)
	... 27 more
Sending e-mails to: dev@pdfbox.apache.org
channel stopped
Archiving artifacts

Mime
View raw message