pdfbox-dev mailing list archives

Site index · List index
Message view « Date » · « Thread »
Top « Date » · « Thread »
From Apache Jenkins Server <jenk...@builds.apache.org>
Subject Build failed in Jenkins: PDFBox-trunk #459
Date Wed, 09 May 2012 20:18:55 GMT
See <https://builds.apache.org/job/PDFBox-trunk/459/changes>

Changes:

[gbailleul] PDFBOX-1279 : Javacc parser is now independent of jvm file encoding.
Specific source encoding of preflight removed

------------------------------------------
[...truncated 533 lines...]
Tests run: 28, Failures: 0, Errors: 0, Skipped: 0, Time elapsed: 0.104 sec
Running org.apache.padaf.xmpbox.schema.AdobePDFTest
Tests run: 6, Failures: 0, Errors: 0, Skipped: 0, Time elapsed: 0.014 sec
Running org.apache.padaf.xmpbox.schema.DublinCoreTest
Tests run: 30, Failures: 0, Errors: 0, Skipped: 0, Time elapsed: 0.101 sec
Running org.apache.padaf.xmpbox.schema.XmpRightsSchemaTest
Tests run: 10, Failures: 0, Errors: 0, Skipped: 0, Time elapsed: 0.021 sec
Running org.apache.padaf.xmpbox.schema.XMPSchemaTest
Tests run: 12, Failures: 0, Errors: 0, Skipped: 0, Time elapsed: 0.014 sec
Running org.apache.padaf.xmpbox.XMPMetaDataTest
Tests run: 4, Failures: 0, Errors: 0, Skipped: 0, Time elapsed: 0.005 sec
Running org.apache.padaf.xmpbox.type.SimpleMetadataPropertyTest
Tests run: 11, Failures: 0, Errors: 0, Skipped: 0, Time elapsed: 0.011 sec
Running org.apache.padaf.xmpbox.type.AttributeTest
Tests run: 2, Failures: 0, Errors: 0, Skipped: 0, Time elapsed: 0 sec
Running org.apache.padaf.xmpbox.type.ComplexMetadataPropertyTest
Tests run: 4, Failures: 0, Errors: 0, Skipped: 0, Time elapsed: 0.002 sec

Results :

Tests run: 163, Failures: 0, Errors: 0, Skipped: 0

mojoSucceeded org.apache.maven.plugins:maven-surefire-plugin:2.9(default-test)
[JENKINS] Recording test results
mojoStarted org.apache.felix:maven-bundle-plugin:2.0.0(default-bundle)
[INFO] 
[INFO] --- maven-bundle-plugin:2.0.0:bundle (default-bundle) @ xmpbox ---
mojoSucceeded org.apache.felix:maven-bundle-plugin:2.0.0(default-bundle)
mojoStarted org.apache.maven.plugins:maven-site-plugin:3.0(attach-descriptor)
[INFO] 
[INFO] --- maven-site-plugin:3.0:attach-descriptor (attach-descriptor) @ xmpbox ---
mojoSucceeded org.apache.maven.plugins:maven-site-plugin:3.0(attach-descriptor)
mojoStarted org.apache.rat:apache-rat-plugin:0.6(default)[INFO] Exclude: release.properties

[INFO] 
[INFO] --- apache-rat-plugin:0.6:check (default) @ xmpbox ---
mojoSucceeded org.apache.rat:apache-rat-plugin:0.6(default)
mojoStarted org.apache.maven.plugins:maven-install-plugin:2.3.1(default-install)[INFO] Installing
<https://builds.apache.org/job/PDFBox-trunk/ws/trunk/xmpbox/target/xmpbox-1.7.0-SNAPSHOT.jar>
to /home/jenkins/jenkins-slave/maven-repositories/1/org/apache/pdfbox/xmpbox/1.7.0-SNAPSHOT/xmpbox-1.7.0-SNAPSHOT.jar

[INFO] 
[INFO] --- maven-install-plugin:2.3.1:install (default-install) @ xmpbox ---
[INFO] Installing <https://builds.apache.org/job/PDFBox-trunk/ws/trunk/xmpbox/pom.xml>
to /home/jenkins/jenkins-slave/maven-repositories/1/org/apache/pdfbox/xmpbox/1.7.0-SNAPSHOT/xmpbox-1.7.0-SNAPSHOT.pom
mojoSucceeded org.apache.maven.plugins:maven-install-plugin:2.3.1(default-install)
mojoStarted org.apache.felix:maven-bundle-plugin:2.0.0(default-install)[INFO] Parsing file:/home/jenkins/jenkins-slave/maven-repositories/1/repository.xml

[INFO] 
[INFO] --- maven-bundle-plugin:2.0.0:install (default-install) @ xmpbox ---
[INFO] Installing org/apache/pdfbox/xmpbox/1.7.0-SNAPSHOT/xmpbox-1.7.0-SNAPSHOT.jar
[INFO] Writing OBR metadata
mojoSucceeded org.apache.felix:maven-bundle-plugin:2.0.0(default-install)
mojoStarted org.apache.maven.plugins:maven-deploy-plugin:2.6(default-deploy)Downloading: https://repository.apache.org/content/repositories/snapshots/org/apache/pdfbox/xmpbox/1.7.0-SNAPSHOT/maven-metadata.xml

[INFO] 
[INFO] --- maven-deploy-plugin:2.6:deploy (default-deploy) @ xmpbox ---
Downloaded: https://repository.apache.org/content/repositories/snapshots/org/apache/pdfbox/xmpbox/1.7.0-SNAPSHOT/maven-metadata.xml
(779 B at 2.1 KB/sec)
Uploading: https://repository.apache.org/content/repositories/snapshots/org/apache/pdfbox/xmpbox/1.7.0-SNAPSHOT/xmpbox-1.7.0-20120509.201804-125.jar
Uploaded: https://repository.apache.org/content/repositories/snapshots/org/apache/pdfbox/xmpbox/1.7.0-SNAPSHOT/xmpbox-1.7.0-20120509.201804-125.jar
(131 KB at 205.8 KB/sec)
Uploading: https://repository.apache.org/content/repositories/snapshots/org/apache/pdfbox/xmpbox/1.7.0-SNAPSHOT/xmpbox-1.7.0-20120509.201804-125.pom
Uploaded: https://repository.apache.org/content/repositories/snapshots/org/apache/pdfbox/xmpbox/1.7.0-SNAPSHOT/xmpbox-1.7.0-20120509.201804-125.pom
(5 KB at 33.0 KB/sec)
Downloading: https://repository.apache.org/content/repositories/snapshots/org/apache/pdfbox/xmpbox/maven-metadata.xml
Downloaded: https://repository.apache.org/content/repositories/snapshots/org/apache/pdfbox/xmpbox/maven-metadata.xml
(283 B at 1.1 KB/sec)
Uploading: https://repository.apache.org/content/repositories/snapshots/org/apache/pdfbox/xmpbox/1.7.0-SNAPSHOT/maven-metadata.xml
Uploaded: https://repository.apache.org/content/repositories/snapshots/org/apache/pdfbox/xmpbox/1.7.0-SNAPSHOT/maven-metadata.xml
(779 B at 3.0 KB/sec)
Uploading: https://repository.apache.org/content/repositories/snapshots/org/apache/pdfbox/xmpbox/maven-metadata.xml
Uploaded: https://repository.apache.org/content/repositories/snapshots/org/apache/pdfbox/xmpbox/maven-metadata.xml
(283 B at 1.6 KB/sec)
mojoSucceeded org.apache.maven.plugins:maven-deploy-plugin:2.6(default-deploy)
mojoStarted org.apache.felix:maven-bundle-plugin:2.0.0(default-deploy)[INFO] Remote OBR update
disabled (enable with -DremoteOBR)

[INFO] 
[INFO] --- maven-bundle-plugin:2.0.0:deploy (default-deploy) @ xmpbox ---
mojoSucceeded org.apache.felix:maven-bundle-plugin:2.0.0(default-deploy)
projectSucceeded org.apache.pdfbox:xmpbox:1.7.0-SNAPSHOT
projectStarted org.apache.pdfbox:preflight:1.7.0-SNAPSHOT
[INFO]                                                                         
[INFO] ------------------------------------------------------------------------
[INFO] Building Apache Preflight 1.7.0-SNAPSHOT
[INFO] ------------------------------------------------------------------------
mojoStarted org.apache.maven.plugins:maven-clean-plugin:2.4.1(default-clean)[INFO] Deleting
<https://builds.apache.org/job/PDFBox-trunk/ws/trunk/preflight/target>

[INFO] 
[INFO] --- maven-clean-plugin:2.4.1:clean (default-clean) @ preflight ---
mojoSucceeded org.apache.maven.plugins:maven-clean-plugin:2.4.1(default-clean)
mojoStarted org.codehaus.mojo:cobertura-maven-plugin:2.3(default)
[INFO] 
[INFO] --- cobertura-maven-plugin:2.3:clean (default) @ preflight ---
mojoSucceeded org.codehaus.mojo:cobertura-maven-plugin:2.3(default)
mojoStarted org.codehaus.mojo:javacc-maven-plugin:2.6(javacc)
[INFO] 
[INFO] --- javacc-maven-plugin:2.6:javacc (javacc) @ preflight ---
Java Compiler Compiler Version 5.0 (Parser Generator)
(type "javacc" with no arguments for help)
Reading from file <https://builds.apache.org/job/PDFBox-trunk/ws/trunk/preflight/src/main/javacc/pdf_full_grammar.jj>
. . .
Warning: Line 173, Column 3: Non-ASCII characters used in regular expression.
Please make sure you use the correct Reader when you create the parser, one that can handle
your character set.
File "TokenMgrError.java" does not exist.  Will create one.
File "ParseException.java" does not exist.  Will create one.
File "Token.java" does not exist.  Will create one.
File "SimpleCharStream.java" does not exist.  Will create one.
Parser generated with 0 errors and 1 warnings.
Java Compiler Compiler Version 5.0 (Parser Generator)
(type "javacc" with no arguments for help)
Reading from file <https://builds.apache.org/job/PDFBox-trunk/ws/trunk/preflight/src/main/javacc/pdf_extractor.jj>
. . .
File "TokenMgrError.java" does not exist.  Will create one.
File "ParseException.java" does not exist.  Will create one.
File "Token.java" does not exist.  Will create one.
File "SimpleCharStream.java" does not exist.  Will create one.
Parser generated successfully.
[INFO] Processed 2 grammars
mojoSucceeded org.codehaus.mojo:javacc-maven-plugin:2.6(javacc)
mojoStarted org.apache.maven.plugins:maven-remote-resources-plugin:1.2.1(default)
[INFO] 
[INFO] --- maven-remote-resources-plugin:1.2.1:process (default) @ preflight ---
mojoSucceeded org.apache.maven.plugins:maven-remote-resources-plugin:1.2.1(default)
mojoStarted org.apache.maven.plugins:maven-resources-plugin:2.5(default-resources)[debug]
execute contextualize
[INFO] Using 'ISO-8859-1' encoding to copy filtered resources.
[INFO] Copying 106 resources to ../filtered-sources/java

[INFO] 
[INFO] --- maven-resources-plugin:2.5:resources (default-resources) @ preflight ---
[INFO] Copying 0 resource
[INFO] Copying 3 resources
mojoSucceeded org.apache.maven.plugins:maven-resources-plugin:2.5(default-resources)
mojoStarted org.apache.maven.plugins:maven-compiler-plugin:2.3.2(default-compile)[INFO] Compiling
119 source files to <https://builds.apache.org/job/PDFBox-trunk/ws/trunk/preflight/target/classes>

[INFO] 
[INFO] --- maven-compiler-plugin:2.3.2:compile (default-compile) @ preflight ---
[INFO] -------------------------------------------------------------
[ERROR] COMPILATION ERROR : 
[INFO] -------------------------------------------------------------
[ERROR] <https://builds.apache.org/job/PDFBox-trunk/ws/trunk/preflight/target/generated-sources/javacc/org/apache/padaf/preflight/javacc/PDFParser.java>:[356,47]
cannot find symbol
symbol  : method getBytes(java.nio.charset.Charset)
location: class java.lang.String
[ERROR] <https://builds.apache.org/job/PDFBox-trunk/ws/trunk/preflight/target/generated-sources/javacc/org/apache/padaf/preflight/javacc/PDFParser.java>:[356,56]
inconvertible types
found   : <nulltype>
required: int
[ERROR] <https://builds.apache.org/job/PDFBox-trunk/ws/trunk/preflight/target/generated-sources/javacc/org/apache/padaf/preflight/javacc/PDFParser.java>:[359,53]
cannot find symbol
symbol  : method getBytes(java.nio.charset.Charset)
location: class java.lang.String
[ERROR] <https://builds.apache.org/job/PDFBox-trunk/ws/trunk/preflight/target/generated-sources/javacc/org/apache/padaf/preflight/javacc/PDFParser.java>:[359,105]
cannot find symbol
symbol  : method getBytes(java.nio.charset.Charset)
location: class java.lang.String
[ERROR] <https://builds.apache.org/job/PDFBox-trunk/ws/trunk/preflight/target/generated-sources/javacc/org/apache/padaf/preflight/javacc/PDFParser.java>:[364,53]
cannot find symbol
symbol  : method getBytes(java.nio.charset.Charset)
location: class java.lang.String
[ERROR] <https://builds.apache.org/job/PDFBox-trunk/ws/trunk/preflight/target/generated-sources/javacc/org/apache/padaf/preflight/javacc/PDFParser.java>:[364,105]
cannot find symbol
symbol  : method getBytes(java.nio.charset.Charset)
location: class java.lang.String
[ERROR] <https://builds.apache.org/job/PDFBox-trunk/ws/trunk/preflight/target/generated-sources/javacc/org/apache/padaf/preflight/javacc/PDFParser.java>:[368,53]
cannot find symbol
symbol  : method getBytes(java.nio.charset.Charset)
location: class java.lang.String
[ERROR] <https://builds.apache.org/job/PDFBox-trunk/ws/trunk/preflight/target/generated-sources/javacc/org/apache/padaf/preflight/javacc/PDFParser.java>:[368,105]
cannot find symbol
symbol  : method getBytes(java.nio.charset.Charset)
location: class java.lang.String
[ERROR] <https://builds.apache.org/job/PDFBox-trunk/ws/trunk/preflight/target/generated-sources/javacc/org/apache/padaf/preflight/javacc/PDFParser.java>:[386,40]
cannot find symbol
symbol  : method getBytes(java.nio.charset.Charset)
location: class java.lang.String
[ERROR] <https://builds.apache.org/job/PDFBox-trunk/ws/trunk/preflight/target/generated-sources/javacc/org/apache/padaf/preflight/javacc/PDFParser.java>:[387,87]
cannot find symbol
symbol  : method getBytes(java.nio.charset.Charset)
location: class java.lang.String
[ERROR] <https://builds.apache.org/job/PDFBox-trunk/ws/trunk/preflight/target/generated-sources/javacc/org/apache/padaf/preflight/javacc/PDFParser.java>:[394,35]
cannot find symbol
symbol  : method getBytes(java.nio.charset.Charset)
location: class java.lang.String
[INFO] 11 errors 
[INFO] -------------------------------------------------------------
mojoFailed org.apache.maven.plugins:maven-compiler-plugin:2.3.2(default-compile)
projectFailed org.apache.pdfbox:preflight:1.7.0-SNAPSHOT
sessionEnded
[INFO] ------------------------------------------------------------------------
[INFO] Reactor Summary:
[INFO] 
[INFO] PDFBox parent ..................................... SUCCESS [43.025s]
[INFO] Apache FontBox .................................... SUCCESS [23.277s]
[INFO] Apache JempBox .................................... SUCCESS [8.562s]
[INFO] Apache PDFBox ..................................... SUCCESS [56.355s]
[INFO] Apache XmpBox ..................................... SUCCESS [10.711s]
[INFO] Apache Preflight .................................. FAILURE [5.371s]
[INFO] Apache PDFBox for Lucene .......................... SKIPPED
[INFO] Apache PDFBox for Ant ............................. SKIPPED
[INFO] Apache PDFBox webapp .............................. SKIPPED
[INFO] Apache PDFBox application ......................... SKIPPED
[INFO] Apache PDFBox examples ............................ SKIPPED
[INFO] PDFBox reactor .................................... SKIPPED
[INFO] ------------------------------------------------------------------------
[INFO] BUILD FAILURE
[INFO] ------------------------------------------------------------------------
[INFO] Total time: 2:32.278s
[INFO] Finished at: Wed May 09 20:18:12 UTC 2012
[INFO] Final Memory: 41M/316M
[INFO] ------------------------------------------------------------------------
Projects to build: [MavenProject: org.apache.pdfbox:pdfbox-parent:1.7.0-SNAPSHOT @ <https://builds.apache.org/job/PDFBox-trunk/ws/trunk/parent/pom.xml,>
MavenProject: org.apache.pdfbox:fontbox:1.7.0-SNAPSHOT @ <https://builds.apache.org/job/PDFBox-trunk/ws/trunk/fontbox/pom.xml,>
MavenProject: org.apache.pdfbox:jempbox:1.7.0-SNAPSHOT @ <https://builds.apache.org/job/PDFBox-trunk/ws/trunk/jempbox/pom.xml,>
MavenProject: org.apache.pdfbox:pdfbox:1.7.0-SNAPSHOT @ <https://builds.apache.org/job/PDFBox-trunk/ws/trunk/pdfbox/pom.xml,>
MavenProject: org.apache.pdfbox:xmpbox:1.7.0-SNAPSHOT @ <https://builds.apache.org/job/PDFBox-trunk/ws/trunk/xmpbox/pom.xml,>
MavenProject: org.apache.pdfbox:preflight:1.7.0-SNAPSHOT @ <https://builds.apache.org/job/PDFBox-trunk/ws/trunk/preflight/pom.xml,>
MavenProject: org.apache.pdfbox:pdfbox-lucene:1.7.0-SNAPSHOT @ <https://builds.apache.org/job/PDFBox-trunk/ws/trunk/lucene/pom.xml,>
MavenProject: org.apache.pdfbox:pdfbox-ant:1.7.0-SNAPSHOT @ <https://builds.apache.org/job/PDFBox-trunk/ws/trunk/ant/pom.xml,>
MavenProject: org.apache.pdfbox:pdfbox-war:1.7.0-SNAPSHOT @ <https://builds.apache.org/job/PDFBox-trunk/ws/trunk/war/pom.xml,>
MavenProject: org.apache.pdfbox:pdfbox-app:1.7.0-SNAPSHOT @ <https://builds.apache.org/job/PDFBox-trunk/ws/trunk/app/pom.xml,>
MavenProject: org.apache.pdfbox:pdfbox-examples:1.7.0-SNAPSHOT @ <https://builds.apache.org/job/PDFBox-trunk/ws/trunk/examples/pom.xml,>
MavenProject: org.apache.pdfbox:pdfbox-reactor:1.7.0-SNAPSHOT @ <https://builds.apache.org/job/PDFBox-trunk/ws/trunk/pom.xml]>
[JENKINS] Archiving <https://builds.apache.org/job/PDFBox-trunk/ws/trunk/preflight/pom.xml>
to /home/hudson/hudson/jobs/PDFBox-trunk/modules/org.apache.pdfbox$preflight/builds/2012-05-09_20-15-26/archive/org.apache.pdfbox/preflight/1.7.0-SNAPSHOT/preflight-1.7.0-SNAPSHOT.pom
[JENKINS] Archiving <https://builds.apache.org/job/PDFBox-trunk/ws/trunk/pom.xml> to
/home/hudson/hudson/jobs/PDFBox-trunk/modules/org.apache.pdfbox$pdfbox-reactor/builds/2012-05-09_20-15-25/archive/org.apache.pdfbox/pdfbox-reactor/1.7.0-SNAPSHOT/pdfbox-reactor-1.7.0-SNAPSHOT.pom
[JENKINS] Archiving <https://builds.apache.org/job/PDFBox-trunk/ws/trunk/lucene/pom.xml>
to /home/hudson/hudson/jobs/PDFBox-trunk/modules/org.apache.pdfbox$pdfbox-lucene/builds/2012-05-09_20-15-26/archive/org.apache.pdfbox/pdfbox-lucene/1.7.0-SNAPSHOT/pdfbox-lucene-1.7.0-SNAPSHOT.pom
[JENKINS] Archiving <https://builds.apache.org/job/PDFBox-trunk/ws/trunk/examples/pom.xml>
to /home/hudson/hudson/jobs/PDFBox-trunk/modules/org.apache.pdfbox$pdfbox-examples/builds/2012-05-09_20-15-26/archive/org.apache.pdfbox/pdfbox-examples/1.7.0-SNAPSHOT/pdfbox-examples-1.7.0-SNAPSHOT.pom
[JENKINS] Archiving <https://builds.apache.org/job/PDFBox-trunk/ws/trunk/pdfbox/pom.xml>
to /home/hudson/hudson/jobs/PDFBox-trunk/modules/org.apache.pdfbox$pdfbox/builds/2012-05-09_20-15-26/archive/org.apache.pdfbox/pdfbox/1.7.0-SNAPSHOT/pdfbox-1.7.0-SNAPSHOT.pom
[JENKINS] Archiving <https://builds.apache.org/job/PDFBox-trunk/ws/trunk/pdfbox/target/pdfbox-1.7.0-SNAPSHOT.jar>
to /home/hudson/hudson/jobs/PDFBox-trunk/modules/org.apache.pdfbox$pdfbox/builds/2012-05-09_20-15-26/archive/org.apache.pdfbox/pdfbox/1.7.0-20120509.201750-133/pdfbox-1.7.0-20120509.201750-133.jar
[JENKINS] Archiving <https://builds.apache.org/job/PDFBox-trunk/ws/trunk/parent/pom.xml>
to /home/hudson/hudson/jobs/PDFBox-trunk/modules/org.apache.pdfbox$pdfbox-parent/builds/2012-05-09_20-15-26/archive/org.apache.pdfbox/pdfbox-parent/1.7.0-SNAPSHOT/pdfbox-parent-1.7.0-SNAPSHOT.pom
[JENKINS] Archiving <https://builds.apache.org/job/PDFBox-trunk/ws/trunk/app/pom.xml>
to /home/hudson/hudson/jobs/PDFBox-trunk/modules/org.apache.pdfbox$pdfbox-app/builds/2012-05-09_20-15-26/archive/org.apache.pdfbox/pdfbox-app/1.7.0-SNAPSHOT/pdfbox-app-1.7.0-SNAPSHOT.pom
[JENKINS] Archiving <https://builds.apache.org/job/PDFBox-trunk/ws/trunk/war/pom.xml>
to /home/hudson/hudson/jobs/PDFBox-trunk/modules/org.apache.pdfbox$pdfbox-war/builds/2012-05-09_20-15-26/archive/org.apache.pdfbox/pdfbox-war/1.7.0-SNAPSHOT/pdfbox-war-1.7.0-SNAPSHOT.pom
[JENKINS] Archiving <https://builds.apache.org/job/PDFBox-trunk/ws/trunk/ant/pom.xml>
to /home/hudson/hudson/jobs/PDFBox-trunk/modules/org.apache.pdfbox$pdfbox-ant/builds/2012-05-09_20-15-26/archive/org.apache.pdfbox/pdfbox-ant/1.7.0-SNAPSHOT/pdfbox-ant-1.7.0-SNAPSHOT.pom
[JENKINS] Archiving <https://builds.apache.org/job/PDFBox-trunk/ws/trunk/fontbox/pom.xml>
to /home/hudson/hudson/jobs/PDFBox-trunk/modules/org.apache.pdfbox$fontbox/builds/2012-05-09_20-15-26/archive/org.apache.pdfbox/fontbox/1.7.0-SNAPSHOT/fontbox-1.7.0-SNAPSHOT.pom
[JENKINS] Archiving <https://builds.apache.org/job/PDFBox-trunk/ws/trunk/fontbox/target/fontbox-1.7.0-SNAPSHOT.jar>
to /home/hudson/hudson/jobs/PDFBox-trunk/modules/org.apache.pdfbox$fontbox/builds/2012-05-09_20-15-26/archive/org.apache.pdfbox/fontbox/1.7.0-20120509.201648-146/fontbox-1.7.0-20120509.201648-146.jar
[JENKINS] Archiving <https://builds.apache.org/job/PDFBox-trunk/ws/trunk/jempbox/pom.xml>
to /home/hudson/hudson/jobs/PDFBox-trunk/modules/org.apache.pdfbox$jempbox/builds/2012-05-09_20-15-26/archive/org.apache.pdfbox/jempbox/1.7.0-SNAPSHOT/jempbox-1.7.0-SNAPSHOT.pom
[JENKINS] Archiving <https://builds.apache.org/job/PDFBox-trunk/ws/trunk/jempbox/target/jempbox-1.7.0-SNAPSHOT.jar>
to /home/hudson/hudson/jobs/PDFBox-trunk/modules/org.apache.pdfbox$jempbox/builds/2012-05-09_20-15-26/archive/org.apache.pdfbox/jempbox/1.7.0-20120509.201657-146/jempbox-1.7.0-20120509.201657-146.jar
[JENKINS] Archiving <https://builds.apache.org/job/PDFBox-trunk/ws/trunk/xmpbox/pom.xml>
to /home/hudson/hudson/jobs/PDFBox-trunk/modules/org.apache.pdfbox$xmpbox/builds/2012-05-09_20-15-26/archive/org.apache.pdfbox/xmpbox/1.7.0-SNAPSHOT/xmpbox-1.7.0-SNAPSHOT.pom
[JENKINS] Archiving <https://builds.apache.org/job/PDFBox-trunk/ws/trunk/xmpbox/target/xmpbox-1.7.0-SNAPSHOT.jar>
to /home/hudson/hudson/jobs/PDFBox-trunk/modules/org.apache.pdfbox$xmpbox/builds/2012-05-09_20-15-26/archive/org.apache.pdfbox/xmpbox/1.7.0-20120509.201804-125/xmpbox-1.7.0-20120509.201804-125.jar
Waiting for Jenkins to finish collecting data
mavenExecutionResult exceptions not empty
message : Failed to execute goal org.apache.maven.plugins:maven-compiler-plugin:2.3.2:compile
(default-compile) on project preflight: Compilation failure
cause : Compilation failure
Stack trace : 
org.apache.maven.lifecycle.LifecycleExecutionException: Failed to execute goal org.apache.maven.plugins:maven-compiler-plugin:2.3.2:compile
(default-compile) on project preflight: Compilation failure
	at org.apache.maven.lifecycle.internal.MojoExecutor.execute(MojoExecutor.java:213)
	at org.apache.maven.lifecycle.internal.MojoExecutor.execute(MojoExecutor.java:153)
	at org.apache.maven.lifecycle.internal.MojoExecutor.execute(MojoExecutor.java:145)
	at org.apache.maven.lifecycle.internal.LifecycleModuleBuilder.buildProject(LifecycleModuleBuilder.java:84)
	at org.apache.maven.lifecycle.internal.LifecycleModuleBuilder.buildProject(LifecycleModuleBuilder.java:59)
	at org.apache.maven.lifecycle.internal.LifecycleStarter.singleThreadedBuild(LifecycleStarter.java:183)
	at org.apache.maven.lifecycle.internal.LifecycleStarter.execute(LifecycleStarter.java:161)
	at org.apache.maven.DefaultMaven.doExecute(DefaultMaven.java:319)
	at org.apache.maven.DefaultMaven.execute(DefaultMaven.java:156)
	at org.jvnet.hudson.maven3.launcher.Maven3Launcher.main(Maven3Launcher.java:79)
	at sun.reflect.NativeMethodAccessorImpl.invoke0(Native Method)
	at sun.reflect.NativeMethodAccessorImpl.invoke(NativeMethodAccessorImpl.java:39)
	at sun.reflect.DelegatingMethodAccessorImpl.invoke(DelegatingMethodAccessorImpl.java:25)
	at java.lang.reflect.Method.invoke(Method.java:592)
	at org.codehaus.plexus.classworlds.launcher.Launcher.launchStandard(Launcher.java:329)
	at org.codehaus.plexus.classworlds.launcher.Launcher.launch(Launcher.java:239)
	at org.jvnet.hudson.maven3.agent.Maven3Main.launch(Maven3Main.java:158)
	at hudson.maven.Maven3Builder.call(Maven3Builder.java:98)
	at hudson.maven.Maven3Builder.call(Maven3Builder.java:64)
	at hudson.remoting.UserRequest.perform(UserRequest.java:118)
	at hudson.remoting.UserRequest.perform(UserRequest.java:48)
	at hudson.remoting.Request$2.run(Request.java:287)
	at hudson.remoting.InterceptingExecutorService$1.call(InterceptingExecutorService.java:72)
	at java.util.concurrent.FutureTask$Sync.innerRun(FutureTask.java:269)
	at java.util.concurrent.FutureTask.run(FutureTask.java:123)
	at java.util.concurrent.ThreadPoolExecutor$Worker.runTask(ThreadPoolExecutor.java:651)
	at java.util.concurrent.ThreadPoolExecutor$Worker.run(ThreadPoolExecutor.java:676)
	at java.lang.Thread.run(Thread.java:595)
Caused by: org.apache.maven.plugin.CompilationFailureException: Compilation failure
	at org.apache.maven.plugin.AbstractCompilerMojo.execute(AbstractCompilerMojo.java:656)
	at org.apache.maven.plugin.CompilerMojo.execute(CompilerMojo.java:128)
	at org.apache.maven.plugin.DefaultBuildPluginManager.executeMojo(DefaultBuildPluginManager.java:101)
	at org.apache.maven.lifecycle.internal.MojoExecutor.execute(MojoExecutor.java:209)
	... 27 more
Sending e-mails to: dev@pdfbox.apache.org
channel stopped
Archiving artifacts

Mime
View raw message