pdfbox-dev mailing list archives

Site index · List index
Message view « Date » · « Thread »
Top « Date » · « Thread »
From Apache Jenkins Server <jenk...@builds.apache.org>
Subject Build failed in Jenkins: PDFBox-trunk #318
Date Sat, 06 Aug 2011 07:05:38 GMT
See <https://builds.apache.org/job/PDFBox-trunk/318/changes>

Changes:

[gbailleul] PDFBOX-1079 : fixed testEquals occasionaly failure

[gbailleul] PDFBOX-1081 : removed unused style files and added svn ignores like in other subprojects

------------------------------------------
[...truncated 171 lines...]
Uploading: https://repository.apache.org/content/repositories/snapshots/org/apache/pdfbox/fontbox/1.7.0-SNAPSHOT/fontbox-1.7.0-20110806.070250-23.pom
Uploaded: https://repository.apache.org/content/repositories/snapshots/org/apache/pdfbox/fontbox/1.7.0-SNAPSHOT/fontbox-1.7.0-20110806.070250-23.pom
(4 KB at 21.4 KB/sec)
Downloading: https://repository.apache.org/content/repositories/snapshots/org/apache/pdfbox/fontbox/maven-metadata.xml
Downloaded: https://repository.apache.org/content/repositories/snapshots/org/apache/pdfbox/fontbox/maven-metadata.xml
(502 B at 3.4 KB/sec)
Uploading: https://repository.apache.org/content/repositories/snapshots/org/apache/pdfbox/fontbox/1.7.0-SNAPSHOT/maven-metadata.xml
Uploaded: https://repository.apache.org/content/repositories/snapshots/org/apache/pdfbox/fontbox/1.7.0-SNAPSHOT/maven-metadata.xml
(777 B at 4.1 KB/sec)
Uploading: https://repository.apache.org/content/repositories/snapshots/org/apache/pdfbox/fontbox/maven-metadata.xml
Uploaded: https://repository.apache.org/content/repositories/snapshots/org/apache/pdfbox/fontbox/maven-metadata.xml
(502 B at 2.9 KB/sec)
[INFO] [INFO] Remote OBR update disabled (enable with -DremoteOBR)

[INFO] --- maven-bundle-plugin:2.0.0:deploy (default-deploy) @ fontbox ---
projectSucceeded org.apache.pdfbox:fontbox:1.7.0-SNAPSHOT
[JENKINS] Archiving <https://builds.apache.org/job/PDFBox-trunk/ws/trunk/fontbox/pom.xml>
to /home/hudson/hudson/jobs/PDFBox-trunk/modules/org.apache.pdfbox$fontbox/builds/2011-08-06_07-01-05/archive/org.apache.pdfbox/fontbox/1.7.0-SNAPSHOT/fontbox-1.7.0-SNAPSHOT.pom
[JENKINS] Archiving <https://builds.apache.org/job/PDFBox-trunk/ws/trunk/fontbox/target/fontbox-1.7.0-SNAPSHOT.jar>
to /home/hudson/hudson/jobs/PDFBox-trunk/modules/org.apache.pdfbox$fontbox/builds/2011-08-06_07-01-05/archive/org.apache.pdfbox/fontbox/1.7.0-20110806.070250-23/fontbox-1.7.0-20110806.070250-23.jar
[INFO] [INFO] Deleting file set: <https://builds.apache.org/job/PDFBox-trunk/ws/trunk/jempbox/target>
(included: [**], excluded: [])
                                                                        
[INFO] ------------------------------------------------------------------------
[INFO] Building Apache JempBox 1.7.0-SNAPSHOT
[INFO] ------------------------------------------------------------------------
[INFO] 
[INFO] --- maven-clean-plugin:2.3:clean (default-clean) @ jempbox ---
[INFO] 
[INFO] --- maven-remote-resources-plugin:1.0:process (default) @ jempbox ---
[INFO] Using 'ISO-8859-1' encoding to copy filtered resources.
[INFO] [INFO] skip non existing resourceDirectory <https://builds.apache.org/job/PDFBox-trunk/ws/trunk/jempbox/src/main/resources>
[INFO] Copying 3 resources

[INFO] --- maven-resources-plugin:2.3:resources (default-resources) @ jempbox ---
[INFO] 
[INFO] [INFO] Compiling 24 source files to <https://builds.apache.org/job/PDFBox-trunk/ws/trunk/jempbox/target/classes>
--- maven-compiler-plugin:2.0.2:compile (default-compile) @ jempbox ---
[INFO] Using 'ISO-8859-1' encoding to copy filtered resources.
[INFO] [INFO] skip non existing resourceDirectory <https://builds.apache.org/job/PDFBox-trunk/ws/trunk/jempbox/src/test/resources>
[INFO] Copying 3 resources

[INFO] --- maven-resources-plugin:2.3:testResources (default-testResources) @ jempbox ---
[INFO] 
[INFO] --- maven-compiler-plugin:2.0.2:testCompile (default-testCompile) @ jempbox ---
[INFO] Compiling 3 source files to <https://builds.apache.org/job/PDFBox-trunk/ws/trunk/jempbox/target/test-classes>
[INFO] [INFO] Surefire report directory: <https://builds.apache.org/job/PDFBox-trunk/ws/trunk/jempbox/target/surefire-reports>

[INFO] --- maven-surefire-plugin:2.4.3:test (default-test) @ jempbox ---

-------------------------------------------------------
 T E S T S
-------------------------------------------------------
Running org.apache.jempbox.xmp.XMPMetadataTest
Tests run: 3, Failures: 0, Errors: 0, Skipped: 0, Time elapsed: 0.062 sec
Running org.apache.jempbox.xmp.XMPSchemaTest
Tests run: 8, Failures: 0, Errors: 0, Skipped: 0, Time elapsed: 0.038 sec

Results :

Tests run: 11, Failures: 0, Errors: 0, Skipped: 0

[JENKINS] Recording test results
[INFO] 
[INFO] --- maven-bundle-plugin:2.0.0:bundle (default-bundle) @ jempbox ---
[INFO] [INFO] Exclude: release.properties

[INFO] --- apache-rat-plugin:0.6:check (default) @ jempbox ---
[INFO] [INFO] Installing <https://builds.apache.org/job/PDFBox-trunk/ws/trunk/jempbox/target/jempbox-1.7.0-SNAPSHOT.jar>
to /home/jenkins/.m2/repository/org/apache/pdfbox/jempbox/1.7.0-SNAPSHOT/jempbox-1.7.0-SNAPSHOT.jar

[INFO] --- maven-install-plugin:2.2:install (default-install) @ jempbox ---
[INFO] Installing <https://builds.apache.org/job/PDFBox-trunk/ws/trunk/jempbox/pom.xml>
to /home/jenkins/.m2/repository/org/apache/pdfbox/jempbox/1.7.0-SNAPSHOT/jempbox-1.7.0-SNAPSHOT.pom
[INFO] [INFO] Parsing file:/home/jenkins/.m2/repository/repository.xml
[INFO] Installing org/apache/pdfbox/jempbox/1.7.0-SNAPSHOT/jempbox-1.7.0-SNAPSHOT.jar
[INFO] Writing OBR metadata

[INFO] --- maven-bundle-plugin:2.0.0:install (default-install) @ jempbox ---
[INFO] Downloading: https://repository.apache.org/content/repositories/snapshots/org/apache/pdfbox/jempbox/1.7.0-SNAPSHOT/maven-metadata.xml

[INFO] --- maven-deploy-plugin:2.4:deploy (default-deploy) @ jempbox ---
Downloaded: https://repository.apache.org/content/repositories/snapshots/org/apache/pdfbox/jempbox/1.7.0-SNAPSHOT/maven-metadata.xml
(777 B at 1.6 KB/sec)
Uploading: https://repository.apache.org/content/repositories/snapshots/org/apache/pdfbox/jempbox/1.7.0-SNAPSHOT/jempbox-1.7.0-20110806.070310-23.jar
Uploaded: https://repository.apache.org/content/repositories/snapshots/org/apache/pdfbox/jempbox/1.7.0-SNAPSHOT/jempbox-1.7.0-20110806.070310-23.jar
(51 KB at 144.2 KB/sec)
Uploading: https://repository.apache.org/content/repositories/snapshots/org/apache/pdfbox/jempbox/1.7.0-SNAPSHOT/jempbox-1.7.0-20110806.070310-23.pom
Uploaded: https://repository.apache.org/content/repositories/snapshots/org/apache/pdfbox/jempbox/1.7.0-SNAPSHOT/jempbox-1.7.0-20110806.070310-23.pom
(4 KB at 25.2 KB/sec)
Downloading: https://repository.apache.org/content/repositories/snapshots/org/apache/pdfbox/jempbox/maven-metadata.xml
Downloaded: https://repository.apache.org/content/repositories/snapshots/org/apache/pdfbox/jempbox/maven-metadata.xml
(424 B at 1.5 KB/sec)
Uploading: https://repository.apache.org/content/repositories/snapshots/org/apache/pdfbox/jempbox/1.7.0-SNAPSHOT/maven-metadata.xml
Uploaded: https://repository.apache.org/content/repositories/snapshots/org/apache/pdfbox/jempbox/1.7.0-SNAPSHOT/maven-metadata.xml
(777 B at 5.4 KB/sec)
Uploading: https://repository.apache.org/content/repositories/snapshots/org/apache/pdfbox/jempbox/maven-metadata.xml
Uploaded: https://repository.apache.org/content/repositories/snapshots/org/apache/pdfbox/jempbox/maven-metadata.xml
(424 B at 1.9 KB/sec)
[INFO] [INFO] Remote OBR update disabled (enable with -DremoteOBR)

[INFO] --- maven-bundle-plugin:2.0.0:deploy (default-deploy) @ jempbox ---
projectSucceeded org.apache.pdfbox:jempbox:1.7.0-SNAPSHOT
[JENKINS] Archiving <https://builds.apache.org/job/PDFBox-trunk/ws/trunk/jempbox/pom.xml>
to /home/hudson/hudson/jobs/PDFBox-trunk/modules/org.apache.pdfbox$jempbox/builds/2011-08-06_07-01-05/archive/org.apache.pdfbox/jempbox/1.7.0-SNAPSHOT/jempbox-1.7.0-SNAPSHOT.pom
[JENKINS] Archiving <https://builds.apache.org/job/PDFBox-trunk/ws/trunk/jempbox/target/jempbox-1.7.0-SNAPSHOT.jar>
to /home/hudson/hudson/jobs/PDFBox-trunk/modules/org.apache.pdfbox$jempbox/builds/2011-08-06_07-01-05/archive/org.apache.pdfbox/jempbox/1.7.0-20110806.070310-23/jempbox-1.7.0-20110806.070310-23.jar
[INFO]                                                                         
[INFO] Deleting file set: <https://builds.apache.org/job/PDFBox-trunk/ws/trunk/xmpbox/target>
(included: [**], excluded: [])
[INFO] ------------------------------------------------------------------------
[INFO] Building Apache XmpBox 1.7.0-SNAPSHOT
[INFO] ------------------------------------------------------------------------
[INFO] 
[INFO] --- maven-clean-plugin:2.3:clean (default-clean) @ xmpbox ---
[INFO] 
[INFO] --- maven-remote-resources-plugin:1.0:process (default) @ xmpbox ---
[INFO] [INFO] Using 'ISO-8859-1' encoding to copy filtered resources.
[INFO] skip non existing resourceDirectory <https://builds.apache.org/job/PDFBox-trunk/ws/trunk/xmpbox/src/main/resources>
[INFO] Copying 3 resources

[INFO] --- maven-resources-plugin:2.3:resources (default-resources) @ xmpbox ---
[INFO] [INFO] Compiling 65 source files to <https://builds.apache.org/job/PDFBox-trunk/ws/trunk/xmpbox/target/classes>

[INFO] --- maven-compiler-plugin:2.0.2:compile (default-compile) @ xmpbox ---
[INFO] [INFO] Using 'ISO-8859-1' encoding to copy filtered resources.

[INFO] Copying 5 resources
[INFO] Copying 3 resources
[INFO] --- maven-resources-plugin:2.3:testResources (default-testResources) @ xmpbox ---
[INFO] 
[INFO] [INFO] Compiling 25 source files to <https://builds.apache.org/job/PDFBox-trunk/ws/trunk/xmpbox/target/test-classes>
--- maven-compiler-plugin:2.0.2:testCompile (default-testCompile) @ xmpbox ---
[INFO] [INFO] Surefire report directory: <https://builds.apache.org/job/PDFBox-trunk/ws/trunk/xmpbox/target/surefire-reports>

[INFO] --- maven-surefire-plugin:2.4.3:test (default-test) @ xmpbox ---

-------------------------------------------------------
 T E S T S
-------------------------------------------------------
Running org.apache.padaf.xmpbox.schema.PDFAValueTypeDescriptionTest
Tests run: 1, Failures: 0, Errors: 0, Skipped: 0, Time elapsed: 0.048 sec
Running org.apache.padaf.xmpbox.schema.XMPMediaManagementTest
Tests run: 28, Failures: 0, Errors: 0, Skipped: 0, Time elapsed: 0.137 sec
Running org.apache.padaf.xmpbox.XMPMetaDataTest
Tests run: 4, Failures: 0, Errors: 0, Skipped: 0, Time elapsed: 0.013 sec
Running org.apache.padaf.xmpbox.schema.PDFAPropertyDescriptionTest
Tests run: 2, Failures: 0, Errors: 0, Skipped: 0, Time elapsed: 0.008 sec
Running org.apache.padaf.xmpbox.schema.XMPSchemaTest
Tests run: 12, Failures: 0, Errors: 0, Skipped: 0, Time elapsed: 0.034 sec
Running org.apache.padaf.xmpbox.schema.AdobePDFErrorsTest
Tests run: 3, Failures: 0, Errors: 0, Skipped: 0, Time elapsed: 0.009 sec
Running org.apache.padaf.xmpbox.parser.XMLPropertiesDescriptionManagerTest
Tests run: 1, Failures: 0, Errors: 0, Skipped: 0, Time elapsed: 0.129 sec
Running org.apache.padaf.xmpbox.type.ComplexMetadataPropertyTest
Tests run: 4, Failures: 0, Errors: 0, Skipped: 0, Time elapsed: 0.007 sec
Running org.apache.padaf.xmpbox.parser.XMLValueTypeDescriptionManagerTest
Tests run: 2, Failures: 0, Errors: 0, Skipped: 0, Time elapsed: 0.021 sec
Running org.apache.padaf.xmpbox.SaveMetadataHelperTest
Tests run: 2, Failures: 0, Errors: 0, Skipped: 0, Time elapsed: 0.032 sec
Running org.apache.padaf.xmpbox.schema.XmpRightsSchemaTest
Tests run: 10, Failures: 0, Errors: 0, Skipped: 0, Time elapsed: 0.025 sec
Running org.apache.padaf.xmpbox.schema.PDFAIdentificationOthersTest
Tests run: 3, Failures: 0, Errors: 0, Skipped: 0, Time elapsed: 0.006 sec
Running org.apache.padaf.xmpbox.parser.DeserializationTest
Tests run: 3, Failures: 0, Errors: 0, Skipped: 0, Time elapsed: 0.083 sec
Running org.apache.padaf.xmpbox.DoubleSameTypeSchemaTest
Tests run: 1, Failures: 0, Errors: 0, Skipped: 0, Time elapsed: 0.003 sec
Running org.apache.padaf.xmpbox.schema.PDFAIdentificationTest
Tests run: 6, Failures: 0, Errors: 0, Skipped: 0, Time elapsed: 0.013 sec
Running org.apache.padaf.xmpbox.schema.AdobePDFTest
Tests run: 6, Failures: 0, Errors: 0, Skipped: 0, Time elapsed: 0.013 sec
Running org.apache.padaf.xmpbox.schema.PDFAExtensionTest
Tests run: 6, Failures: 0, Errors: 0, Skipped: 0, Time elapsed: 0.012 sec
Running org.apache.padaf.xmpbox.schema.DublinCoreTest
Tests run: 30, Failures: 0, Errors: 0, Skipped: 0, Time elapsed: 0.091 sec
Running org.apache.padaf.xmpbox.type.AttributeTest
Tests run: 2, Failures: 0, Errors: 0, Skipped: 0, Time elapsed: 0.002 sec
Running org.apache.padaf.xmpbox.BuildPDFAExtensionSchemaDescriptionTest
Tests run: 1, Failures: 0, Errors: 0, Skipped: 0, Time elapsed: 0.022 sec
Running org.apache.padaf.xmpbox.schema.XMPBasicTest
Tests run: 22, Failures: 0, Errors: 0, Skipped: 0, Time elapsed: 0.052 sec
Running org.apache.padaf.xmpbox.parser.PropMappingTest
Tests run: 3, Failures: 0, Errors: 0, Skipped: 0, Time elapsed: 0.002 sec
Running org.apache.padaf.xmpbox.type.SimpleMetadataPropertyTest
Tests run: 11, Failures: 0, Errors: 0, Skipped: 0, Time elapsed: 0.015 sec

Results :

Tests run: 163, Failures: 0, Errors: 0, Skipped: 0

[JENKINS] Recording test results
[INFO] 
[INFO] --- maven-bundle-plugin:2.0.0:bundle (default-bundle) @ xmpbox ---
[INFO] [INFO] Exclude: release.properties

[INFO] --- apache-rat-plugin:0.6:check (default) @ xmpbox ---
mojoFailed org.apache.rat:apache-rat-plugin:0.6(default)
projectFailed org.apache.pdfbox:xmpbox:1.7.0-SNAPSHOT
[JENKINS] Archiving <https://builds.apache.org/job/PDFBox-trunk/ws/trunk/xmpbox/pom.xml>
to /home/hudson/hudson/jobs/PDFBox-trunk/modules/org.apache.pdfbox$xmpbox/builds/2011-08-06_07-01-05/archive/org.apache.pdfbox/xmpbox/1.7.0-SNAPSHOT/xmpbox-1.7.0-SNAPSHOT.pom
[JENKINS] Archiving <https://builds.apache.org/job/PDFBox-trunk/ws/trunk/xmpbox/target/xmpbox-1.7.0-SNAPSHOT.jar>
to /home/hudson/hudson/jobs/PDFBox-trunk/modules/org.apache.pdfbox$xmpbox/builds/2011-08-06_07-01-05/archive/org.apache.pdfbox/xmpbox/1.7.0-SNAPSHOT/xmpbox-1.7.0-SNAPSHOT.jar
sessionEnded
[INFO] ------------------------------------------------------------------------
[INFO] Reactor Summary:
[INFO] 
[INFO] PDFBox parent ..................................... SUCCESS [17.202s]
[INFO] Apache FontBox .................................... SUCCESS [37.684s]
[INFO] Apache JempBox .................................... SUCCESS [17.253s]
[INFO] Apache XmpBox ..................................... FAILURE [10.775s]
[INFO] Apache PDFBox ..................................... SKIPPED
[INFO] Apache Preflight .................................. SKIPPED
[INFO] Apache PDFBox for Lucene .......................... SKIPPED
[INFO] Apache PDFBox for Ant ............................. SKIPPED
[INFO] Apache PDFBox webapp .............................. SKIPPED
[INFO] Apache PDFBox application ......................... SKIPPED
[INFO] PDFBox reactor .................................... SKIPPED
[INFO] ------------------------------------------------------------------------
[INFO] BUILD FAILURE
[INFO] ------------------------------------------------------------------------
[INFO] Total time: 2:48.051s
[INFO] Finished at: Sat Aug 06 07:04:36 UTC 2011
[INFO] Final Memory: 23M/198M
[INFO] ------------------------------------------------------------------------
maven builder waiting
mavenExecutionResult exceptions not empty
message : Failed to execute goal org.apache.rat:apache-rat-plugin:0.6:check (default) on project
xmpbox: Too many unapproved licenses: 2
cause : Too many unapproved licenses: 2
Stack trace : 
org.apache.maven.lifecycle.LifecycleExecutionException: Failed to execute goal org.apache.rat:apache-rat-plugin:0.6:check
(default) on project xmpbox: Too many unapproved licenses: 2
	at org.apache.maven.lifecycle.internal.MojoExecutor.execute(MojoExecutor.java:213)
	at org.apache.maven.lifecycle.internal.MojoExecutor.execute(MojoExecutor.java:153)
	at org.apache.maven.lifecycle.internal.MojoExecutor.execute(MojoExecutor.java:145)
	at org.apache.maven.lifecycle.internal.LifecycleModuleBuilder.buildProject(LifecycleModuleBuilder.java:84)
	at org.apache.maven.lifecycle.internal.LifecycleModuleBuilder.buildProject(LifecycleModuleBuilder.java:59)
	at org.apache.maven.lifecycle.internal.LifecycleStarter.singleThreadedBuild(LifecycleStarter.java:183)
	at org.apache.maven.lifecycle.internal.LifecycleStarter.execute(LifecycleStarter.java:161)
	at org.apache.maven.DefaultMaven.doExecute(DefaultMaven.java:319)
	at org.apache.maven.DefaultMaven.execute(DefaultMaven.java:156)
	at org.jvnet.hudson.maven3.launcher.Maven3Launcher.main(Maven3Launcher.java:79)
	at sun.reflect.NativeMethodAccessorImpl.invoke0(Native Method)
	at sun.reflect.NativeMethodAccessorImpl.invoke(NativeMethodAccessorImpl.java:39)
	at sun.reflect.DelegatingMethodAccessorImpl.invoke(DelegatingMethodAccessorImpl.java:25)
	at java.lang.reflect.Method.invoke(Method.java:592)
	at org.codehaus.plexus.classworlds.launcher.Launcher.launchStandard(Launcher.java:329)
	at org.codehaus.plexus.classworlds.launcher.Launcher.launch(Launcher.java:239)
	at org.jvnet.hudson.maven3.agent.Maven3Main.launch(Maven3Main.java:158)
	at hudson.maven.Maven3Builder.call(Maven3Builder.java:128)
	at hudson.maven.Maven3Builder.call(Maven3Builder.java:75)
	at hudson.remoting.UserRequest.perform(UserRequest.java:118)
	at hudson.remoting.UserRequest.perform(UserRequest.java:48)
	at hudson.remoting.Request$2.run(Request.java:270)
	at java.util.concurrent.Executors$RunnableAdapter.call(Executors.java:417)
	at java.util.concurrent.FutureTask$Sync.innerRun(FutureTask.java:269)
	at java.util.concurrent.FutureTask.run(FutureTask.java:123)
	at java.util.concurrent.ThreadPoolExecutor$Worker.runTask(ThreadPoolExecutor.java:651)
	at java.util.concurrent.ThreadPoolExecutor$Worker.run(ThreadPoolExecutor.java:676)
	at java.lang.Thread.run(Thread.java:595)
Caused by: org.apache.rat.mp.RatCheckException: Too many unapproved licenses: 2
	at org.apache.rat.mp.RatCheckMojo.check(RatCheckMojo.java:223)
	at org.apache.rat.mp.RatCheckMojo.check(RatCheckMojo.java:215)
	at org.apache.rat.mp.RatCheckMojo.execute(RatCheckMojo.java:171)
	at org.apache.maven.plugin.DefaultBuildPluginManager.executeMojo(DefaultBuildPluginManager.java:101)
	at org.apache.maven.lifecycle.internal.MojoExecutor.execute(MojoExecutor.java:209)
	... 27 more
Sending e-mails to: dev@pdfbox.apache.org
channel stopped
Archiving artifacts


Mime
View raw message