openwebbeans-user mailing list archives

Site index · List index
Message view « Date » · « Thread »
Top « Date » · « Thread »
From "John D. Ament" <johndam...@apache.org>
Subject 2.0.1 presently broken?
Date Sun, 27 Aug 2017 16:30:52 GMT
Just did a test against the 2.0.1 snapshots, all of my arquillian tests are
failing

Everything seems to point to a change in AnnotationUtil, however I don't
see anything changed in there.

[ERROR] Tests run: 1, Failures: 0, Errors: 1, Skipped: 0, Time elapsed:
0.298 s <<< FAILURE! - in ws.ament.hammock.web.undertow.UndertowFilterTest
[ERROR] ws.ament.hammock.web.undertow.UndertowFilterTest  Time elapsed:
0.298 s  <<< ERROR!
java.lang.ExceptionInInitializerError
at
org.apache.maven.surefire.junit4.JUnit4Provider.execute(JUnit4Provider.java:365)
at
org.apache.maven.surefire.junit4.JUnit4Provider.executeWithRerun(JUnit4Provider.java:272)
at
org.apache.maven.surefire.junit4.JUnit4Provider.executeTestSet(JUnit4Provider.java:236)
at
org.apache.maven.surefire.junit4.JUnit4Provider.invoke(JUnit4Provider.java:159)
Caused by: java.lang.NullPointerException
at
org.apache.maven.surefire.junit4.JUnit4Provider.execute(JUnit4Provider.java:365)
at
org.apache.maven.surefire.junit4.JUnit4Provider.executeWithRerun(JUnit4Provider.java:272)
at
org.apache.maven.surefire.junit4.JUnit4Provider.executeTestSet(JUnit4Provider.java:236)
at
org.apache.maven.surefire.junit4.JUnit4Provider.invoke(JUnit4Provider.java:159)

[INFO] Running ws.ament.hammock.web.undertow.UndertowListenerTest
[ERROR] Tests run: 1, Failures: 0, Errors: 1, Skipped: 0, Time elapsed:
0.019 s <<< FAILURE! - in ws.ament.hammock.web.undertow.UndertowListenerTest
[ERROR] ws.ament.hammock.web.undertow.UndertowListenerTest  Time elapsed:
0.019 s  <<< ERROR!
java.lang.NoClassDefFoundError: Could not initialize class
org.apache.webbeans.util.AnnotationUtil
at
org.apache.maven.surefire.junit4.JUnit4Provider.execute(JUnit4Provider.java:365)
at
org.apache.maven.surefire.junit4.JUnit4Provider.executeWithRerun(JUnit4Provider.java:272)
at
org.apache.maven.surefire.junit4.JUnit4Provider.executeTestSet(JUnit4Provider.java:236)
at
org.apache.maven.surefire.junit4.JUnit4Provider.invoke(JUnit4Provider.java:159)

[INFO] Running ws.ament.hammock.web.undertow.UndertowServletMapperTest
[INFO] Tests run: 1, Failures: 0, Errors: 0, Skipped: 0, Time elapsed:
0.071 s - in ws.ament.hammock.web.undertow.UndertowServletMapperTest
[INFO] Running ws.ament.hammock.web.undertow.UndertowServletTest
[ERROR] Tests run: 1, Failures: 0, Errors: 1, Skipped: 0, Time elapsed:
0.023 s <<< FAILURE! - in ws.ament.hammock.web.undertow.UndertowServletTest
[ERROR] ws.ament.hammock.web.undertow.UndertowServletTest  Time elapsed:
0.023 s  <<< ERROR!
java.lang.NoClassDefFoundError: Could not initialize class
org.apache.webbeans.util.AnnotationUtil
at
org.apache.maven.surefire.junit4.JUnit4Provider.execute(JUnit4Provider.java:365)
at
org.apache.maven.surefire.junit4.JUnit4Provider.executeWithRerun(JUnit4Provider.java:272)
at
org.apache.maven.surefire.junit4.JUnit4Provider.executeTestSet(JUnit4Provider.java:236)
at
org.apache.maven.surefire.junit4.JUnit4Provider.invoke(JUnit4Provider.java:159)

Mime
View raw message