openoffice-dev mailing list archives

Site index · List index
Message view « Date » · « Thread »
Top « Date » · « Thread »
From Ariel Constenla-Haile <arie...@apache.org>
Subject Re: Bootstrap fails
Date Sun, 25 Sep 2016 08:11:48 GMT
Hi Aleksandr,

On Sat, Sep 24, 2016 at 09:05:55PM +0300, Aleksandr Andreev wrote:
> The build fails on Linux Mint 17.1 with the following messages:
> 
> [ build LNK ] Library/passwordcontainer.uno.so
> /usr/lib/i386-linux-gnu/libc_nonshared.a(stack_chk_fail_local.oS): In
> function `__stack_chk_fail_local':
> (.text+0x10): undefined reference to `__stack_chk_fail'
> collect2: error: ld returned 1 exit status
> make: *** [/home/vlad/aoo/main/solver/420/unxlngi6.pro/workdir/LinkTarget/Library/passwordcontainer.uno.so]
> Error 1
> dmake:  Error code 2, while making 'all'
> 
> 1 module(s):
>     svl
> need(s) to be rebuilt
> 
> Reason(s):
> 
> ERROR: error 65280 occurred while making /home/vlad/aoo/main/svl/prj
> 
> Any suggestions?

This looks the build bot error:
https://ci.apache.org/projects/openoffice/buildlogs/lin41x/main/svl/unxlngi6.pro/misc/logs/prj.txt

Are you building trunk or a branch?


Regards
-- 
Ariel Constenla-Haile

Mime
View raw message