opennlp-dev mailing list archives

Site index · List index
Message view « Date » · « Thread »
Top « Date » · « Thread »
From Apache Jenkins Server <jenk...@builds.apache.org>
Subject Build failed in Jenkins: OpenNLP_java8 #115
Date Wed, 12 Aug 2015 10:31:19 GMT
See <https://builds.apache.org/job/OpenNLP_java8/115/changes>

Changes:

[tommaso] OPENNLP-777 - naive bayes classifier (patch from Cohan Sujay Carlos)

[joern] OPENNLP-799 

The NewlineSentenceDetector does not work because of a small comparison error.
The patch fixes the problem, and also adds a class with some tests.

Thanks to Gustavo Knuppe for providing a patch.

------------------------------------------
[...truncated 10804 lines...]
[ERROR] public String[] getSentence() {
[ERROR] ^
[ERROR] <https://builds.apache.org/job/OpenNLP_java8/ws/.trunk/opennlp-tools/src/main/java/opennlp/tools/chunker/ChunkSample.java>:80:
warning: no @return
[ERROR] public String[] getTags() {
[ERROR] ^
[ERROR] <https://builds.apache.org/job/OpenNLP_java8/ws/.trunk/opennlp-tools/src/main/java/opennlp/tools/chunker/ChunkSample.java>:85:
warning: no @return
[ERROR] public String[] getPreds() {
[ERROR] ^
[ERROR] <https://builds.apache.org/job/OpenNLP_java8/ws/.trunk/opennlp-tools/src/main/java/opennlp/tools/chunker/ChunkSample.java>:90:
warning: no @return
[ERROR] public Span[] getPhrasesAsSpanList() {
[ERROR] ^
[ERROR] <https://builds.apache.org/job/OpenNLP_java8/ws/.trunk/opennlp-tools/src/main/java/opennlp/tools/ml/model/SequenceStream.java>:35:
warning: no @param for model
[ERROR] public Event[] updateContext(Sequence sequence, AbstractModel model);
[ERROR] ^
[ERROR] <https://builds.apache.org/job/OpenNLP_java8/ws/.trunk/opennlp-tools/src/main/java/opennlp/tools/doccat/DoccatCrossValidator.java>:60:
warning: no description for @throws
[ERROR] * @throws IOException
[ERROR] ^
[ERROR] <https://builds.apache.org/job/OpenNLP_java8/ws/.trunk/opennlp-tools/src/main/java/opennlp/tools/doccat/DoccatCrossValidator.java>:44:
warning: no @param for languageCode
[ERROR] public DoccatCrossValidator(String languageCode, TrainingParameters mlParams,
[ERROR] ^
[ERROR] <https://builds.apache.org/job/OpenNLP_java8/ws/.trunk/opennlp-tools/src/main/java/opennlp/tools/doccat/DoccatCrossValidator.java>:44:
warning: no @param for mlParams
[ERROR] public DoccatCrossValidator(String languageCode, TrainingParameters mlParams,
[ERROR] ^
[ERROR] <https://builds.apache.org/job/OpenNLP_java8/ws/.trunk/opennlp-tools/src/main/java/opennlp/tools/doccat/DoccatCrossValidator.java>:44:
warning: no @param for factory
[ERROR] public DoccatCrossValidator(String languageCode, TrainingParameters mlParams,
[ERROR] ^
[ERROR] <https://builds.apache.org/job/OpenNLP_java8/ws/.trunk/opennlp-tools/src/main/java/opennlp/tools/doccat/DoccatCrossValidator.java>:44:
warning: no @param for listeners
[ERROR] public DoccatCrossValidator(String languageCode, TrainingParameters mlParams,
[ERROR] ^
[ERROR] <https://builds.apache.org/job/OpenNLP_java8/ws/.trunk/opennlp-tools/src/main/java/opennlp/tools/doccat/DoccatFactory.java>:53:
warning: no description for @param
[ERROR] * @param tokenizer
[ERROR] ^
[ERROR] <https://builds.apache.org/job/OpenNLP_java8/ws/.trunk/opennlp-tools/src/main/java/opennlp/tools/doccat/DoccatFactory.java>:54:
warning: no description for @param
[ERROR] * @param featureGenerators
[ERROR] ^
[ERROR] <https://builds.apache.org/job/OpenNLP_java8/ws/.trunk/opennlp-tools/src/main/java/opennlp/tools/doccat/DoccatModel.java>:97:
warning: no @return
[ERROR] public MaxentModel getChunkerModel() {
[ERROR] ^
[ERROR] <https://builds.apache.org/job/OpenNLP_java8/ws/.trunk/opennlp-tools/src/main/java/opennlp/tools/doccat/DoccatModel.java>:60:
warning: no @param for languageCode
[ERROR] public DoccatModel(String languageCode, MaxentModel doccatModel) {
[ERROR] ^
[ERROR] <https://builds.apache.org/job/OpenNLP_java8/ws/.trunk/opennlp-tools/src/main/java/opennlp/tools/doccat/DoccatModel.java>:60:
warning: no @param for doccatModel
[ERROR] public DoccatModel(String languageCode, MaxentModel doccatModel) {
[ERROR] ^
[ERROR] <https://builds.apache.org/job/OpenNLP_java8/ws/.trunk/opennlp-tools/src/main/java/opennlp/tools/doccat/DocumentCategorizer.java>:33:
warning: no description for @param
[ERROR] * @param text
[ERROR] ^
[ERROR] <https://builds.apache.org/job/OpenNLP_java8/ws/.trunk/opennlp-tools/src/main/java/opennlp/tools/doccat/DocumentCategorizer.java>:35:
warning: no @return
[ERROR] public double[] categorize(String text[]);
[ERROR] ^
[ERROR] <https://builds.apache.org/job/OpenNLP_java8/ws/.trunk/opennlp-tools/src/main/java/opennlp/tools/doccat/DocumentCategorizerEvaluator.java>:42:
warning: no description for @param
[ERROR] * @param categorizer
[ERROR] ^
[ERROR] <https://builds.apache.org/job/OpenNLP_java8/ws/.trunk/opennlp-tools/src/main/java/opennlp/tools/doccat/DocumentCategorizerEvaluator.java>:44:
warning: no @param for listeners
[ERROR] public DocumentCategorizerEvaluator(DocumentCategorizer categorizer,
[ERROR] ^
[ERROR] <https://builds.apache.org/job/OpenNLP_java8/ws/.trunk/opennlp-tools/src/main/java/opennlp/tools/doccat/DocumentCategorizerEventStream.java>:39:
warning: no description for @param
[ERROR] * @param featureGenerators
[ERROR] ^
[ERROR] <https://builds.apache.org/job/OpenNLP_java8/ws/.trunk/opennlp-tools/src/main/java/opennlp/tools/doccat/DocumentCategorizerME.java>:87:
warning: no description for @param
[ERROR] * @param text
[ERROR] ^
[ERROR] <https://builds.apache.org/job/OpenNLP_java8/ws/.trunk/opennlp-tools/src/main/java/opennlp/tools/doccat/DocumentCategorizerME.java>:118:
warning: no description for @return
[ERROR] * @return
[ERROR] ^
[ERROR] <https://builds.apache.org/job/OpenNLP_java8/ws/.trunk/opennlp-tools/src/main/java/opennlp/tools/doccat/DocumentCategorizerME.java>:136:
warning: no description for @return
[ERROR] * @return
[ERROR] ^
[ERROR] <https://builds.apache.org/job/OpenNLP_java8/ws/.trunk/opennlp-tools/src/main/java/opennlp/tools/doccat/DocumentCategorizerME.java>:181:
warning: no @param for languageCode
[ERROR] public static DoccatModel train(String languageCode, ObjectStream<DocumentSample>
samples,
[ERROR] ^
[ERROR] <https://builds.apache.org/job/OpenNLP_java8/ws/.trunk/opennlp-tools/src/main/java/opennlp/tools/doccat/DocumentCategorizerME.java>:181:
warning: no @param for samples
[ERROR] public static DoccatModel train(String languageCode, ObjectStream<DocumentSample>
samples,
[ERROR] ^
[ERROR] <https://builds.apache.org/job/OpenNLP_java8/ws/.trunk/opennlp-tools/src/main/java/opennlp/tools/doccat/DocumentCategorizerME.java>:181:
warning: no @param for mlParams
[ERROR] public static DoccatModel train(String languageCode, ObjectStream<DocumentSample>
samples,
[ERROR] ^
[ERROR] <https://builds.apache.org/job/OpenNLP_java8/ws/.trunk/opennlp-tools/src/main/java/opennlp/tools/doccat/DocumentCategorizerME.java>:181:
warning: no @param for featureGenerators
[ERROR] public static DoccatModel train(String languageCode, ObjectStream<DocumentSample>
samples,
[ERROR] ^
[ERROR] <https://builds.apache.org/job/OpenNLP_java8/ws/.trunk/opennlp-tools/src/main/java/opennlp/tools/doccat/DocumentCategorizerME.java>:181:
warning: no @return
[ERROR] public static DoccatModel train(String languageCode, ObjectStream<DocumentSample>
samples,
[ERROR] ^
[ERROR] <https://builds.apache.org/job/OpenNLP_java8/ws/.trunk/opennlp-tools/src/main/java/opennlp/tools/doccat/DocumentCategorizerME.java>:181:
warning: no @throws for java.io.IOException
[ERROR] public static DoccatModel train(String languageCode, ObjectStream<DocumentSample>
samples,
[ERROR] ^
[ERROR] <https://builds.apache.org/job/OpenNLP_java8/ws/.trunk/opennlp-tools/src/main/java/opennlp/tools/doccat/DocumentCategorizerME.java>:214:
warning: no description for @param
[ERROR] * @param languageCode
[ERROR] ^
[ERROR] <https://builds.apache.org/job/OpenNLP_java8/ws/.trunk/opennlp-tools/src/main/java/opennlp/tools/doccat/DocumentCategorizerME.java>:215:
warning: no description for @param
[ERROR] * @param samples
[ERROR] ^
[ERROR] <https://builds.apache.org/job/OpenNLP_java8/ws/.trunk/opennlp-tools/src/main/java/opennlp/tools/doccat/DocumentCategorizerME.java>:219:
warning: no description for @throws
[ERROR] * @throws IOException
[ERROR] ^
[ERROR] <https://builds.apache.org/job/OpenNLP_java8/ws/.trunk/opennlp-tools/src/main/java/opennlp/tools/doccat/DocumentCategorizerME.java>:220:
warning: no description for @throws
[ERROR] * @throws ObjectStreamException
[ERROR] ^
[ERROR] <https://builds.apache.org/job/OpenNLP_java8/ws/.trunk/opennlp-tools/src/main/java/opennlp/tools/doccat/DocumentCategorizerME.java>:70:
warning: no description for @param
[ERROR] * @param model
[ERROR] ^
[ERROR] <https://builds.apache.org/job/OpenNLP_java8/ws/.trunk/opennlp-tools/src/main/java/opennlp/tools/doccat/DocumentCategorizerME.java>:55:
warning: no description for @param
[ERROR] * @param model
[ERROR] ^
[ERROR] <https://builds.apache.org/job/OpenNLP_java8/ws/.trunk/opennlp-tools/src/main/java/opennlp/tools/doccat/DocumentCategorizerME.java>:56:
warning: no description for @param
[ERROR] * @param featureGenerators
[ERROR] ^
[ERROR] <https://builds.apache.org/job/OpenNLP_java8/ws/.trunk/opennlp-tools/src/main/java/opennlp/tools/doccat/DocumentCategorizerNB.java>:91:
warning: no description for @param
[ERROR] * @param text
[ERROR] ^
[ERROR] <https://builds.apache.org/job/OpenNLP_java8/ws/.trunk/opennlp-tools/src/main/java/opennlp/tools/doccat/DocumentCategorizerNB.java>:123:
warning: no description for @return
[ERROR] * @return
[ERROR] ^
[ERROR] <https://builds.apache.org/job/OpenNLP_java8/ws/.trunk/opennlp-tools/src/main/java/opennlp/tools/doccat/DocumentCategorizerNB.java>:143:
warning: no description for @return
[ERROR] * @return
[ERROR] ^
[ERROR] <https://builds.apache.org/job/OpenNLP_java8/ws/.trunk/opennlp-tools/src/main/java/opennlp/tools/doccat/DocumentCategorizerNB.java>:188:
warning: no @param for languageCode
[ERROR] public static DoccatModel train(String languageCode, ObjectStream<DocumentSample>
samples,
[ERROR] ^
[ERROR] <https://builds.apache.org/job/OpenNLP_java8/ws/.trunk/opennlp-tools/src/main/java/opennlp/tools/doccat/DocumentCategorizerNB.java>:188:
warning: no @param for samples
[ERROR] public static DoccatModel train(String languageCode, ObjectStream<DocumentSample>
samples,
[ERROR] ^
[ERROR] <https://builds.apache.org/job/OpenNLP_java8/ws/.trunk/opennlp-tools/src/main/java/opennlp/tools/doccat/DocumentCategorizerNB.java>:188:
warning: no @param for mlParams
[ERROR] public static DoccatModel train(String languageCode, ObjectStream<DocumentSample>
samples,
[ERROR] ^
[ERROR] <https://builds.apache.org/job/OpenNLP_java8/ws/.trunk/opennlp-tools/src/main/java/opennlp/tools/doccat/DocumentCategorizerNB.java>:188:
warning: no @param for featureGenerators
[ERROR] public static DoccatModel train(String languageCode, ObjectStream<DocumentSample>
samples,
[ERROR] ^
[ERROR] <https://builds.apache.org/job/OpenNLP_java8/ws/.trunk/opennlp-tools/src/main/java/opennlp/tools/doccat/DocumentCategorizerNB.java>:188:
warning: no @return
[ERROR] public static DoccatModel train(String languageCode, ObjectStream<DocumentSample>
samples,
[ERROR] ^
[ERROR] <https://builds.apache.org/job/OpenNLP_java8/ws/.trunk/opennlp-tools/src/main/java/opennlp/tools/doccat/DocumentCategorizerNB.java>:188:
warning: no @throws for java.io.IOException
[ERROR] public static DoccatModel train(String languageCode, ObjectStream<DocumentSample>
samples,
[ERROR] ^
[ERROR] <https://builds.apache.org/job/OpenNLP_java8/ws/.trunk/opennlp-tools/src/main/java/opennlp/tools/doccat/DocumentCategorizerNB.java>:238:
warning: no description for @param
[ERROR] * @param languageCode
[ERROR] ^
[ERROR] <https://builds.apache.org/job/OpenNLP_java8/ws/.trunk/opennlp-tools/src/main/java/opennlp/tools/doccat/DocumentCategorizerNB.java>:239:
warning: no description for @param
[ERROR] * @param samples
[ERROR] ^
[ERROR] <https://builds.apache.org/job/OpenNLP_java8/ws/.trunk/opennlp-tools/src/main/java/opennlp/tools/doccat/DocumentCategorizerNB.java>:241:
warning: no description for @throws
[ERROR] * @throws IOException
[ERROR] ^
[ERROR] <https://builds.apache.org/job/OpenNLP_java8/ws/.trunk/opennlp-tools/src/main/java/opennlp/tools/doccat/DocumentCategorizerNB.java>:242:
warning: no description for @throws
[ERROR] * @throws ObjectStreamException
[ERROR] ^
[ERROR] <https://builds.apache.org/job/OpenNLP_java8/ws/.trunk/opennlp-tools/src/main/java/opennlp/tools/doccat/DocumentCategorizerNB.java>:74:
warning: no description for @param
[ERROR] * @param model
[ERROR] ^
[ERROR] <https://builds.apache.org/job/OpenNLP_java8/ws/.trunk/opennlp-tools/src/main/java/opennlp/tools/doccat/DocumentCategorizerNB.java>:60:
warning: no description for @param
[ERROR] * @param model
[ERROR] ^
[ERROR] <https://builds.apache.org/job/OpenNLP_java8/ws/.trunk/opennlp-tools/src/main/java/opennlp/tools/doccat/DocumentCategorizerNB.java>:61:
warning: no description for @param
[ERROR] * @param featureGenerators
[ERROR] ^
[ERROR] <https://builds.apache.org/job/OpenNLP_java8/ws/.trunk/opennlp-tools/src/main/java/opennlp/tools/sentdetect/DefaultEndOfSentenceScanner.java>:40:
warning: no description for @param
[ERROR] * @param eosCharacters
[ERROR] ^
[ERROR] <https://builds.apache.org/job/OpenNLP_java8/ws/.trunk/opennlp-tools/src/main/java/opennlp/tools/sentdetect/DefaultSDContextGenerator.java>:51:
warning: no description for @param
[ERROR] * @param eosCharacters
[ERROR] ^
[ERROR] <https://builds.apache.org/job/OpenNLP_java8/ws/.trunk/opennlp-tools/src/main/java/opennlp/tools/sentdetect/DefaultSDContextGenerator.java>:65:
warning: no description for @param
[ERROR] * @param eosCharacters
[ERROR] ^
[ERROR] <https://builds.apache.org/job/OpenNLP_java8/ws/.trunk/opennlp-tools/src/main/java/opennlp/tools/sentdetect/SDCrossValidator.java>:89:
warning: no description for @throws
[ERROR] * @throws IOException
[ERROR] ^
[ERROR] <https://builds.apache.org/job/OpenNLP_java8/ws/.trunk/opennlp-tools/src/main/java/opennlp/tools/sentdetect/SDCrossValidator.java>:77:
warning: no @param for languageCode
[ERROR] public SDCrossValidator(String languageCode) {
[ERROR] ^
[ERROR] <https://builds.apache.org/job/OpenNLP_java8/ws/.trunk/opennlp-tools/src/main/java/opennlp/tools/sentdetect/SDCrossValidator.java>:57:
warning: no @param for languageCode
[ERROR] public SDCrossValidator(String languageCode, TrainingParameters params) {
[ERROR] ^
[ERROR] <https://builds.apache.org/job/OpenNLP_java8/ws/.trunk/opennlp-tools/src/main/java/opennlp/tools/sentdetect/SDCrossValidator.java>:57:
warning: no @param for params
[ERROR] public SDCrossValidator(String languageCode, TrainingParameters params) {
[ERROR] ^
[ERROR] <https://builds.apache.org/job/OpenNLP_java8/ws/.trunk/opennlp-tools/src/main/java/opennlp/tools/sentdetect/SDCrossValidator.java>:67:
warning: no @param for languageCode
[ERROR] public SDCrossValidator(String languageCode, TrainingParameters params,
[ERROR] ^
[ERROR] <https://builds.apache.org/job/OpenNLP_java8/ws/.trunk/opennlp-tools/src/main/java/opennlp/tools/sentdetect/SDCrossValidator.java>:67:
warning: no @param for params
[ERROR] public SDCrossValidator(String languageCode, TrainingParameters params,
[ERROR] ^
[ERROR] <https://builds.apache.org/job/OpenNLP_java8/ws/.trunk/opennlp-tools/src/main/java/opennlp/tools/sentdetect/SDCrossValidator.java>:67:
warning: no @param for listeners
[ERROR] public SDCrossValidator(String languageCode, TrainingParameters params,
[ERROR] ^
[ERROR] <https://builds.apache.org/job/OpenNLP_java8/ws/.trunk/opennlp-tools/src/main/java/opennlp/tools/sentdetect/SDEventStream.java>:37:
warning: no description for @param
[ERROR] * @param samples
[ERROR] ^
[ERROR] <https://builds.apache.org/job/OpenNLP_java8/ws/.trunk/opennlp-tools/src/main/java/opennlp/tools/ml/naivebayes/NaiveBayesModelReader.java>:46:
error: self-closing element not allowed
[ERROR] * <p/>
[ERROR] ^
[ERROR] <https://builds.apache.org/job/OpenNLP_java8/ws/.trunk/opennlp-tools/src/main/java/opennlp/tools/ml/naivebayes/NaiveBayesModelReader.java>:56:
error: self-closing element not allowed
[ERROR] * <p/>
[ERROR] ^
[ERROR] <https://builds.apache.org/job/OpenNLP_java8/ws/.trunk/opennlp-tools/src/main/java/opennlp/tools/ml/naivebayes/NaiveBayesModelWriter.java>:117:
error: self-closing element not allowed
[ERROR] * <p/>
[ERROR] ^
[ERROR] 
[ERROR] Command line was: /jenkins/tools/hudson.model.JDK/jdk-1.8.0/jre/../bin/javadoc @options
@packages
[ERROR] 
[ERROR] Refer to the generated Javadoc files in '<https://builds.apache.org/job/OpenNLP_java8/ws/.trunk/opennlp-tools/target/apidocs'>
dir.
[ERROR] -> [Help 1]
[ERROR] 
[ERROR] To see the full stack trace of the errors, re-run Maven with the -e switch.
[ERROR] Re-run Maven using the -X switch to enable full debug logging.
[ERROR] 
[ERROR] For more information about the errors and possible solutions, please read the following
articles:
[ERROR] [Help 1] http://cwiki.apache.org/confluence/display/MAVEN/MojoExecutionException
[ERROR] 
[ERROR] After correcting the problems, you can resume the build with the command
[ERROR]   mvn <goals> -rf :opennlp-tools
[JENKINS] Archiving <https://builds.apache.org/job/OpenNLP_java8/ws/.trunk/opennlp-uima/pom.xml>
to org.apache.opennlp/opennlp-uima/1.6.1-SNAPSHOT/opennlp-uima-1.6.1-SNAPSHOT.pom
Sending artifact delta relative to OpenNLP_java8 » Apache OpenNLP UIMA Annotators #114
Archived 1 artifacts
Archive block size is 32768
Received 0 blocks and 3131 bytes
Compression is 0.0%
Took 2 sec
[JENKINS] Archiving <https://builds.apache.org/job/OpenNLP_java8/ws/.trunk/opennlp-tools/pom.xml>
to org.apache.opennlp/opennlp-tools/1.6.1-SNAPSHOT/opennlp-tools-1.6.1-SNAPSHOT.pom
[JENKINS] Archiving <https://builds.apache.org/job/OpenNLP_java8/ws/.trunk/opennlp-tools/target/opennlp-tools-1.6.1-SNAPSHOT.jar>
to org.apache.opennlp/opennlp-tools/1.6.1-SNAPSHOT/opennlp-tools-1.6.1-SNAPSHOT.jar
Sending artifact delta relative to OpenNLP_java8 » Apache OpenNLP Tools #114
Archived 2 artifacts
Archive block size is 32768
Received 0 blocks and 1118533 bytes
Compression is 0.0%
Took 3 sec
[JENKINS] Archiving <https://builds.apache.org/job/OpenNLP_java8/ws/.trunk/pom.xml>
to org.apache.opennlp/opennlp/1.6.1-SNAPSHOT/opennlp-1.6.1-SNAPSHOT.pom
Sending artifact delta relative to OpenNLP_java8 » Apache OpenNLP Reactor #114
Archived 1 artifacts
Archive block size is 32768
Received 0 blocks and 6551 bytes
Compression is 0.0%
Took 0.71 sec
[JENKINS] Archiving <https://builds.apache.org/job/OpenNLP_java8/ws/.trunk/opennlp-distr/pom.xml>
to org.apache.opennlp/opennlp-distr/1.6.1-SNAPSHOT/opennlp-distr-1.6.1-SNAPSHOT.pom
Sending artifact delta relative to OpenNLP_java8 » Apache OpenNLP Distribution #114
Archived 1 artifacts
Archive block size is 32768
Received 0 blocks and 4713 bytes
Compression is 0.0%
Took 3.7 sec
[JENKINS] Archiving <https://builds.apache.org/job/OpenNLP_java8/ws/.trunk/opennlp-docs/pom.xml>
to org.apache.opennlp/opennlp-docs/1.6.1-SNAPSHOT/opennlp-docs-1.6.1-SNAPSHOT.pom
Sending artifact delta relative to OpenNLP_java8 » Apache OpenNLP Documentation #114
Archived 1 artifacts
Archive block size is 32768
Received 0 blocks and 2672 bytes
Compression is 0.0%
Took 1.2 sec
Sending e-mails to: dev@opennlp.apache.org
channel stopped

Mime
View raw message