openmeetings-dev mailing list archives

Site index · List index
Message view « Date » · « Thread »
Top « Date » · « Thread »
From Apache Jenkins Server <jenk...@builds.apache.org>
Subject Build failed in Jenkins: openmeetings #2877
Date Wed, 19 Jun 2019 09:54:30 GMT
See <https://builds.apache.org/job/openmeetings/2877/display/redirect?page=changes>

Changes:

[solomax666] [OPENMEETINGS-2042] some more issues are addressed

------------------------------------------
[...truncated 247.52 KB...]
[INFO] Downloaded from central: https://repo.maven.apache.org/maven2/com/thoughtworks/xstream/xstream/1.4.5/xstream-1.4.5.jar
(509 kB at 8.1 MB/s)
[INFO] Downloaded from central: https://repo.maven.apache.org/maven2/org/sonatype/nexus/plugins/nexus-restlet1x-model/2.7.2-01/nexus-restlet1x-model-2.7.2-01.jar
(160 kB at 2.5 MB/s)
[INFO] Downloaded from central: https://repo.maven.apache.org/maven2/org/slf4j/slf4j-simple/1.7.5/slf4j-simple-1.7.5.jar
(11 kB at 178 kB/s)
[INFO] Downloaded from central: https://repo.maven.apache.org/maven2/org/sonatype/spice/zapper/spice-zapper/1.2/spice-zapper-1.2.jar
(168 kB at 2.4 MB/s)
[WARNING] The directive.evaluate.context.class property has been deprecated. It will be removed
in Velocity 2.0.  Instead, please use the automatically provided $evaluate namespace to get
and set local references (e.g. #set($evaluate.foo = 'bar') and $evaluate.foo).
[WARNING] The directive.evaluate.context.class property has been deprecated. It will be removed
in Velocity 2.0.  Instead, please use the automatically provided $evaluate namespace to get
and set local references (e.g. #set($evaluate.foo = 'bar') and $evaluate.foo).
[WARNING] The directive.evaluate.context.class property has been deprecated. It will be removed
in Velocity 2.0.  Instead, please use the automatically provided $evaluate namespace to get
and set local references (e.g. #set($evaluate.foo = 'bar') and $evaluate.foo).
[INFO] Generating "Dependency Convergence" report --- maven-project-info-reports-plugin:3.0.0:dependency-convergence
[WARNING] The directive.evaluate.context.class property has been deprecated. It will be removed
in Velocity 2.0.  Instead, please use the automatically provided $evaluate namespace to get
and set local references (e.g. #set($evaluate.foo = 'bar') and $evaluate.foo).
[WARNING] The directive.evaluate.context.class property has been deprecated. It will be removed
in Velocity 2.0.  Instead, please use the automatically provided $evaluate namespace to get
and set local references (e.g. #set($evaluate.foo = 'bar') and $evaluate.foo).
[WARNING] The directive.evaluate.context.class property has been deprecated. It will be removed
in Velocity 2.0.  Instead, please use the automatically provided $evaluate namespace to get
and set local references (e.g. #set($evaluate.foo = 'bar') and $evaluate.foo).
[INFO] Generating "Dependency Management" report --- maven-project-info-reports-plugin:3.0.0:dependency-management
[WARNING] The directive.evaluate.context.class property has been deprecated. It will be removed
in Velocity 2.0.  Instead, please use the automatically provided $evaluate namespace to get
and set local references (e.g. #set($evaluate.foo = 'bar') and $evaluate.foo).
[WARNING] The directive.evaluate.context.class property has been deprecated. It will be removed
in Velocity 2.0.  Instead, please use the automatically provided $evaluate namespace to get
and set local references (e.g. #set($evaluate.foo = 'bar') and $evaluate.foo).
[WARNING] The directive.evaluate.context.class property has been deprecated. It will be removed
in Velocity 2.0.  Instead, please use the automatically provided $evaluate namespace to get
and set local references (e.g. #set($evaluate.foo = 'bar') and $evaluate.foo).
[INFO] Generating "Distribution Management" report --- maven-project-info-reports-plugin:3.0.0:distribution-management
[WARNING] The directive.evaluate.context.class property has been deprecated. It will be removed
in Velocity 2.0.  Instead, please use the automatically provided $evaluate namespace to get
and set local references (e.g. #set($evaluate.foo = 'bar') and $evaluate.foo).
[WARNING] The directive.evaluate.context.class property has been deprecated. It will be removed
in Velocity 2.0.  Instead, please use the automatically provided $evaluate namespace to get
and set local references (e.g. #set($evaluate.foo = 'bar') and $evaluate.foo).
[WARNING] The directive.evaluate.context.class property has been deprecated. It will be removed
in Velocity 2.0.  Instead, please use the automatically provided $evaluate namespace to get
and set local references (e.g. #set($evaluate.foo = 'bar') and $evaluate.foo).
[INFO] Generating "Issue Management" report     --- maven-project-info-reports-plugin:3.0.0:issue-management
[WARNING] The directive.evaluate.context.class property has been deprecated. It will be removed
in Velocity 2.0.  Instead, please use the automatically provided $evaluate namespace to get
and set local references (e.g. #set($evaluate.foo = 'bar') and $evaluate.foo).
[WARNING] The directive.evaluate.context.class property has been deprecated. It will be removed
in Velocity 2.0.  Instead, please use the automatically provided $evaluate namespace to get
and set local references (e.g. #set($evaluate.foo = 'bar') and $evaluate.foo).
[WARNING] The directive.evaluate.context.class property has been deprecated. It will be removed
in Velocity 2.0.  Instead, please use the automatically provided $evaluate namespace to get
and set local references (e.g. #set($evaluate.foo = 'bar') and $evaluate.foo).
[INFO] Generating "Licenses" report             --- maven-project-info-reports-plugin:3.0.0:licenses
[WARNING] The directive.evaluate.context.class property has been deprecated. It will be removed
in Velocity 2.0.  Instead, please use the automatically provided $evaluate namespace to get
and set local references (e.g. #set($evaluate.foo = 'bar') and $evaluate.foo).
[WARNING] The directive.evaluate.context.class property has been deprecated. It will be removed
in Velocity 2.0.  Instead, please use the automatically provided $evaluate namespace to get
and set local references (e.g. #set($evaluate.foo = 'bar') and $evaluate.foo).
[WARNING] The directive.evaluate.context.class property has been deprecated. It will be removed
in Velocity 2.0.  Instead, please use the automatically provided $evaluate namespace to get
and set local references (e.g. #set($evaluate.foo = 'bar') and $evaluate.foo).
[INFO] Generating "Mailing Lists" report        --- maven-project-info-reports-plugin:3.0.0:mailing-lists
[WARNING] The directive.evaluate.context.class property has been deprecated. It will be removed
in Velocity 2.0.  Instead, please use the automatically provided $evaluate namespace to get
and set local references (e.g. #set($evaluate.foo = 'bar') and $evaluate.foo).
[WARNING] The directive.evaluate.context.class property has been deprecated. It will be removed
in Velocity 2.0.  Instead, please use the automatically provided $evaluate namespace to get
and set local references (e.g. #set($evaluate.foo = 'bar') and $evaluate.foo).
[WARNING] The directive.evaluate.context.class property has been deprecated. It will be removed
in Velocity 2.0.  Instead, please use the automatically provided $evaluate namespace to get
and set local references (e.g. #set($evaluate.foo = 'bar') and $evaluate.foo).
[INFO] Generating "Plugin Management" report    --- maven-project-info-reports-plugin:3.0.0:plugin-management
[WARNING] The directive.evaluate.context.class property has been deprecated. It will be removed
in Velocity 2.0.  Instead, please use the automatically provided $evaluate namespace to get
and set local references (e.g. #set($evaluate.foo = 'bar') and $evaluate.foo).
[WARNING] The directive.evaluate.context.class property has been deprecated. It will be removed
in Velocity 2.0.  Instead, please use the automatically provided $evaluate namespace to get
and set local references (e.g. #set($evaluate.foo = 'bar') and $evaluate.foo).
[WARNING] The directive.evaluate.context.class property has been deprecated. It will be removed
in Velocity 2.0.  Instead, please use the automatically provided $evaluate namespace to get
and set local references (e.g. #set($evaluate.foo = 'bar') and $evaluate.foo).
[INFO] Generating "Plugins" report              --- maven-project-info-reports-plugin:3.0.0:plugins
[WARNING] The directive.evaluate.context.class property has been deprecated. It will be removed
in Velocity 2.0.  Instead, please use the automatically provided $evaluate namespace to get
and set local references (e.g. #set($evaluate.foo = 'bar') and $evaluate.foo).
[WARNING] The directive.evaluate.context.class property has been deprecated. It will be removed
in Velocity 2.0.  Instead, please use the automatically provided $evaluate namespace to get
and set local references (e.g. #set($evaluate.foo = 'bar') and $evaluate.foo).
[WARNING] The directive.evaluate.context.class property has been deprecated. It will be removed
in Velocity 2.0.  Instead, please use the automatically provided $evaluate namespace to get
and set local references (e.g. #set($evaluate.foo = 'bar') and $evaluate.foo).
[INFO] Generating "Team" report                 --- maven-project-info-reports-plugin:3.0.0:team
[WARNING] The directive.evaluate.context.class property has been deprecated. It will be removed
in Velocity 2.0.  Instead, please use the automatically provided $evaluate namespace to get
and set local references (e.g. #set($evaluate.foo = 'bar') and $evaluate.foo).
[WARNING] The directive.evaluate.context.class property has been deprecated. It will be removed
in Velocity 2.0.  Instead, please use the automatically provided $evaluate namespace to get
and set local references (e.g. #set($evaluate.foo = 'bar') and $evaluate.foo).
[WARNING] The directive.evaluate.context.class property has been deprecated. It will be removed
in Velocity 2.0.  Instead, please use the automatically provided $evaluate namespace to get
and set local references (e.g. #set($evaluate.foo = 'bar') and $evaluate.foo).
[INFO] Generating "Source Code Management" report --- maven-project-info-reports-plugin:3.0.0:scm
[WARNING] The directive.evaluate.context.class property has been deprecated. It will be removed
in Velocity 2.0.  Instead, please use the automatically provided $evaluate namespace to get
and set local references (e.g. #set($evaluate.foo = 'bar') and $evaluate.foo).
[WARNING] The directive.evaluate.context.class property has been deprecated. It will be removed
in Velocity 2.0.  Instead, please use the automatically provided $evaluate namespace to get
and set local references (e.g. #set($evaluate.foo = 'bar') and $evaluate.foo).
[WARNING] The directive.evaluate.context.class property has been deprecated. It will be removed
in Velocity 2.0.  Instead, please use the automatically provided $evaluate namespace to get
and set local references (e.g. #set($evaluate.foo = 'bar') and $evaluate.foo).
[INFO] Generating "Summary" report              --- maven-project-info-reports-plugin:3.0.0:summary
[WARNING] The directive.evaluate.context.class property has been deprecated. It will be removed
in Velocity 2.0.  Instead, please use the automatically provided $evaluate namespace to get
and set local references (e.g. #set($evaluate.foo = 'bar') and $evaluate.foo).
[WARNING] The directive.evaluate.context.class property has been deprecated. It will be removed
in Velocity 2.0.  Instead, please use the automatically provided $evaluate namespace to get
and set local references (e.g. #set($evaluate.foo = 'bar') and $evaluate.foo).
[WARNING] The directive.evaluate.context.class property has been deprecated. It will be removed
in Velocity 2.0.  Instead, please use the automatically provided $evaluate namespace to get
and set local references (e.g. #set($evaluate.foo = 'bar') and $evaluate.foo).
[INFO] Generating "Surefire Report" report      --- maven-surefire-report-plugin:3.0.0-M3:report-only
[WARNING] Unable to locate Test Source XRef to link to - DISABLED
[WARNING] The directive.evaluate.context.class property has been deprecated. It will be removed
in Velocity 2.0.  Instead, please use the automatically provided $evaluate namespace to get
and set local references (e.g. #set($evaluate.foo = 'bar') and $evaluate.foo).
[WARNING] The directive.evaluate.context.class property has been deprecated. It will be removed
in Velocity 2.0.  Instead, please use the automatically provided $evaluate namespace to get
and set local references (e.g. #set($evaluate.foo = 'bar') and $evaluate.foo).
[WARNING] The directive.evaluate.context.class property has been deprecated. It will be removed
in Velocity 2.0.  Instead, please use the automatically provided $evaluate namespace to get
and set local references (e.g. #set($evaluate.foo = 'bar') and $evaluate.foo).
[INFO] Generating "Rat Report" report           --- apache-rat-plugin:0.13:rat
[INFO] Added 1 additional default licenses.
[INFO] Enabled default license matchers.
[INFO] Added 1 custom approved licenses.
[INFO] Will parse SCM ignores for exclusions...
[INFO] Finished adding exclusions from SCM ignore files.
[INFO] 62 implicit excludes (use -debug for more details).
[INFO] 2 explicit excludes (use -debug for more details).
[INFO] 37 resources included (use -debug for more details)
[WARNING] The directive.evaluate.context.class property has been deprecated. It will be removed
in Velocity 2.0.  Instead, please use the automatically provided $evaluate namespace to get
and set local references (e.g. #set($evaluate.foo = 'bar') and $evaluate.foo).
[WARNING] The directive.evaluate.context.class property has been deprecated. It will be removed
in Velocity 2.0.  Instead, please use the automatically provided $evaluate namespace to get
and set local references (e.g. #set($evaluate.foo = 'bar') and $evaluate.foo).
[WARNING] The directive.evaluate.context.class property has been deprecated. It will be removed
in Velocity 2.0.  Instead, please use the automatically provided $evaluate namespace to get
and set local references (e.g. #set($evaluate.foo = 'bar') and $evaluate.foo).
[WARNING] The directive.evaluate.context.class property has been deprecated. It will be removed
in Velocity 2.0.  Instead, please use the automatically provided $evaluate namespace to get
and set local references (e.g. #set($evaluate.foo = 'bar') and $evaluate.foo).
[WARNING] The directive.evaluate.context.class property has been deprecated. It will be removed
in Velocity 2.0.  Instead, please use the automatically provided $evaluate namespace to get
and set local references (e.g. #set($evaluate.foo = 'bar') and $evaluate.foo).
[WARNING] The directive.evaluate.context.class property has been deprecated. It will be removed
in Velocity 2.0.  Instead, please use the automatically provided $evaluate namespace to get
and set local references (e.g. #set($evaluate.foo = 'bar') and $evaluate.foo).
[WARNING] The directive.evaluate.context.class property has been deprecated. It will be removed
in Velocity 2.0.  Instead, please use the automatically provided $evaluate namespace to get
and set local references (e.g. #set($evaluate.foo = 'bar') and $evaluate.foo).
[WARNING] The directive.evaluate.context.class property has been deprecated. It will be removed
in Velocity 2.0.  Instead, please use the automatically provided $evaluate namespace to get
and set local references (e.g. #set($evaluate.foo = 'bar') and $evaluate.foo).
[WARNING] The directive.evaluate.context.class property has been deprecated. It will be removed
in Velocity 2.0.  Instead, please use the automatically provided $evaluate namespace to get
and set local references (e.g. #set($evaluate.foo = 'bar') and $evaluate.foo).
[JENKINS] Archiving site from <https://builds.apache.org/job/openmeetings/ws/openmeetings-util/target/site>
to /x1/jenkins/jenkins-home/jobs/openmeetings/site/openmeetings-util
[INFO] 
[INFO] --- maven-resources-plugin:3.1.0:resources (default-resources) @ openmeetings-util
---
[INFO] Using 'UTF-8' encoding to copy filtered resources.
[INFO] Copying 2 resources
[INFO] Copying 3 resources
[INFO] 
[INFO] --- maven-compiler-plugin:3.8.1:compile (default-compile) @ openmeetings-util ---
[INFO] Changes detected - recompiling the module!
[INFO] Compiling 25 source files to <https://builds.apache.org/job/openmeetings/ws/openmeetings-util/target/classes>
[INFO] 
[INFO] --- maven-resources-plugin:3.1.0:testResources (default-testResources) @ openmeetings-util
---
[INFO] Using 'UTF-8' encoding to copy filtered resources.
[INFO] Copying 2 resources
[INFO] Copying 3 resources
[INFO] 
[INFO] --- maven-compiler-plugin:3.8.1:testCompile (default-testCompile) @ openmeetings-util
---
[INFO] Changes detected - recompiling the module!
[INFO] Compiling 6 source files to <https://builds.apache.org/job/openmeetings/ws/openmeetings-util/target/test-classes>
[INFO] 
[INFO] --- maven-surefire-plugin:3.0.0-M3:test (default-test) @ openmeetings-util ---
[INFO] 
[INFO] -------------------------------------------------------
[INFO]  T E S T S
[INFO] -------------------------------------------------------
[INFO] Running org.apache.openmeetings.util.crypt.TestSCrypt
[INFO] Tests run: 3, Failures: 0, Errors: 0, Skipped: 0, Time elapsed: 209.078 s - in org.apache.openmeetings.util.crypt.TestSCrypt
[INFO] Running org.apache.openmeetings.util.TestCalendarPatterns
[INFO] Tests run: 1, Failures: 0, Errors: 0, Skipped: 0, Time elapsed: 0.297 s - in org.apache.openmeetings.util.TestCalendarPatterns
[INFO] Running org.apache.openmeetings.util.TestVersion
09:53:30.742 [main] DEBUG org.apache.openmeetings.util.Version - 
	################################################################################
	#                              Openmeetings is up                              #
	#                5.0.0-M2-SNAPSHOT c60a9cc 2019-06-19T09:49:51Z                #
	#                               and ready to use                               #
	################################################################################

[INFO] Tests run: 4, Failures: 0, Errors: 0, Skipped: 0, Time elapsed: 0.238 s - in org.apache.openmeetings.util.TestVersion
[INFO] Running org.apache.openmeetings.util.TestStoredFile
Jun 19, 2019 9:53:33 AM org.apache.tika.config.InitializableProblemHandler$3 handleInitializableProblem
WARNING: J2KImageReader not loaded. JPEG2000 files will not be processed.
See https://pdfbox.apache.org/2.0/dependencies.html#jai-image-io
for optional dependencies.

Jun 19, 2019 9:53:33 AM org.apache.tika.config.InitializableProblemHandler$3 handleInitializableProblem
WARNING: org.xerial's sqlite-jdbc is not loaded.
Please provide the jar on your classpath to parse sqlite files.
See tika-parsers/pom.xml for the correct version.
[INFO] Tests run: 5, Failures: 0, Errors: 0, Skipped: 0, Time elapsed: 1.54 s - in org.apache.openmeetings.util.TestStoredFile
[INFO] 
[INFO] Results:
[INFO] 
[INFO] Tests run: 13, Failures: 0, Errors: 0, Skipped: 0
[INFO] 
[JENKINS] Recording test results
[WARNING] Attempt to (de-)serialize anonymous class hudson.maven.reporters.SurefireArchiver$2;
see: https://jenkins.io/redirect/serialization-of-anonymous-classes/
[WARNING] Attempt to (de-)serialize anonymous class hudson.maven.reporters.BuildInfoRecorder$1;
see: https://jenkins.io/redirect/serialization-of-anonymous-classes/
[INFO] 
[INFO] --- maven-jar-plugin:3.1.2:jar (default-jar) @ openmeetings-util ---
[INFO] Downloading from central: https://repo.maven.apache.org/maven2/org/apache/maven/maven-archiver/3.4.0/maven-archiver-3.4.0.jar
[INFO] Downloaded from central: https://repo.maven.apache.org/maven2/org/apache/maven/maven-archiver/3.4.0/maven-archiver-3.4.0.jar
(24 kB at 1.2 MB/s)
[INFO] Building jar: <https://builds.apache.org/job/openmeetings/ws/openmeetings-util/target/openmeetings-util-5.0.0-M2-SNAPSHOT.jar>
[INFO] 
[INFO] --- maven-jar-plugin:3.1.2:test-jar (default) @ openmeetings-util ---
[INFO] Building jar: <https://builds.apache.org/job/openmeetings/ws/openmeetings-util/target/openmeetings-util-5.0.0-M2-SNAPSHOT-tests.jar>
[INFO] 
[INFO] --- maven-site-plugin:3.7.1:attach-descriptor (attach-descriptor) @ openmeetings-util
---
[INFO] Skipping because packaging 'jar' is not pom.
[INFO] 
[INFO] --- forbiddenapis:2.6:check (forbiddenapis) @ openmeetings-util ---
[INFO] Scanning for classes to check...
[INFO] Reading bundled API signatures: jdk-deprecated-1.7
[INFO] Reading bundled API signatures: jdk-non-portable
[INFO] Reading inline API signatures...
[INFO] Loading classes to check...
[INFO] Scanning classes for violations...
[INFO] Scanned 28 class file(s) for forbidden API invocations (in 0.34s), 0 error(s).
[INFO] 
[INFO] --- forbiddenapis:2.6:testCheck (forbiddenapis) @ openmeetings-util ---
[INFO] Scanning for classes to check...
[INFO] Reading bundled API signatures: jdk-deprecated-1.7
[INFO] Reading bundled API signatures: jdk-non-portable
[INFO] Reading inline API signatures...
[INFO] Loading classes to check...
[INFO] Scanning classes for violations...
[INFO] Scanned 6 class file(s) for forbidden API invocations (in 0.07s), 0 error(s).
[INFO] 
[INFO] --- maven-install-plugin:2.5.2:install (default-install) @ openmeetings-util ---
[INFO] Installing <https://builds.apache.org/job/openmeetings/ws/openmeetings-util/target/openmeetings-util-5.0.0-M2-SNAPSHOT.jar>
to /home/jenkins/jenkins-slave/maven-repositories/1/org/apache/openmeetings/openmeetings-util/5.0.0-M2-SNAPSHOT/openmeetings-util-5.0.0-M2-SNAPSHOT.jar
[INFO] Installing <https://builds.apache.org/job/openmeetings/ws/openmeetings-util/pom.xml>
to /home/jenkins/jenkins-slave/maven-repositories/1/org/apache/openmeetings/openmeetings-util/5.0.0-M2-SNAPSHOT/openmeetings-util-5.0.0-M2-SNAPSHOT.pom
[INFO] Installing <https://builds.apache.org/job/openmeetings/ws/openmeetings-util/target/openmeetings-util-5.0.0-M2-SNAPSHOT-tests.jar>
to /home/jenkins/jenkins-slave/maven-repositories/1/org/apache/openmeetings/openmeetings-util/5.0.0-M2-SNAPSHOT/openmeetings-util-5.0.0-M2-SNAPSHOT-tests.jar
[INFO] 
[INFO] --------------< org.apache.openmeetings:openmeetings-db >---------------
[INFO] Building Openmeetings DB 5.0.0-M2-SNAPSHOT                        [3/10]
[INFO] --------------------------------[ jar ]---------------------------------
[INFO] Downloading from central: https://repo.maven.apache.org/maven2/org/apache/openjpa/openjpa-maven-plugin/3.1.0/openjpa-maven-plugin-3.1.0.pom
[INFO] Downloaded from central: https://repo.maven.apache.org/maven2/org/apache/openjpa/openjpa-maven-plugin/3.1.0/openjpa-maven-plugin-3.1.0.pom
(7.9 kB at 78 kB/s)
[INFO] Downloading from central: https://repo.maven.apache.org/maven2/org/apache/openjpa/openjpa-tools/3.1.0/openjpa-tools-3.1.0.pom
[INFO] Downloaded from central: https://repo.maven.apache.org/maven2/org/apache/openjpa/openjpa-tools/3.1.0/openjpa-tools-3.1.0.pom
(2.1 kB at 26 kB/s)
[INFO] Downloading from central: https://repo.maven.apache.org/maven2/org/apache/openjpa/openjpa-maven-plugin/3.1.0/openjpa-maven-plugin-3.1.0.jar
[INFO] Downloaded from central: https://repo.maven.apache.org/maven2/org/apache/openjpa/openjpa-maven-plugin/3.1.0/openjpa-maven-plugin-3.1.0.jar
(38 kB at 1.5 MB/s)
[INFO] Downloading from openmeetings-bintray: https://dl.bintray.com/openmeetings/maven/org/wicketstuff/wicketstuff-datastore-hazelcast/9.0.0-M2/wicketstuff-datastore-hazelcast-9.0.0-M2.jar
[INFO] Downloading from openmeetings-bintray: https://dl.bintray.com/openmeetings/maven/org/wicketstuff/wicketstuff-datastore-common/9.0.0-M2/wicketstuff-datastore-common-9.0.0-M2.jar
[INFO] Downloading from openmeetings-bintray: https://dl.bintray.com/openmeetings/maven/org/apache/wicket/wicket-devutils/9.0.0-M2/wicket-devutils-9.0.0-M2.jar
[INFO] Downloading from openmeetings-bintray: https://dl.bintray.com/openmeetings/maven/org/apache/openjpa/openjpa/3.1.0/openjpa-3.1.0.jar
[INFO] Downloading from openmeetings-bintray: https://dl.bintray.com/openmeetings/maven/org/apache/geronimo/specs/geronimo-jpa_2.2_spec/1.0/geronimo-jpa_2.2_spec-1.0.jar
[INFO] Downloading from openmeetings-bintray: https://dl.bintray.com/openmeetings/maven/org/simpleframework/simple-xml/2.7.1/simple-xml-2.7.1.jar
[INFO] Downloading from openmeetings-bintray: https://dl.bintray.com/openmeetings/maven/stax/stax/1.2.0/stax-1.2.0.jar
[INFO] Downloading from openmeetings-bintray: https://dl.bintray.com/openmeetings/maven/org/asteriskjava/asterisk-java/2.0.2/asterisk-java-2.0.2.jar
[INFO] Downloading from openmeetings-bintray: https://dl.bintray.com/openmeetings/maven/com/microsoft/sqlserver/mssql-jdbc/7.2.2.jre11/mssql-jdbc-7.2.2.jre11.jar
[INFO] Downloading from central: https://repo.maven.apache.org/maven2/org/wicketstuff/wicketstuff-datastore-hazelcast/9.0.0-M2/wicketstuff-datastore-hazelcast-9.0.0-M2.jar
[INFO] Downloading from central: https://repo.maven.apache.org/maven2/org/wicketstuff/wicketstuff-datastore-common/9.0.0-M2/wicketstuff-datastore-common-9.0.0-M2.jar
[INFO] Downloading from central: https://repo.maven.apache.org/maven2/org/apache/wicket/wicket-devutils/9.0.0-M2/wicket-devutils-9.0.0-M2.jar
[INFO] Downloading from central: https://repo.maven.apache.org/maven2/org/apache/openjpa/openjpa/3.1.0/openjpa-3.1.0.jar
[INFO] Downloading from central: https://repo.maven.apache.org/maven2/org/apache/geronimo/specs/geronimo-jpa_2.2_spec/1.0/geronimo-jpa_2.2_spec-1.0.jar
[INFO] Downloading from central: https://repo.maven.apache.org/maven2/org/simpleframework/simple-xml/2.7.1/simple-xml-2.7.1.jar
[INFO] Downloaded from central: https://repo.maven.apache.org/maven2/org/wicketstuff/wicketstuff-datastore-hazelcast/9.0.0-M2/wicketstuff-datastore-hazelcast-9.0.0-M2.jar
(6.6 kB at 474 kB/s)
[INFO] Downloading from central: https://repo.maven.apache.org/maven2/stax/stax/1.2.0/stax-1.2.0.jar
[INFO] Downloaded from central: https://repo.maven.apache.org/maven2/org/wicketstuff/wicketstuff-datastore-common/9.0.0-M2/wicketstuff-datastore-common-9.0.0-M2.jar
(10.0 kB at 587 kB/s)
[INFO] Downloading from central: https://repo.maven.apache.org/maven2/org/asteriskjava/asterisk-java/2.0.2/asterisk-java-2.0.2.jar
[INFO] Downloaded from central: https://repo.maven.apache.org/maven2/org/apache/geronimo/specs/geronimo-jpa_2.2_spec/1.0/geronimo-jpa_2.2_spec-1.0.jar
(128 kB at 6.1 MB/s)
[INFO] Downloading from central: https://repo.maven.apache.org/maven2/com/microsoft/sqlserver/mssql-jdbc/7.2.2.jre11/mssql-jdbc-7.2.2.jre11.jar
[INFO] Downloaded from central: https://repo.maven.apache.org/maven2/stax/stax/1.2.0/stax-1.2.0.jar
(179 kB at 6.0 MB/s)
[INFO] Downloaded from central: https://repo.maven.apache.org/maven2/org/asteriskjava/asterisk-java/2.0.2/asterisk-java-2.0.2.jar
(907 kB at 12 MB/s)
[INFO] Downloaded from central: https://repo.maven.apache.org/maven2/org/simpleframework/simple-xml/2.7.1/simple-xml-2.7.1.jar
(413 kB at 4.3 MB/s)
[INFO] Downloaded from central: https://repo.maven.apache.org/maven2/com/microsoft/sqlserver/mssql-jdbc/7.2.2.jre11/mssql-jdbc-7.2.2.jre11.jar
(1.1 MB at 11 MB/s)
[INFO] Downloaded from central: https://repo.maven.apache.org/maven2/org/apache/openjpa/openjpa/3.1.0/openjpa-3.1.0.jar
(4.6 MB at 3.6 MB/s)
[INFO] ------------------------------------------------------------------------
[INFO] Reactor Summary for Openmeetings 5.0.0-M2-SNAPSHOT:
[INFO] 
[INFO] Openmeetings ....................................... SUCCESS [02:59 min]
[INFO] Openmeetings Util .................................. SUCCESS [04:27 min]
[INFO] Openmeetings DB .................................... FAILURE [  2.250 s]
[INFO] Openmeetings Core .................................. SKIPPED
[INFO] Openmeetings Install ............................... SKIPPED
[INFO] Openmeetings Service ............................... SKIPPED
[INFO] Openmeetings Webservices ........................... SKIPPED
[INFO] Openmeetings Web ................................... SKIPPED
[INFO] Openmeetings Screen Sharing applet ................. SKIPPED
[INFO] Openmeetings Server ................................ SKIPPED
[INFO] ------------------------------------------------------------------------
[INFO] BUILD FAILURE
[INFO] ------------------------------------------------------------------------
[INFO] Total time:  07:53 min
[INFO] Finished at: 2019-06-19T09:54:02Z
[INFO] ------------------------------------------------------------------------
Waiting for Jenkins to finish collecting data
[ERROR] Failed to execute goal on project openmeetings-db: Could not resolve dependencies
for project org.apache.openmeetings:openmeetings-db:jar:5.0.0-M2-SNAPSHOT: Could not transfer
artifact org.apache.wicket:wicket-devutils:jar:9.0.0-M2 from/to central (https://repo.maven.apache.org/maven2):
Connection reset -> [Help 1]
[ERROR] 
[ERROR] To see the full stack trace of the errors, re-run Maven with the -e switch.
[ERROR] Re-run Maven using the -X switch to enable full debug logging.
[ERROR] 
[ERROR] For more information about the errors and possible solutions, please read the following
articles:
[ERROR] [Help 1] http://cwiki.apache.org/confluence/display/MAVEN/DependencyResolutionException
[ERROR] 
[ERROR] After correcting the problems, you can resume the build with the command
[ERROR]   mvn <goals> -rf :openmeetings-db
[JENKINS] Archiving <https://builds.apache.org/job/openmeetings/ws/openmeetings-server/pom.xml>
to org.apache.openmeetings/openmeetings-server/5.0.0-M2-SNAPSHOT/openmeetings-server-5.0.0-M2-SNAPSHOT.pom
[JENKINS] Archiving <https://builds.apache.org/job/openmeetings/ws/openmeetings-screenshare/pom.xml>
to org.apache.openmeetings/openmeetings-screenshare/5.0.0-M2-SNAPSHOT/openmeetings-screenshare-5.0.0-M2-SNAPSHOT.pom
[JENKINS] Archiving <https://builds.apache.org/job/openmeetings/ws/openmeetings-util/pom.xml>
to org.apache.openmeetings/openmeetings-util/5.0.0-M2-SNAPSHOT/openmeetings-util-5.0.0-M2-SNAPSHOT.pom
[JENKINS] Archiving <https://builds.apache.org/job/openmeetings/ws/openmeetings-util/target/openmeetings-util-5.0.0-M2-SNAPSHOT.jar>
to org.apache.openmeetings/openmeetings-util/5.0.0-M2-SNAPSHOT/openmeetings-util-5.0.0-M2-SNAPSHOT.jar
[JENKINS] Archiving <https://builds.apache.org/job/openmeetings/ws/openmeetings-util/target/openmeetings-util-5.0.0-M2-SNAPSHOT-tests.jar>
to org.apache.openmeetings/openmeetings-util/5.0.0-M2-SNAPSHOT/openmeetings-util-5.0.0-M2-SNAPSHOT-tests.jar
[JENKINS] Archiving <https://builds.apache.org/job/openmeetings/ws/openmeetings-install/pom.xml>
to org.apache.openmeetings/openmeetings-install/5.0.0-M2-SNAPSHOT/openmeetings-install-5.0.0-M2-SNAPSHOT.pom
[JENKINS] Archiving <https://builds.apache.org/job/openmeetings/ws/openmeetings-service/pom.xml>
to org.apache.openmeetings/openmeetings-service/5.0.0-M2-SNAPSHOT/openmeetings-service-5.0.0-M2-SNAPSHOT.pom
[JENKINS] Archiving <https://builds.apache.org/job/openmeetings/ws/pom.xml> to org.apache.openmeetings/openmeetings-parent/5.0.0-M2-SNAPSHOT/openmeetings-parent-5.0.0-M2-SNAPSHOT.pom
[JENKINS] Archiving <https://builds.apache.org/job/openmeetings/ws/target/openmeetings-parent-5.0.0-M2-SNAPSHOT-site.xml>
to org.apache.openmeetings/openmeetings-parent/5.0.0-M2-SNAPSHOT/openmeetings-parent-5.0.0-M2-SNAPSHOT-site.xml
[JENKINS] Archiving <https://builds.apache.org/job/openmeetings/ws/openmeetings-db/pom.xml>
to org.apache.openmeetings/openmeetings-db/5.0.0-M2-SNAPSHOT/openmeetings-db-5.0.0-M2-SNAPSHOT.pom
[JENKINS] Archiving <https://builds.apache.org/job/openmeetings/ws/openmeetings-web/pom.xml>
to org.apache.openmeetings/openmeetings-web/5.0.0-M2-SNAPSHOT/openmeetings-web-5.0.0-M2-SNAPSHOT.pom
[JENKINS] Archiving <https://builds.apache.org/job/openmeetings/ws/openmeetings-webservice/pom.xml>
to org.apache.openmeetings/openmeetings-webservice/5.0.0-M2-SNAPSHOT/openmeetings-webservice-5.0.0-M2-SNAPSHOT.pom
[JENKINS] Archiving <https://builds.apache.org/job/openmeetings/ws/openmeetings-core/pom.xml>
to org.apache.openmeetings/openmeetings-core/5.0.0-M2-SNAPSHOT/openmeetings-core-5.0.0-M2-SNAPSHOT.pom
Not sending mail to unregistered user solomax666@gmail.com
Sending e-mails to: dev@openmeetings.apache.org
channel stopped
Archiving artifacts
Not sending mail to unregistered user solomax666@gmail.com

Mime
View raw message