openmeetings-dev mailing list archives

Site index · List index
Message view « Date » · « Thread »
Top « Date » · « Thread »
From Apache Jenkins Server <jenk...@builds.apache.org>
Subject Build failed in Jenkins: openmeetings #2850
Date Tue, 28 May 2019 04:05:55 GMT
See <https://builds.apache.org/job/openmeetings/2850/display/redirect?page=changes>

Changes:

[solomax666] [OPENMEETINGS-2051] mockito and war-plugin are updated

------------------------------------------
[...truncated 309.35 KB...]
1100  openmeetings  INFO   [pool-1-thread-4 for channel id=125082001] openjpa.Tool - Enhancer
running on type "class org.apache.openmeetings.db.entity.label.OmLanguage".
1101  openmeetings  INFO   [pool-1-thread-4 for channel id=125082001] openjpa.Tool - Enhancer
running on type "class org.apache.openmeetings.db.entity.log.ConferenceLog".
1116  openmeetings  INFO   [pool-1-thread-4 for channel id=125082001] openjpa.Tool - Enhancer
running on type "class org.apache.openmeetings.db.entity.user.User$Salutation".
1119  openmeetings  INFO   [pool-1-thread-4 for channel id=125082001] openjpa.Tool - Enhancer
running on type "class org.apache.openmeetings.db.entity.user.PrivateMessageFolder".
1130  openmeetings  INFO   [pool-1-thread-4 for channel id=125082001] openjpa.Tool - Enhancer
running on type "class org.apache.openmeetings.db.entity.file.BaseFileItem".
1156  openmeetings  INFO   [pool-1-thread-4 for channel id=125082001] openjpa.Tool - Enhancer
running on type "class org.apache.openmeetings.db.entity.basic.MailMessage".
1178  openmeetings  INFO   [pool-1-thread-4 for channel id=125082001] openjpa.Tool - Enhancer
running on type "class org.apache.openmeetings.db.entity.user.PrivateMessage".
1193  openmeetings  INFO   [pool-1-thread-4 for channel id=125082001] openjpa.Tool - Enhancer
running on type "class org.apache.openmeetings.db.entity.user.User".
1228  openmeetings  INFO   [pool-1-thread-4 for channel id=125082001] openjpa.Tool - Enhancer
running on type "class org.apache.openmeetings.db.entity.room.Invitation$MessageType".
1231  openmeetings  INFO   [pool-1-thread-4 for channel id=125082001] openjpa.Tool - No metadata
was found for 32 classes; they have been enhanced as persistence-aware. If you intended for
any of these classes to be persistence-capable, then this means that OpenJPA could not find
any metadata for those classes. This can happen if the directory containing your metadata
is not in your CLASSPATH, or if your metadata files are not named properly. See the documentation
on metadata placement for more information. Persistence-aware classes: [class org.apache.openmeetings.db.entity.basic.Client$StreamType,
class org.apache.openmeetings.db.entity.basic.Client$Activity, class org.apache.openmeetings.db.entity.file.BaseFileItem$1,
class org.apache.openmeetings.db.entity.room.Invitation$Valid, class org.apache.openmeetings.db.entity.server.OAuthServer$RequestInfoMethod,
class org.apache.openmeetings.db.entity.basic.Configuration$Type, class org.apache.openmeetings.db.entity.basic.Client,
class org.apache.openmeetings.db.entity.basic.Client$1, class org.apache.openmeetings.db.entity.record.RecordingChunk$Type,
class org.apache.openmeetings.db.entity.basic.MailMessage$Status, class org.apache.openmeetings.db.entity.calendar.OmCalendar$SyncType,
class org.apache.openmeetings.db.entity.server.OAuthServer$RequestTokenMethod, class org.apache.openmeetings.db.entity.room.Room$Type,
class org.apache.openmeetings.db.entity.label.StringLabel, class org.apache.openmeetings.db.entity.file.BaseFileItem$Type,
class org.apache.openmeetings.db.entity.calendar.Appointment$Reminder, class org.apache.openmeetings.db.entity.user.AsteriskSipUser$Type,
class org.apache.openmeetings.db.entity.record.Recording$Status, class org.apache.openmeetings.db.entity.user.User$Right,
class org.apache.openmeetings.db.entity.log.ConferenceLog$Type, class org.apache.openmeetings.db.entity.basic.Client$StreamDesc,
class org.apache.openmeetings.db.entity.basic.WsClient, class org.apache.openmeetings.db.entity.label.OmLanguage,
class org.apache.openmeetings.db.entity.room.Room$Right, class org.apache.openmeetings.db.entity.user.User$Salutation,
class org.apache.openmeetings.db.entity.file.BaseFileItem$OriginalFilter, class org.apache.openmeetings.db.entity.room.RoomPoll$Type,
class org.apache.openmeetings.db.entity.room.Room$RoomElement, class org.apache.openmeetings.db.entity.server.RemoteSessionObject,
class org.apache.openmeetings.db.entity.record.RecordingChunk$Status, class org.apache.openmeetings.db.entity.room.Invitation$MessageType,
class org.apache.openmeetings.db.entity.user.User$Type]
[INFO] 
[INFO] --- maven-resources-plugin:3.1.0:testResources (default-testResources) @ openmeetings-db
---
[INFO] Using 'UTF-8' encoding to copy filtered resources.
[INFO] skip non existing resourceDirectory <https://builds.apache.org/job/openmeetings/ws/openmeetings-db/src/test/resources>
[INFO] Copying 3 resources
[INFO] 
[INFO] --- maven-compiler-plugin:3.8.1:testCompile (default-testCompile) @ openmeetings-db
---
[INFO] Changes detected - recompiling the module!
[INFO] Compiling 3 source files to <https://builds.apache.org/job/openmeetings/ws/openmeetings-db/target/test-classes>
[INFO] 
[INFO] --- maven-surefire-plugin:3.0.0-M3:test (default-test) @ openmeetings-db ---
[INFO] 
[INFO] -------------------------------------------------------
[INFO]  T E S T S
[INFO] -------------------------------------------------------
[INFO] Running org.apache.openmeetings.db.util.TestAuthLevelUtil
04:00:49.817 [main] DEBUG org.apache.openmeetings.db.util.AuthLevelUtil - Level Admin :: [GRANTED]
04:00:49.856 [main] DEBUG org.apache.openmeetings.db.util.AuthLevelUtil - Level Admin :: [DENIED]
04:00:49.876 [main] DEBUG org.apache.openmeetings.db.util.AuthLevelUtil - Level Admin :: [DENIED]
[INFO] Tests run: 4, Failures: 0, Errors: 0, Skipped: 0, Time elapsed: 0.316 s - in org.apache.openmeetings.db.util.TestAuthLevelUtil
[INFO] Running org.apache.openmeetings.db.util.TestLocaleHelper
04:00:51.732 [main] WARN org.apache.openmeetings.db.util.LocaleHelper - Invalid country found:
, will be replaced with: AD
04:00:51.743 [main] WARN org.apache.openmeetings.db.util.LocaleHelper - Invalid country found:
ITALY, will be replaced with: AD
[INFO] Tests run: 1, Failures: 0, Errors: 0, Skipped: 0, Time elapsed: 0.183 s - in org.apache.openmeetings.db.util.TestLocaleHelper
[INFO] Running org.apache.openmeetings.db.dto.user.TestOAuthUser
04:00:53.771 [main] ERROR org.apache.openmeetings.db.dto.user.OAuthUser - Failed to get user
email from JSON: {"uid":"4uidhere4","first_name":"John","last_name":"Doe"}
[INFO] Tests run: 4, Failures: 0, Errors: 0, Skipped: 0, Time elapsed: 0.319 s - in org.apache.openmeetings.db.dto.user.TestOAuthUser
[INFO] 
[INFO] Results:
[INFO] 
[INFO] Tests run: 9, Failures: 0, Errors: 0, Skipped: 0
[INFO] 
[JENKINS] Recording test results
[INFO] 
[INFO] --- maven-jar-plugin:3.1.2:jar (default-jar) @ openmeetings-db ---
[INFO] Building jar: <https://builds.apache.org/job/openmeetings/ws/openmeetings-db/target/openmeetings-db-5.0.0-M2-SNAPSHOT.jar>
[INFO] 
[INFO] --- maven-site-plugin:3.7.1:attach-descriptor (attach-descriptor) @ openmeetings-db
---
[INFO] Skipping because packaging 'jar' is not pom.
[INFO] 
[INFO] --- jacoco-maven-plugin:0.8.3:report (jacoco-report) @ openmeetings-db ---
[INFO] Loading execution data file <https://builds.apache.org/job/openmeetings/ws/openmeetings-db/../target/jacoco.exec>
[INFO] Analyzed bundle 'Openmeetings DB' with 125 classes
[INFO] 
[INFO] --- forbiddenapis:2.6:check (forbiddenapis) @ openmeetings-db ---
[INFO] Scanning for classes to check...
[INFO] Reading bundled API signatures: jdk-deprecated-1.7
[INFO] Reading bundled API signatures: jdk-non-portable
[INFO] Reading inline API signatures...
[INFO] Loading classes to check...
[INFO] Scanning classes for violations...
[INFO] Scanned 138 class file(s) for forbidden API invocations (in 0.37s), 0 error(s).
[INFO] 
[INFO] --- forbiddenapis:2.6:testCheck (forbiddenapis) @ openmeetings-db ---
[INFO] Scanning for classes to check...
[INFO] Reading bundled API signatures: jdk-deprecated-1.7
[INFO] Reading bundled API signatures: jdk-non-portable
[INFO] Reading inline API signatures...
[INFO] Loading classes to check...
[INFO] Scanning classes for violations...
[INFO] Scanned 3 class file(s) for forbidden API invocations (in 0.07s), 0 error(s).
[INFO] 
[INFO] --- maven-install-plugin:2.5.2:install (default-install) @ openmeetings-db ---
[INFO] Installing <https://builds.apache.org/job/openmeetings/ws/openmeetings-db/target/openmeetings-db-5.0.0-M2-SNAPSHOT.jar>
to /home/jenkins/jenkins-slave/maven-repositories/0/org/apache/openmeetings/openmeetings-db/5.0.0-M2-SNAPSHOT/openmeetings-db-5.0.0-M2-SNAPSHOT.jar
[INFO] Installing <https://builds.apache.org/job/openmeetings/ws/openmeetings-db/pom.xml>
to /home/jenkins/jenkins-slave/maven-repositories/0/org/apache/openmeetings/openmeetings-db/5.0.0-M2-SNAPSHOT/openmeetings-db-5.0.0-M2-SNAPSHOT.pom
[INFO] 
[INFO] -------------< org.apache.openmeetings:openmeetings-core >--------------
[INFO] Building Openmeetings Core 5.0.0-M2-SNAPSHOT                      [4/10]
[INFO] --------------------------------[ jar ]---------------------------------
[INFO] Downloading from Nexus: http://repository.apache.org/snapshots/org/kurento/kms-api-core/maven-metadata.xml
[INFO] Downloading from sonatype-snapshots: https://oss.sonatype.org/content/repositories/snapshots/org/kurento/kms-api-core/maven-metadata.xml
[INFO] Downloading from apache-snapshots: https://repository.apache.org/content/groups/snapshots/org/kurento/kms-api-core/maven-metadata.xml
[INFO] Downloading from openmeetings-bintray: https://dl.bintray.com/openmeetings/maven/org/kurento/kms-api-core/maven-metadata.xml
[INFO] Downloading from central: https://repo.maven.apache.org/maven2/org/kurento/kms-api-core/maven-metadata.xml
[INFO] Downloaded from central: https://repo.maven.apache.org/maven2/org/kurento/kms-api-core/maven-metadata.xml
(767 B at 51 kB/s)
[INFO] Downloading from kurento-snapshots: https://maven.openvidu.io/repository/snapshots/org/kurento/kms-api-core/maven-metadata.xml
[WARNING] Could not transfer metadata org.kurento:kms-api-core/maven-metadata.xml from/to
kurento-snapshots (https://maven.openvidu.io/repository/snapshots/): Connect to maven.openvidu.io:443
[maven.openvidu.io/184.168.221.82] failed: Connection timed out (Connection timed out)
[INFO] Downloading from openmeetings-bintray: https://dl.bintray.com/openmeetings/maven/org/kurento/kms-api-core/6.7.0/kms-api-core-6.7.0.pom
[INFO] Downloading from central: https://repo.maven.apache.org/maven2/org/kurento/kms-api-core/6.7.0/kms-api-core-6.7.0.pom
[INFO] Downloaded from central: https://repo.maven.apache.org/maven2/org/kurento/kms-api-core/6.7.0/kms-api-core-6.7.0.pom
(2.0 kB at 127 kB/s)
[INFO] Downloading from openmeetings-bintray: https://dl.bintray.com/openmeetings/maven/org/kurento/kms-api-core/6.7.1/kms-api-core-6.7.1.pom
[INFO] Downloading from central: https://repo.maven.apache.org/maven2/org/kurento/kms-api-core/6.7.1/kms-api-core-6.7.1.pom
[INFO] Downloaded from central: https://repo.maven.apache.org/maven2/org/kurento/kms-api-core/6.7.1/kms-api-core-6.7.1.pom
(2.1 kB at 140 kB/s)
[INFO] Downloading from openmeetings-bintray: https://dl.bintray.com/openmeetings/maven/org/kurento/kms-api-core/6.8.0/kms-api-core-6.8.0.pom
[INFO] Downloading from central: https://repo.maven.apache.org/maven2/org/kurento/kms-api-core/6.8.0/kms-api-core-6.8.0.pom
[INFO] Downloaded from central: https://repo.maven.apache.org/maven2/org/kurento/kms-api-core/6.8.0/kms-api-core-6.8.0.pom
(2.1 kB at 140 kB/s)
[INFO] Downloading from openmeetings-bintray: https://dl.bintray.com/openmeetings/maven/org/kurento/kms-api-core/6.9.0/kms-api-core-6.9.0.pom
[INFO] Downloading from central: https://repo.maven.apache.org/maven2/org/kurento/kms-api-core/6.9.0/kms-api-core-6.9.0.pom
[INFO] Downloaded from central: https://repo.maven.apache.org/maven2/org/kurento/kms-api-core/6.9.0/kms-api-core-6.9.0.pom
(2.1 kB at 161 kB/s)
[INFO] Downloading from apache-snapshots: https://repository.apache.org/content/groups/snapshots/org/kurento/kms-api-elements/maven-metadata.xml
[INFO] Downloading from sonatype-snapshots: https://oss.sonatype.org/content/repositories/snapshots/org/kurento/kms-api-elements/maven-metadata.xml
[INFO] Downloading from openmeetings-bintray: https://dl.bintray.com/openmeetings/maven/org/kurento/kms-api-elements/maven-metadata.xml
[INFO] Downloading from Nexus: http://repository.apache.org/snapshots/org/kurento/kms-api-elements/maven-metadata.xml
[INFO] Downloading from central: https://repo.maven.apache.org/maven2/org/kurento/kms-api-elements/maven-metadata.xml
[INFO] Downloaded from central: https://repo.maven.apache.org/maven2/org/kurento/kms-api-elements/maven-metadata.xml
(771 B at 48 kB/s)
[INFO] Downloading from kurento-snapshots: https://maven.openvidu.io/repository/snapshots/org/kurento/kms-api-elements/maven-metadata.xml
[WARNING] Could not transfer metadata org.kurento:kms-api-elements/maven-metadata.xml from/to
kurento-snapshots (https://maven.openvidu.io/repository/snapshots/): Connect to maven.openvidu.io:443
[maven.openvidu.io/184.168.221.84] failed: Connection timed out (Connection timed out)
[INFO] Downloading from openmeetings-bintray: https://dl.bintray.com/openmeetings/maven/org/kurento/kms-api-elements/6.7.0/kms-api-elements-6.7.0.pom
[INFO] Downloading from central: https://repo.maven.apache.org/maven2/org/kurento/kms-api-elements/6.7.0/kms-api-elements-6.7.0.pom
[INFO] Downloaded from central: https://repo.maven.apache.org/maven2/org/kurento/kms-api-elements/6.7.0/kms-api-elements-6.7.0.pom
(2.3 kB at 126 kB/s)
[INFO] Downloading from openmeetings-bintray: https://dl.bintray.com/openmeetings/maven/org/kurento/kms-api-elements/6.7.1/kms-api-elements-6.7.1.pom
[INFO] Downloading from central: https://repo.maven.apache.org/maven2/org/kurento/kms-api-elements/6.7.1/kms-api-elements-6.7.1.pom
[INFO] Downloaded from central: https://repo.maven.apache.org/maven2/org/kurento/kms-api-elements/6.7.1/kms-api-elements-6.7.1.pom
(2.3 kB at 155 kB/s)
[INFO] Downloading from openmeetings-bintray: https://dl.bintray.com/openmeetings/maven/org/kurento/kms-api-elements/6.8.0/kms-api-elements-6.8.0.pom
[INFO] Downloading from central: https://repo.maven.apache.org/maven2/org/kurento/kms-api-elements/6.8.0/kms-api-elements-6.8.0.pom
[INFO] Downloaded from central: https://repo.maven.apache.org/maven2/org/kurento/kms-api-elements/6.8.0/kms-api-elements-6.8.0.pom
(2.3 kB at 166 kB/s)
[INFO] Downloading from openmeetings-bintray: https://dl.bintray.com/openmeetings/maven/org/kurento/kms-api-elements/6.9.0/kms-api-elements-6.9.0.pom
[INFO] Downloading from central: https://repo.maven.apache.org/maven2/org/kurento/kms-api-elements/6.9.0/kms-api-elements-6.9.0.pom
[INFO] Downloaded from central: https://repo.maven.apache.org/maven2/org/kurento/kms-api-elements/6.9.0/kms-api-elements-6.9.0.pom
(2.3 kB at 179 kB/s)
[WARNING] The POM for org.mockito:mockito-core:jar:2.27.5 is missing, no dependency information
available
[INFO] Downloading from openmeetings-bintray: https://dl.bintray.com/openmeetings/maven/org/apache/directory/api/api-all/2.0.0.AM3/api-all-2.0.0.AM3.jar
[INFO] Downloading from openmeetings-bintray: https://dl.bintray.com/openmeetings/maven/org/artofsolving/jodconverter/jodconverter-core/3.0.1-om/jodconverter-core-3.0.1-om.jar
[INFO] Downloading from openmeetings-bintray: https://dl.bintray.com/openmeetings/maven/org/openoffice/juh/4.1.2/juh-4.1.2.jar
[INFO] Downloading from openmeetings-bintray: https://dl.bintray.com/openmeetings/maven/org/openoffice/jurt/4.1.2/jurt-4.1.2.jar
[INFO] Downloading from openmeetings-bintray: https://dl.bintray.com/openmeetings/maven/org/openoffice/ridl/4.1.2/ridl-4.1.2.jar
[INFO] Downloading from openmeetings-bintray: https://dl.bintray.com/openmeetings/maven/org/openoffice/unoil/4.1.2/unoil-4.1.2.jar
[INFO] Downloading from openmeetings-bintray: https://dl.bintray.com/openmeetings/maven/org/springframework/spring-webmvc/5.1.7.RELEASE/spring-webmvc-5.1.7.RELEASE.jar
[INFO] Downloading from openmeetings-bintray: https://dl.bintray.com/openmeetings/maven/org/kurento/kurento-client/6.10.0/kurento-client-6.10.0.jar
[INFO] Downloading from openmeetings-bintray: https://dl.bintray.com/openmeetings/maven/org/kurento/kurento-jsonrpc-client/6.10.0/kurento-jsonrpc-client-6.10.0.jar
[INFO] Downloaded from openmeetings-bintray: https://dl.bintray.com/openmeetings/maven/org/artofsolving/jodconverter/jodconverter-core/3.0.1-om/jodconverter-core-3.0.1-om.jar
(73 kB at 690 kB/s)
[INFO] Downloading from openmeetings-bintray: https://dl.bintray.com/openmeetings/maven/org/kurento/kurento-commons/6.10.0/kurento-commons-6.10.0.jar
[INFO] Downloading from openmeetings-bintray: https://dl.bintray.com/openmeetings/maven/com/google/guava/guava/23.6.1-jre/guava-23.6.1-jre.jar
[INFO] Downloading from openmeetings-bintray: https://dl.bintray.com/openmeetings/maven/org/apache/httpcomponents/fluent-hc/4.5.1/fluent-hc-4.5.1.jar
[INFO] Downloading from openmeetings-bintray: https://dl.bintray.com/openmeetings/maven/io/netty/netty-handler-proxy/4.1.34.Final/netty-handler-proxy-4.1.34.Final.jar
[INFO] Downloading from openmeetings-bintray: https://dl.bintray.com/openmeetings/maven/io/netty/netty-codec-socks/4.1.34.Final/netty-codec-socks-4.1.34.Final.jar
[INFO] Downloading from openmeetings-bintray: https://dl.bintray.com/openmeetings/maven/org/kurento/kms-api-core/6.10.0/kms-api-core-6.10.0.jar
[INFO] Downloading from openmeetings-bintray: https://dl.bintray.com/openmeetings/maven/org/kurento/kms-api-elements/6.10.0/kms-api-elements-6.10.0.jar
[INFO] Downloading from openmeetings-bintray: https://dl.bintray.com/openmeetings/maven/org/kurento/kms-api-filters/6.10.0/kms-api-filters-6.10.0.jar
[INFO] Downloading from openmeetings-bintray: https://dl.bintray.com/openmeetings/maven/org/junit/vintage/junit-vintage-engine/5.4.2/junit-vintage-engine-5.4.2.jar
[INFO] Downloading from openmeetings-bintray: https://dl.bintray.com/openmeetings/maven/org/mockito/mockito-core/2.27.5/mockito-core-2.27.5.jar
[INFO] Downloading from openmeetings-bintray: https://dl.bintray.com/openmeetings/maven/org/powermock/powermock-module-junit4/2.0.2/powermock-module-junit4-2.0.2.jar
[INFO] Downloading from openmeetings-bintray: https://dl.bintray.com/openmeetings/maven/org/powermock/powermock-module-junit4-common/2.0.2/powermock-module-junit4-common-2.0.2.jar
[INFO] Downloading from openmeetings-bintray: https://dl.bintray.com/openmeetings/maven/org/powermock/powermock-reflect/2.0.2/powermock-reflect-2.0.2.jar
[INFO] Downloading from openmeetings-bintray: https://dl.bintray.com/openmeetings/maven/org/powermock/powermock-core/2.0.2/powermock-core-2.0.2.jar
[INFO] Downloading from openmeetings-bintray: https://dl.bintray.com/openmeetings/maven/org/javassist/javassist/3.24.0-GA/javassist-3.24.0-GA.jar
[INFO] Downloading from openmeetings-bintray: https://dl.bintray.com/openmeetings/maven/org/powermock/powermock-api-mockito2/2.0.2/powermock-api-mockito2-2.0.2.jar
[INFO] Downloading from openmeetings-bintray: https://dl.bintray.com/openmeetings/maven/org/powermock/powermock-api-support/2.0.2/powermock-api-support-2.0.2.jar
[INFO] Downloading from central: https://repo.maven.apache.org/maven2/org/apache/directory/api/api-all/2.0.0.AM3/api-all-2.0.0.AM3.jar
[INFO] Downloading from central: https://repo.maven.apache.org/maven2/org/openoffice/juh/4.1.2/juh-4.1.2.jar
[INFO] Downloading from central: https://repo.maven.apache.org/maven2/org/openoffice/jurt/4.1.2/jurt-4.1.2.jar
[INFO] Downloading from central: https://repo.maven.apache.org/maven2/org/openoffice/ridl/4.1.2/ridl-4.1.2.jar
[INFO] Downloading from central: https://repo.maven.apache.org/maven2/org/openoffice/unoil/4.1.2/unoil-4.1.2.jar
[INFO] Downloaded from central: https://repo.maven.apache.org/maven2/org/openoffice/juh/4.1.2/juh-4.1.2.jar
(64 kB at 3.2 MB/s)
[INFO] Downloading from central: https://repo.maven.apache.org/maven2/org/springframework/spring-webmvc/5.1.7.RELEASE/spring-webmvc-5.1.7.RELEASE.jar
[INFO] Downloaded from central: https://repo.maven.apache.org/maven2/org/openoffice/jurt/4.1.2/jurt-4.1.2.jar
(119 kB at 5.9 MB/s)
[INFO] Downloading from central: https://repo.maven.apache.org/maven2/org/kurento/kurento-client/6.10.0/kurento-client-6.10.0.jar
[INFO] Downloaded from central: https://repo.maven.apache.org/maven2/org/openoffice/ridl/4.1.2/ridl-4.1.2.jar
(271 kB at 8.0 MB/s)
[INFO] Downloading from central: https://repo.maven.apache.org/maven2/org/kurento/kurento-jsonrpc-client/6.10.0/kurento-jsonrpc-client-6.10.0.jar
[INFO] Downloaded from central: https://repo.maven.apache.org/maven2/org/kurento/kurento-client/6.10.0/kurento-client-6.10.0.jar
(226 kB at 4.6 MB/s)
[INFO] Downloading from central: https://repo.maven.apache.org/maven2/org/kurento/kurento-commons/6.10.0/kurento-commons-6.10.0.jar
[INFO] Downloaded from central: https://repo.maven.apache.org/maven2/org/springframework/spring-webmvc/5.1.7.RELEASE/spring-webmvc-5.1.7.RELEASE.jar
(801 kB at 15 MB/s)
[INFO] Downloading from central: https://repo.maven.apache.org/maven2/com/google/guava/guava/23.6.1-jre/guava-23.6.1-jre.jar
[INFO] Downloaded from central: https://repo.maven.apache.org/maven2/org/kurento/kurento-jsonrpc-client/6.10.0/kurento-jsonrpc-client-6.10.0.jar
(112 kB at 2.1 MB/s)
[INFO] Downloading from central: https://repo.maven.apache.org/maven2/org/apache/httpcomponents/fluent-hc/4.5.1/fluent-hc-4.5.1.jar
[INFO] Downloaded from central: https://repo.maven.apache.org/maven2/org/kurento/kurento-commons/6.10.0/kurento-commons-6.10.0.jar
(31 kB at 443 kB/s)
[INFO] Downloading from central: https://repo.maven.apache.org/maven2/io/netty/netty-handler-proxy/4.1.34.Final/netty-handler-proxy-4.1.34.Final.jar
[INFO] Downloaded from central: https://repo.maven.apache.org/maven2/org/apache/httpcomponents/fluent-hc/4.5.1/fluent-hc-4.5.1.jar
(31 kB at 423 kB/s)
[INFO] Downloading from central: https://repo.maven.apache.org/maven2/io/netty/netty-codec-socks/4.1.34.Final/netty-codec-socks-4.1.34.Final.jar
[INFO] Downloaded from central: https://repo.maven.apache.org/maven2/io/netty/netty-handler-proxy/4.1.34.Final/netty-handler-proxy-4.1.34.Final.jar
(22 kB at 263 kB/s)
[INFO] Downloading from central: https://repo.maven.apache.org/maven2/org/kurento/kms-api-core/6.10.0/kms-api-core-6.10.0.jar
[INFO] Downloaded from central: https://repo.maven.apache.org/maven2/org/openoffice/unoil/4.1.2/unoil-4.1.2.jar
(1.5 MB at 17 MB/s)
[INFO] Downloading from central: https://repo.maven.apache.org/maven2/org/kurento/kms-api-elements/6.10.0/kms-api-elements-6.10.0.jar
[INFO] Downloaded from central: https://repo.maven.apache.org/maven2/io/netty/netty-codec-socks/4.1.34.Final/netty-codec-socks-4.1.34.Final.jar
(119 kB at 1.3 MB/s)
[INFO] Downloading from central: https://repo.maven.apache.org/maven2/org/kurento/kms-api-filters/6.10.0/kms-api-filters-6.10.0.jar
[INFO] Downloaded from central: https://repo.maven.apache.org/maven2/org/kurento/kms-api-core/6.10.0/kms-api-core-6.10.0.jar
(16 kB at 156 kB/s)
[INFO] Downloading from central: https://repo.maven.apache.org/maven2/org/junit/vintage/junit-vintage-engine/5.4.2/junit-vintage-engine-5.4.2.jar
[INFO] Downloaded from central: https://repo.maven.apache.org/maven2/org/kurento/kms-api-elements/6.10.0/kms-api-elements-6.10.0.jar
(16 kB at 152 kB/s)
[INFO] Downloading from central: https://repo.maven.apache.org/maven2/org/mockito/mockito-core/2.27.5/mockito-core-2.27.5.jar
[INFO] Downloaded from central: https://repo.maven.apache.org/maven2/org/kurento/kms-api-filters/6.10.0/kms-api-filters-6.10.0.jar
(4.4 kB at 41 kB/s)
[INFO] Downloading from central: https://repo.maven.apache.org/maven2/org/powermock/powermock-module-junit4/2.0.2/powermock-module-junit4-2.0.2.jar
[INFO] Downloading from central: https://repo.maven.apache.org/maven2/org/powermock/powermock-module-junit4-common/2.0.2/powermock-module-junit4-common-2.0.2.jar
[INFO] Downloaded from central: https://repo.maven.apache.org/maven2/org/junit/vintage/junit-vintage-engine/5.4.2/junit-vintage-engine-5.4.2.jar
(66 kB at 561 kB/s)
[INFO] Downloading from central: https://repo.maven.apache.org/maven2/org/powermock/powermock-reflect/2.0.2/powermock-reflect-2.0.2.jar
[INFO] Downloaded from central: https://repo.maven.apache.org/maven2/org/powermock/powermock-module-junit4/2.0.2/powermock-module-junit4-2.0.2.jar
(48 kB at 390 kB/s)
[INFO] Downloading from central: https://repo.maven.apache.org/maven2/org/powermock/powermock-core/2.0.2/powermock-core-2.0.2.jar
[INFO] Downloaded from central: https://repo.maven.apache.org/maven2/org/powermock/powermock-reflect/2.0.2/powermock-reflect-2.0.2.jar
(66 kB at 442 kB/s)
[INFO] Downloaded from central: https://repo.maven.apache.org/maven2/org/powermock/powermock-core/2.0.2/powermock-core-2.0.2.jar
(201 kB at 1.3 MB/s)
[INFO] Downloading from central: https://repo.maven.apache.org/maven2/org/javassist/javassist/3.24.0-GA/javassist-3.24.0-GA.jar
[INFO] Downloading from central: https://repo.maven.apache.org/maven2/org/powermock/powermock-api-mockito2/2.0.2/powermock-api-mockito2-2.0.2.jar
[INFO] Downloaded from central: https://repo.maven.apache.org/maven2/org/powermock/powermock-api-mockito2/2.0.2/powermock-api-mockito2-2.0.2.jar
(88 kB at 522 kB/s)
[INFO] Downloading from central: https://repo.maven.apache.org/maven2/org/powermock/powermock-api-support/2.0.2/powermock-api-support-2.0.2.jar
[INFO] Downloaded from central: https://repo.maven.apache.org/maven2/org/javassist/javassist/3.24.0-GA/javassist-3.24.0-GA.jar
(778 kB at 4.3 MB/s)
[INFO] Downloaded from central: https://repo.maven.apache.org/maven2/com/google/guava/guava/23.6.1-jre/guava-23.6.1-jre.jar
(2.7 MB at 15 MB/s)
[INFO] Downloaded from central: https://repo.maven.apache.org/maven2/org/powermock/powermock-api-support/2.0.2/powermock-api-support-2.0.2.jar
(22 kB at 117 kB/s)
[INFO] Downloaded from central: https://repo.maven.apache.org/maven2/org/powermock/powermock-module-junit4-common/2.0.2/powermock-module-junit4-common-2.0.2.jar
(18 kB at 94 kB/s)
[INFO] Downloaded from central: https://repo.maven.apache.org/maven2/org/apache/directory/api/api-all/2.0.0.AM3/api-all-2.0.0.AM3.jar
(3.2 MB at 8.7 MB/s)
[INFO] 
[INFO] ------------------------------------------------------------------------
[INFO] Skipping Openmeetings
[INFO] This project has been banned from the build due to previous failures.
[INFO] ------------------------------------------------------------------------
[INFO] ------------------------------------------------------------------------
[INFO] Reactor Summary for Openmeetings 5.0.0-M2-SNAPSHOT:
[INFO] 
[INFO] Openmeetings ....................................... SUCCESS [06:10 min]
[INFO] Openmeetings Util .................................. SUCCESS [04:07 min]
[INFO] Openmeetings DB .................................... SUCCESS [ 51.111 s]
[INFO] Openmeetings Core .................................. FAILURE [04:17 min]
[INFO] Openmeetings Install ............................... SKIPPED
[INFO] Openmeetings Service ............................... SKIPPED
[INFO] Openmeetings Webservices ........................... SKIPPED
[INFO] Openmeetings Web ................................... SKIPPED
[INFO] Openmeetings Screen Sharing applet ................. SKIPPED
[INFO] Openmeetings Server ................................ SKIPPED
[INFO] ------------------------------------------------------------------------
[INFO] BUILD FAILURE
[INFO] ------------------------------------------------------------------------
[INFO] Total time:  15:56 min
[INFO] Finished at: 2019-05-28T04:05:29Z
[INFO] ------------------------------------------------------------------------
Waiting for Jenkins to finish collecting data
[ERROR] Failed to execute goal on project openmeetings-core: Could not resolve dependencies
for project org.apache.openmeetings:openmeetings-core:jar:5.0.0-M2-SNAPSHOT: Could not find
artifact org.mockito:mockito-core:jar:2.27.5 in openmeetings-bintray (https://dl.bintray.com/openmeetings/maven)
-> [Help 1]
[ERROR] 
[ERROR] To see the full stack trace of the errors, re-run Maven with the -e switch.
[ERROR] Re-run Maven using the -X switch to enable full debug logging.
[ERROR] 
[ERROR] For more information about the errors and possible solutions, please read the following
articles:
[ERROR] [Help 1] http://cwiki.apache.org/confluence/display/MAVEN/DependencyResolutionException
[ERROR] 
[ERROR] After correcting the problems, you can resume the build with the command
[ERROR]   mvn <goals> -rf :openmeetings-core
[JENKINS] Archiving <https://builds.apache.org/job/openmeetings/ws/openmeetings-server/pom.xml>
to org.apache.openmeetings/openmeetings-server/5.0.0-M2-SNAPSHOT/openmeetings-server-5.0.0-M2-SNAPSHOT.pom
[JENKINS] Archiving <https://builds.apache.org/job/openmeetings/ws/openmeetings-screenshare/pom.xml>
to org.apache.openmeetings/openmeetings-screenshare/5.0.0-M2-SNAPSHOT/openmeetings-screenshare-5.0.0-M2-SNAPSHOT.pom
[JENKINS] Archiving <https://builds.apache.org/job/openmeetings/ws/openmeetings-util/pom.xml>
to org.apache.openmeetings/openmeetings-util/5.0.0-M2-SNAPSHOT/openmeetings-util-5.0.0-M2-SNAPSHOT.pom
[JENKINS] Archiving <https://builds.apache.org/job/openmeetings/ws/openmeetings-util/target/openmeetings-util-5.0.0-M2-SNAPSHOT.jar>
to org.apache.openmeetings/openmeetings-util/5.0.0-M2-SNAPSHOT/openmeetings-util-5.0.0-M2-SNAPSHOT.jar
[JENKINS] Archiving <https://builds.apache.org/job/openmeetings/ws/openmeetings-util/target/openmeetings-util-5.0.0-M2-SNAPSHOT-tests.jar>
to org.apache.openmeetings/openmeetings-util/5.0.0-M2-SNAPSHOT/openmeetings-util-5.0.0-M2-SNAPSHOT-tests.jar
[JENKINS] Archiving <https://builds.apache.org/job/openmeetings/ws/openmeetings-install/pom.xml>
to org.apache.openmeetings/openmeetings-install/5.0.0-M2-SNAPSHOT/openmeetings-install-5.0.0-M2-SNAPSHOT.pom
[JENKINS] Archiving <https://builds.apache.org/job/openmeetings/ws/openmeetings-service/pom.xml>
to org.apache.openmeetings/openmeetings-service/5.0.0-M2-SNAPSHOT/openmeetings-service-5.0.0-M2-SNAPSHOT.pom
[JENKINS] Archiving <https://builds.apache.org/job/openmeetings/ws/pom.xml> to org.apache.openmeetings/openmeetings-parent/5.0.0-M2-SNAPSHOT/openmeetings-parent-5.0.0-M2-SNAPSHOT.pom
[JENKINS] Archiving <https://builds.apache.org/job/openmeetings/ws/target/openmeetings-parent-5.0.0-M2-SNAPSHOT-site.xml>
to org.apache.openmeetings/openmeetings-parent/5.0.0-M2-SNAPSHOT/openmeetings-parent-5.0.0-M2-SNAPSHOT-site.xml
[JENKINS] Archiving <https://builds.apache.org/job/openmeetings/ws/openmeetings-db/pom.xml>
to org.apache.openmeetings/openmeetings-db/5.0.0-M2-SNAPSHOT/openmeetings-db-5.0.0-M2-SNAPSHOT.pom
[JENKINS] Archiving <https://builds.apache.org/job/openmeetings/ws/openmeetings-db/target/openmeetings-db-5.0.0-M2-SNAPSHOT.jar>
to org.apache.openmeetings/openmeetings-db/5.0.0-M2-SNAPSHOT/openmeetings-db-5.0.0-M2-SNAPSHOT.jar
[JENKINS] Archiving <https://builds.apache.org/job/openmeetings/ws/openmeetings-web/pom.xml>
to org.apache.openmeetings/openmeetings-web/5.0.0-M2-SNAPSHOT/openmeetings-web-5.0.0-M2-SNAPSHOT.pom
[JENKINS] Archiving <https://builds.apache.org/job/openmeetings/ws/openmeetings-webservice/pom.xml>
to org.apache.openmeetings/openmeetings-webservice/5.0.0-M2-SNAPSHOT/openmeetings-webservice-5.0.0-M2-SNAPSHOT.pom
[JENKINS] Archiving <https://builds.apache.org/job/openmeetings/ws/openmeetings-core/pom.xml>
to org.apache.openmeetings/openmeetings-core/5.0.0-M2-SNAPSHOT/openmeetings-core-5.0.0-M2-SNAPSHOT.pom
Sending e-mails to: dev@openmeetings.apache.org
channel stopped
Archiving artifacts
Not sending mail to unregistered user solomax666@gmail.com

Mime
View raw message