openmeetings-dev mailing list archives

Site index · List index
Message view « Date » · « Thread »
Top « Date » · « Thread »
From Apache Jenkins Server <jenk...@builds.apache.org>
Subject Build failed in Jenkins: Red5-server-common #390
Date Mon, 22 Apr 2019 15:18:19 GMT
See <https://builds.apache.org/job/Red5-server-common/390/display/redirect?page=changes>

Changes:

[mondain] Pulling updates

[mondain] Updates for 1.1.0

------------------------------------------
Started by an SCM change
[EnvInject] - Loading node environment variables.
Building remotely on H27 (ubuntu xenial) in workspace <https://builds.apache.org/job/Red5-server-common/ws/>
No credentials specified
Cloning the remote Git repository
Cloning repository https://github.com/Red5/red5-server-common.git
 > git init <https://builds.apache.org/job/Red5-server-common/ws/> # timeout=10
Fetching upstream changes from https://github.com/Red5/red5-server-common.git
 > git --version # timeout=10
 > git fetch --tags --progress https://github.com/Red5/red5-server-common.git +refs/heads/*:refs/remotes/origin/*
 > git config remote.origin.url https://github.com/Red5/red5-server-common.git # timeout=10
 > git config --add remote.origin.fetch +refs/heads/*:refs/remotes/origin/* # timeout=10
 > git config remote.origin.url https://github.com/Red5/red5-server-common.git # timeout=10
Fetching upstream changes from https://github.com/Red5/red5-server-common.git
 > git fetch --tags --progress https://github.com/Red5/red5-server-common.git +refs/heads/*:refs/remotes/origin/*
 > git rev-parse refs/remotes/origin/master^{commit} # timeout=10
 > git rev-parse refs/remotes/origin/origin/master^{commit} # timeout=10
Checking out Revision 39ae73710c25bda86d70b13ef37ae707962217b9 (refs/remotes/origin/master)
 > git config core.sparsecheckout # timeout=10
 > git checkout -f 39ae73710c25bda86d70b13ef37ae707962217b9
Commit message: "Updates for 1.1.0"
 > git rev-list --no-walk 09436cab66526a409f658e167f722141b54e2df5 # timeout=10
[Red5-server-common] $ /home/jenkins/tools/maven/latest3/bin/mvn -Dmaven.test.skip=true
[INFO] Scanning for projects...
[ERROR] [ERROR] Some problems were encountered while processing the POMs:
[FATAL] Non-resolvable parent POM for org.red5:red5-server-common:[unknown-version]: Failure
to find org.red5:red5-parent:pom:1.1.0 in http://oss.sonatype.org/content/repositories/snapshots
was cached in the local repository, resolution will not be reattempted until the update interval
of sonatype-snapshots has elapsed or updates are forced and 'parent.relativePath' points at
wrong local POM @ line 3, column 13
 @ 
[ERROR] The build could not read 1 project -> [Help 1]
[ERROR]   
[ERROR]   The project org.red5:red5-server-common:[unknown-version] (<https://builds.apache.org/job/Red5-server-common/ws/pom.xml)>
has 1 error
[ERROR]     Non-resolvable parent POM for org.red5:red5-server-common:[unknown-version]: Failure
to find org.red5:red5-parent:pom:1.1.0 in http://oss.sonatype.org/content/repositories/snapshots
was cached in the local repository, resolution will not be reattempted until the update interval
of sonatype-snapshots has elapsed or updates are forced and 'parent.relativePath' points at
wrong local POM @ line 3, column 13 -> [Help 2]
[ERROR] 
[ERROR] To see the full stack trace of the errors, re-run Maven with the -e switch.
[ERROR] Re-run Maven using the -X switch to enable full debug logging.
[ERROR] 
[ERROR] For more information about the errors and possible solutions, please read the following
articles:
[ERROR] [Help 1] http://cwiki.apache.org/confluence/display/MAVEN/ProjectBuildingException
[ERROR] [Help 2] http://cwiki.apache.org/confluence/display/MAVEN/UnresolvableModelException
Build step 'Invoke top-level Maven targets' marked build as failure
Archiving artifacts
Not sending mail to unregistered user mondain@gmail.com

Mime
View raw message