openmeetings-dev mailing list archives

Site index · List index
Message view « Date » · « Thread »
Top « Date » · « Thread »
From Apache Jenkins Server <jenk...@builds.apache.org>
Subject Build failed in Jenkins: Red5-client #582
Date Mon, 22 Apr 2019 14:54:22 GMT
See <https://builds.apache.org/job/Red5-client/582/display/redirect?page=changes>

Changes:

[mondain] Pulling updates

[mondain] Updates for 1.1.0

------------------------------------------
Started by an SCM change
[EnvInject] - Loading node environment variables.
Building remotely on H41 (ubuntu xenial) in workspace <https://builds.apache.org/job/Red5-client/ws/>
No credentials specified
Cloning the remote Git repository
Cloning repository https://github.com/Red5/red5-client.git
 > git init <https://builds.apache.org/job/Red5-client/ws/> # timeout=10
Fetching upstream changes from https://github.com/Red5/red5-client.git
 > git --version # timeout=10
 > git fetch --tags --progress https://github.com/Red5/red5-client.git +refs/heads/*:refs/remotes/origin/*
 > git config remote.origin.url https://github.com/Red5/red5-client.git # timeout=10
 > git config --add remote.origin.fetch +refs/heads/*:refs/remotes/origin/* # timeout=10
 > git config remote.origin.url https://github.com/Red5/red5-client.git # timeout=10
Fetching upstream changes from https://github.com/Red5/red5-client.git
 > git fetch --tags --progress https://github.com/Red5/red5-client.git +refs/heads/*:refs/remotes/origin/*
 > git rev-parse refs/remotes/origin/master^{commit} # timeout=10
 > git rev-parse refs/remotes/origin/origin/master^{commit} # timeout=10
Checking out Revision f894495b60e59d7cfba647abd9b934237cac9d45 (refs/remotes/origin/master)
 > git config core.sparsecheckout # timeout=10
 > git checkout -f f894495b60e59d7cfba647abd9b934237cac9d45
Commit message: "Updates for 1.1.0"
 > git rev-list --no-walk 45b3a55db162c72676985d883a30c144114d1340 # timeout=10
[Red5-client] $ /home/jenkins/tools/maven/latest3/bin/mvn -Dmaven.test.skip=true
[INFO] Scanning for projects...
Downloading from sonatype-snapshots: http://oss.sonatype.org/content/repositories/snapshots/org/red5/red5-parent/1.1.0/red5-parent-1.1.0.pom
Downloading from sonatype-releases: http://oss.sonatype.org/content/repositories/releases/org/red5/red5-parent/1.1.0/red5-parent-1.1.0.pom
Downloading from central: https://repo.maven.apache.org/maven2/org/red5/red5-parent/1.1.0/red5-parent-1.1.0.pom
[ERROR] [ERROR] Some problems were encountered while processing the POMs:
[FATAL] Non-resolvable parent POM for org.red5:red5-client:[unknown-version]: Could not find
artifact org.red5:red5-parent:pom:1.1.0 in sonatype-snapshots (http://oss.sonatype.org/content/repositories/snapshots)
and 'parent.relativePath' points at wrong local POM @ line 3, column 13
 @ 
[ERROR] The build could not read 1 project -> [Help 1]
[ERROR]   
[ERROR]   The project org.red5:red5-client:[unknown-version] (<https://builds.apache.org/job/Red5-client/ws/pom.xml)>
has 1 error
[ERROR]     Non-resolvable parent POM for org.red5:red5-client:[unknown-version]: Could not
find artifact org.red5:red5-parent:pom:1.1.0 in sonatype-snapshots (http://oss.sonatype.org/content/repositories/snapshots)
and 'parent.relativePath' points at wrong local POM @ line 3, column 13 -> [Help 2]
[ERROR] 
[ERROR] To see the full stack trace of the errors, re-run Maven with the -e switch.
[ERROR] Re-run Maven using the -X switch to enable full debug logging.
[ERROR] 
[ERROR] For more information about the errors and possible solutions, please read the following
articles:
[ERROR] [Help 1] http://cwiki.apache.org/confluence/display/MAVEN/ProjectBuildingException
[ERROR] [Help 2] http://cwiki.apache.org/confluence/display/MAVEN/UnresolvableModelException
Build step 'Invoke top-level Maven targets' marked build as failure
Archiving artifacts
Not sending mail to unregistered user mondain@gmail.com

Mime
View raw message