openmeetings-dev mailing list archives

Site index · List index
Message view « Date » · « Thread »
Top « Date » · « Thread »
From Apache Jenkins Server <jenk...@builds.apache.org>
Subject Build failed in Jenkins: Red5-server #2283
Date Mon, 22 Apr 2019 14:55:26 GMT
See <https://builds.apache.org/job/Red5-server/2283/display/redirect?page=changes>

Changes:

[mondain] Pulling updates

[mondain] Updates for 1.1.0

------------------------------------------
Started by an SCM change
[EnvInject] - Loading node environment variables.
Building remotely on H27 (ubuntu xenial) in workspace <https://builds.apache.org/job/Red5-server/ws/>
No credentials specified
 > git rev-parse --is-inside-work-tree # timeout=10
Fetching changes from the remote Git repository
 > git config remote.origin.url https://github.com/Red5/red5-server.git # timeout=10
Fetching upstream changes from https://github.com/Red5/red5-server.git
 > git --version # timeout=10
 > git fetch --tags --progress https://github.com/Red5/red5-server.git +refs/heads/*:refs/remotes/origin/*
 > git rev-parse refs/remotes/origin/master^{commit} # timeout=10
 > git rev-parse refs/remotes/origin/origin/master^{commit} # timeout=10
Checking out Revision 658fefb0f6b90c7c935f5ef14bd99d8b9e3ea91b (refs/remotes/origin/master)
 > git config core.sparsecheckout # timeout=10
 > git checkout -f 658fefb0f6b90c7c935f5ef14bd99d8b9e3ea91b
Commit message: "Updates for 1.1.0"
 > git rev-list --no-walk d0c5abcb2ceb312db0415d3dba5eafd55e7f5f5e # timeout=10
[Red5-server] $ /home/jenkins/tools/maven/apache-maven-3.3.3/bin/mvn -Dmaven.test.skip=true
clean install
[INFO] Scanning for projects...
Downloading: http://oss.sonatype.org/content/repositories/snapshots/org/red5/red5-parent/1.1.0/red5-parent-1.1.0.pom
Downloading: http://oss.sonatype.org/content/repositories/releases/org/red5/red5-parent/1.1.0/red5-parent-1.1.0.pom
Downloading: https://repo.maven.apache.org/maven2/org/red5/red5-parent/1.1.0/red5-parent-1.1.0.pom
[ERROR] [ERROR] Some problems were encountered while processing the POMs:
[FATAL] Non-resolvable parent POM for org.red5:red5-server:[unknown-version]: Could not find
artifact org.red5:red5-parent:pom:1.1.0 in sonatype-snapshots (http://oss.sonatype.org/content/repositories/snapshots)
and 'parent.relativePath' points at wrong local POM @ line 3, column 13
 @ 
[ERROR] The build could not read 1 project -> [Help 1]
[ERROR]   
[ERROR]   The project org.red5:red5-server:[unknown-version] (<https://builds.apache.org/job/Red5-server/ws/pom.xml)>
has 1 error
[ERROR]     Non-resolvable parent POM for org.red5:red5-server:[unknown-version]: Could not
find artifact org.red5:red5-parent:pom:1.1.0 in sonatype-snapshots (http://oss.sonatype.org/content/repositories/snapshots)
and 'parent.relativePath' points at wrong local POM @ line 3, column 13 -> [Help 2]
[ERROR] 
[ERROR] To see the full stack trace of the errors, re-run Maven with the -e switch.
[ERROR] Re-run Maven using the -X switch to enable full debug logging.
[ERROR] 
[ERROR] For more information about the errors and possible solutions, please read the following
articles:
[ERROR] [Help 1] http://cwiki.apache.org/confluence/display/MAVEN/ProjectBuildingException
[ERROR] [Help 2] http://cwiki.apache.org/confluence/display/MAVEN/UnresolvableModelException
Build step 'Invoke top-level Maven targets' marked build as failure
Archiving artifacts
Not sending mail to unregistered user mondain@gmail.com

Mime
View raw message