openmeetings-dev mailing list archives

Site index · List index
Message view « Date » · « Thread »
Top « Date » · « Thread »
From Apache Jenkins Server <jenk...@builds.apache.org>
Subject Build failed in Jenkins: openmeetings #2821
Date Tue, 23 Apr 2019 17:37:31 GMT
See <https://builds.apache.org/job/openmeetings/2821/display/redirect?page=changes>

Changes:

[solomax666] [OPENMEETINGS-2051] red5 version is updated

------------------------------------------
[...truncated 2.98 MB...]
[INFO] Openmeetings Webservices ........................... SUCCESS [02:17 min]
[INFO] Openmeetings Web ................................... SUCCESS [38:04 min]
[INFO] Openmeetings Screen Sharing applet ................. FAILURE [ 19.602 s]
[INFO] Openmeetings Server ................................ SKIPPED
[INFO] ------------------------------------------------------------------------
[INFO] BUILD FAILURE
[INFO] ------------------------------------------------------------------------
[INFO] Total time:  51:13 min
[INFO] Finished at: 2019-04-23T17:37:12Z
[INFO] ------------------------------------------------------------------------
Waiting for Jenkins to finish collecting data
[ERROR] Failed to execute goal org.apache.maven.plugins:maven-compiler-plugin:3.8.0:compile
(default-compile) on project openmeetings-screenshare: Compilation failure: Compilation failure:
[ERROR] <https://builds.apache.org/job/openmeetings/ws/openmeetings-screenshare/src/main/java/org/apache/openmeetings/screenshare/util/Util.java>:[21,30]
package org.quartz.impl does not exist
[ERROR] <https://builds.apache.org/job/openmeetings/ws/openmeetings-screenshare/src/main/java/org/apache/openmeetings/screenshare/util/Util.java>:[21,1]
static import only from classes and interfaces
[ERROR] <https://builds.apache.org/job/openmeetings/ws/openmeetings-screenshare/src/main/java/org/apache/openmeetings/screenshare/Core.java>:[24,25]
package org.quartz does not exist
[ERROR] <https://builds.apache.org/job/openmeetings/ws/openmeetings-screenshare/src/main/java/org/apache/openmeetings/screenshare/Core.java>:[24,1]
static import only from classes and interfaces
[ERROR] <https://builds.apache.org/job/openmeetings/ws/openmeetings-screenshare/src/main/java/org/apache/openmeetings/screenshare/Core.java>:[38,18]
package org.quartz does not exist
[ERROR] <https://builds.apache.org/job/openmeetings/ws/openmeetings-screenshare/src/main/java/org/apache/openmeetings/screenshare/Core.java>:[39,18]
package org.quartz does not exist
[ERROR] <https://builds.apache.org/job/openmeetings/ws/openmeetings-screenshare/src/main/java/org/apache/openmeetings/screenshare/Core.java>:[40,18]
package org.quartz does not exist
[ERROR] <https://builds.apache.org/job/openmeetings/ws/openmeetings-screenshare/src/main/java/org/apache/openmeetings/screenshare/Core.java>:[41,18]
package org.quartz does not exist
[ERROR] <https://builds.apache.org/job/openmeetings/ws/openmeetings-screenshare/src/main/java/org/apache/openmeetings/screenshare/Core.java>:[42,18]
package org.quartz does not exist
[ERROR] <https://builds.apache.org/job/openmeetings/ws/openmeetings-screenshare/src/main/java/org/apache/openmeetings/screenshare/Core.java>:[43,18]
package org.quartz does not exist
[ERROR] <https://builds.apache.org/job/openmeetings/ws/openmeetings-screenshare/src/main/java/org/apache/openmeetings/screenshare/Core.java>:[44,18]
package org.quartz does not exist
[ERROR] <https://builds.apache.org/job/openmeetings/ws/openmeetings-screenshare/src/main/java/org/apache/openmeetings/screenshare/Core.java>:[45,23]
package org.quartz.impl does not exist
[ERROR] <https://builds.apache.org/job/openmeetings/ws/openmeetings-screenshare/src/main/java/org/apache/openmeetings/screenshare/CaptureScreen.java>:[23,25]
package org.quartz does not exist
[ERROR] <https://builds.apache.org/job/openmeetings/ws/openmeetings-screenshare/src/main/java/org/apache/openmeetings/screenshare/CaptureScreen.java>:[23,1]
static import only from classes and interfaces
[ERROR] <https://builds.apache.org/job/openmeetings/ws/openmeetings-screenshare/src/main/java/org/apache/openmeetings/screenshare/CaptureScreen.java>:[35,18]
package org.quartz does not exist
[ERROR] <https://builds.apache.org/job/openmeetings/ws/openmeetings-screenshare/src/main/java/org/apache/openmeetings/screenshare/CaptureScreen.java>:[36,18]
package org.quartz does not exist
[ERROR] <https://builds.apache.org/job/openmeetings/ws/openmeetings-screenshare/src/main/java/org/apache/openmeetings/screenshare/CaptureScreen.java>:[37,18]
package org.quartz does not exist
[ERROR] <https://builds.apache.org/job/openmeetings/ws/openmeetings-screenshare/src/main/java/org/apache/openmeetings/screenshare/CaptureScreen.java>:[38,18]
package org.quartz does not exist
[ERROR] <https://builds.apache.org/job/openmeetings/ws/openmeetings-screenshare/src/main/java/org/apache/openmeetings/screenshare/CaptureScreen.java>:[39,18]
package org.quartz does not exist
[ERROR] <https://builds.apache.org/job/openmeetings/ws/openmeetings-screenshare/src/main/java/org/apache/openmeetings/screenshare/CaptureScreen.java>:[40,18]
package org.quartz does not exist
[ERROR] <https://builds.apache.org/job/openmeetings/ws/openmeetings-screenshare/src/main/java/org/apache/openmeetings/screenshare/CaptureScreen.java>:[41,18]
package org.quartz does not exist
[ERROR] <https://builds.apache.org/job/openmeetings/ws/openmeetings-screenshare/src/main/java/org/apache/openmeetings/screenshare/CaptureScreen.java>:[42,18]
package org.quartz does not exist
[ERROR] <https://builds.apache.org/job/openmeetings/ws/openmeetings-screenshare/src/main/java/org/apache/openmeetings/screenshare/CaptureScreen.java>:[43,23]
package org.quartz.impl does not exist
[ERROR] <https://builds.apache.org/job/openmeetings/ws/openmeetings-screenshare/src/main/java/org/apache/openmeetings/screenshare/Core.java>:[101,17]
cannot find symbol
[ERROR] symbol:   class SchedulerFactory
[ERROR] location: class org.apache.openmeetings.screenshare.Core
[ERROR] <https://builds.apache.org/job/openmeetings/ws/openmeetings-screenshare/src/main/java/org/apache/openmeetings/screenshare/Core.java>:[102,17]
cannot find symbol
[ERROR] symbol:   class Scheduler
[ERROR] location: class org.apache.openmeetings.screenshare.Core
[ERROR] <https://builds.apache.org/job/openmeetings/ws/openmeetings-screenshare/src/main/java/org/apache/openmeetings/screenshare/CaptureScreen.java>:[67,17]
cannot find symbol
[ERROR] symbol:   class Scheduler
[ERROR] location: class org.apache.openmeetings.screenshare.CaptureScreen
[ERROR] <https://builds.apache.org/job/openmeetings/ws/openmeetings-screenshare/src/main/java/org/apache/openmeetings/screenshare/CaptureScreen.java>:[68,23]
cannot find symbol
[ERROR] symbol:   class JobDetail
[ERROR] location: class org.apache.openmeetings.screenshare.CaptureScreen
[ERROR] <https://builds.apache.org/job/openmeetings/ws/openmeetings-screenshare/src/main/java/org/apache/openmeetings/screenshare/CaptureScreen.java>:[69,23]
cannot find symbol
[ERROR] symbol:   class Trigger
[ERROR] location: class org.apache.openmeetings.screenshare.CaptureScreen
[ERROR] <https://builds.apache.org/job/openmeetings/ws/openmeetings-screenshare/src/main/java/org/apache/openmeetings/screenshare/CaptureScreen.java>:[85,17]
cannot find symbol
[ERROR] symbol:   class Scheduler
[ERROR] location: class org.apache.openmeetings.screenshare.CaptureScreen
[ERROR] <https://builds.apache.org/job/openmeetings/ws/openmeetings-screenshare/src/main/java/org/apache/openmeetings/screenshare/CaptureScreen.java>:[210,43]
cannot find symbol
[ERROR] symbol:   class SchedulerException
[ERROR] location: class org.apache.openmeetings.screenshare.CaptureScreen
[ERROR] <https://builds.apache.org/job/openmeetings/ws/openmeetings-screenshare/src/main/java/org/apache/openmeetings/screenshare/job/CursorJob.java>:[22,18]
package org.quartz does not exist
[ERROR] <https://builds.apache.org/job/openmeetings/ws/openmeetings-screenshare/src/main/java/org/apache/openmeetings/screenshare/job/CursorJob.java>:[23,18]
package org.quartz does not exist
[ERROR] <https://builds.apache.org/job/openmeetings/ws/openmeetings-screenshare/src/main/java/org/apache/openmeetings/screenshare/job/CursorJob.java>:[24,18]
package org.quartz does not exist
[ERROR] <https://builds.apache.org/job/openmeetings/ws/openmeetings-screenshare/src/main/java/org/apache/openmeetings/screenshare/job/CursorJob.java>:[25,18]
package org.quartz does not exist
[ERROR] <https://builds.apache.org/job/openmeetings/ws/openmeetings-screenshare/src/main/java/org/apache/openmeetings/screenshare/job/CursorJob.java>:[26,18]
package org.quartz does not exist
[ERROR] <https://builds.apache.org/job/openmeetings/ws/openmeetings-screenshare/src/main/java/org/apache/openmeetings/screenshare/job/CursorJob.java>:[29,35]
cannot find symbol
[ERROR] symbol: class Job
[ERROR] <https://builds.apache.org/job/openmeetings/ws/openmeetings-screenshare/src/main/java/org/apache/openmeetings/screenshare/job/CursorJob.java>:[28,2]
cannot find symbol
[ERROR] symbol: class DisallowConcurrentExecution
[ERROR] <https://builds.apache.org/job/openmeetings/ws/openmeetings-screenshare/src/main/java/org/apache/openmeetings/screenshare/job/CursorJob.java>:[33,29]
cannot find symbol
[ERROR] symbol:   class JobExecutionContext
[ERROR] location: class org.apache.openmeetings.screenshare.job.CursorJob
[ERROR] <https://builds.apache.org/job/openmeetings/ws/openmeetings-screenshare/src/main/java/org/apache/openmeetings/screenshare/job/CursorJob.java>:[33,65]
cannot find symbol
[ERROR] symbol:   class JobExecutionException
[ERROR] location: class org.apache.openmeetings.screenshare.job.CursorJob
[ERROR] <https://builds.apache.org/job/openmeetings/ws/openmeetings-screenshare/src/main/java/org/apache/openmeetings/screenshare/job/EncodeJob.java>:[30,18]
package org.quartz does not exist
[ERROR] <https://builds.apache.org/job/openmeetings/ws/openmeetings-screenshare/src/main/java/org/apache/openmeetings/screenshare/job/EncodeJob.java>:[31,18]
package org.quartz does not exist
[ERROR] <https://builds.apache.org/job/openmeetings/ws/openmeetings-screenshare/src/main/java/org/apache/openmeetings/screenshare/job/EncodeJob.java>:[32,18]
package org.quartz does not exist
[ERROR] <https://builds.apache.org/job/openmeetings/ws/openmeetings-screenshare/src/main/java/org/apache/openmeetings/screenshare/job/EncodeJob.java>:[33,18]
package org.quartz does not exist
[ERROR] <https://builds.apache.org/job/openmeetings/ws/openmeetings-screenshare/src/main/java/org/apache/openmeetings/screenshare/job/EncodeJob.java>:[34,18]
package org.quartz does not exist
[ERROR] <https://builds.apache.org/job/openmeetings/ws/openmeetings-screenshare/src/main/java/org/apache/openmeetings/screenshare/job/EncodeJob.java>:[39,35]
cannot find symbol
[ERROR] symbol: class Job
[ERROR] <https://builds.apache.org/job/openmeetings/ws/openmeetings-screenshare/src/main/java/org/apache/openmeetings/screenshare/job/EncodeJob.java>:[38,2]
cannot find symbol
[ERROR] symbol: class DisallowConcurrentExecution
[ERROR] <https://builds.apache.org/job/openmeetings/ws/openmeetings-screenshare/src/main/java/org/apache/openmeetings/screenshare/job/EncodeJob.java>:[56,29]
cannot find symbol
[ERROR] symbol:   class JobExecutionContext
[ERROR] location: class org.apache.openmeetings.screenshare.job.EncodeJob
[ERROR] <https://builds.apache.org/job/openmeetings/ws/openmeetings-screenshare/src/main/java/org/apache/openmeetings/screenshare/job/EncodeJob.java>:[56,65]
cannot find symbol
[ERROR] symbol:   class JobExecutionException
[ERROR] location: class org.apache.openmeetings.screenshare.job.EncodeJob
[ERROR] <https://builds.apache.org/job/openmeetings/ws/openmeetings-screenshare/src/main/java/org/apache/openmeetings/screenshare/job/SendJob.java>:[24,18]
package org.quartz does not exist
[ERROR] <https://builds.apache.org/job/openmeetings/ws/openmeetings-screenshare/src/main/java/org/apache/openmeetings/screenshare/job/SendJob.java>:[25,18]
package org.quartz does not exist
[ERROR] <https://builds.apache.org/job/openmeetings/ws/openmeetings-screenshare/src/main/java/org/apache/openmeetings/screenshare/job/SendJob.java>:[26,18]
package org.quartz does not exist
[ERROR] <https://builds.apache.org/job/openmeetings/ws/openmeetings-screenshare/src/main/java/org/apache/openmeetings/screenshare/job/SendJob.java>:[27,18]
package org.quartz does not exist
[ERROR] <https://builds.apache.org/job/openmeetings/ws/openmeetings-screenshare/src/main/java/org/apache/openmeetings/screenshare/job/SendJob.java>:[31,33]
cannot find symbol
[ERROR] symbol: class Job
[ERROR] <https://builds.apache.org/job/openmeetings/ws/openmeetings-screenshare/src/main/java/org/apache/openmeetings/screenshare/job/SendJob.java>:[36,29]
cannot find symbol
[ERROR] symbol:   class JobExecutionContext
[ERROR] location: class org.apache.openmeetings.screenshare.job.SendJob
[ERROR] <https://builds.apache.org/job/openmeetings/ws/openmeetings-screenshare/src/main/java/org/apache/openmeetings/screenshare/job/SendJob.java>:[36,65]
cannot find symbol
[ERROR] symbol:   class JobExecutionException
[ERROR] location: class org.apache.openmeetings.screenshare.job.SendJob
[ERROR] <https://builds.apache.org/job/openmeetings/ws/openmeetings-screenshare/src/main/java/org/apache/openmeetings/screenshare/job/RemoteJob.java>:[42,18]
package org.quartz does not exist
[ERROR] <https://builds.apache.org/job/openmeetings/ws/openmeetings-screenshare/src/main/java/org/apache/openmeetings/screenshare/job/RemoteJob.java>:[43,18]
package org.quartz does not exist
[ERROR] <https://builds.apache.org/job/openmeetings/ws/openmeetings-screenshare/src/main/java/org/apache/openmeetings/screenshare/job/RemoteJob.java>:[44,18]
package org.quartz does not exist
[ERROR] <https://builds.apache.org/job/openmeetings/ws/openmeetings-screenshare/src/main/java/org/apache/openmeetings/screenshare/job/RemoteJob.java>:[45,18]
package org.quartz does not exist
[ERROR] <https://builds.apache.org/job/openmeetings/ws/openmeetings-screenshare/src/main/java/org/apache/openmeetings/screenshare/job/RemoteJob.java>:[46,18]
package org.quartz does not exist
[ERROR] <https://builds.apache.org/job/openmeetings/ws/openmeetings-screenshare/src/main/java/org/apache/openmeetings/screenshare/job/RemoteJob.java>:[50,35]
cannot find symbol
[ERROR] symbol: class Job
[ERROR] <https://builds.apache.org/job/openmeetings/ws/openmeetings-screenshare/src/main/java/org/apache/openmeetings/screenshare/job/RemoteJob.java>:[49,2]
cannot find symbol
[ERROR] symbol: class DisallowConcurrentExecution
[ERROR] <https://builds.apache.org/job/openmeetings/ws/openmeetings-screenshare/src/main/java/org/apache/openmeetings/screenshare/job/RemoteJob.java>:[66,29]
cannot find symbol
[ERROR] symbol:   class JobExecutionContext
[ERROR] location: class org.apache.openmeetings.screenshare.job.RemoteJob
[ERROR] <https://builds.apache.org/job/openmeetings/ws/openmeetings-screenshare/src/main/java/org/apache/openmeetings/screenshare/job/RemoteJob.java>:[66,65]
cannot find symbol
[ERROR] symbol:   class JobExecutionException
[ERROR] location: class org.apache.openmeetings.screenshare.job.RemoteJob
[ERROR] <https://builds.apache.org/job/openmeetings/ws/openmeetings-screenshare/src/main/java/org/apache/openmeetings/screenshare/util/Util.java>:[31,23]
cannot find symbol
[ERROR] symbol:   variable PROP_SCHED_INSTANCE_NAME
[ERROR] location: class org.apache.openmeetings.screenshare.util.Util
[ERROR] <https://builds.apache.org/job/openmeetings/ws/openmeetings-screenshare/src/main/java/org/apache/openmeetings/screenshare/Core.java>:[139,45]
cannot find symbol
[ERROR] symbol:   class StdSchedulerFactory
[ERROR] location: class org.apache.openmeetings.screenshare.Core
[ERROR] <https://builds.apache.org/job/openmeetings/ws/openmeetings-screenshare/src/main/java/org/apache/openmeetings/screenshare/Core.java>:[141,25]
cannot find symbol
[ERROR] symbol:   class JobDetail
[ERROR] location: class org.apache.openmeetings.screenshare.Core
[ERROR] <https://builds.apache.org/job/openmeetings/ws/openmeetings-screenshare/src/main/java/org/apache/openmeetings/screenshare/Core.java>:[141,47]
cannot find symbol
[ERROR] symbol:   variable JobBuilder
[ERROR] location: class org.apache.openmeetings.screenshare.Core
[ERROR] <https://builds.apache.org/job/openmeetings/ws/openmeetings-screenshare/src/main/java/org/apache/openmeetings/screenshare/Core.java>:[142,25]
cannot find symbol
[ERROR] symbol:   class Trigger
[ERROR] location: class org.apache.openmeetings.screenshare.Core
[ERROR] <https://builds.apache.org/job/openmeetings/ws/openmeetings-screenshare/src/main/java/org/apache/openmeetings/screenshare/Core.java>:[142,49]
cannot find symbol
[ERROR] symbol:   variable TriggerBuilder
[ERROR] location: class org.apache.openmeetings.screenshare.Core
[ERROR] <https://builds.apache.org/job/openmeetings/ws/openmeetings-screenshare/src/main/java/org/apache/openmeetings/screenshare/Core.java>:[144,55]
cannot find symbol
[ERROR] symbol:   method simpleSchedule()
[ERROR] location: class org.apache.openmeetings.screenshare.Core
[ERROR] <https://builds.apache.org/job/openmeetings/ws/openmeetings-screenshare/src/main/java/org/apache/openmeetings/screenshare/Core.java>:[280,26]
cannot find symbol
[ERROR] symbol:   class SchedulerException
[ERROR] location: class org.apache.openmeetings.screenshare.Core
[ERROR] <https://builds.apache.org/job/openmeetings/ws/openmeetings-screenshare/src/main/java/org/apache/openmeetings/screenshare/Core.java>:[364,26]
cannot find symbol
[ERROR] symbol:   class SchedulerException
[ERROR] location: class org.apache.openmeetings.screenshare.Core
[ERROR] <https://builds.apache.org/job/openmeetings/ws/openmeetings-screenshare/src/main/java/org/apache/openmeetings/screenshare/CaptureScreen.java>:[77,29]
cannot find symbol
[ERROR] symbol:   variable JobBuilder
[ERROR] location: class org.apache.openmeetings.screenshare.CaptureScreen
[ERROR] <https://builds.apache.org/job/openmeetings/ws/openmeetings-screenshare/src/main/java/org/apache/openmeetings/screenshare/CaptureScreen.java>:[78,33]
cannot find symbol
[ERROR] symbol:   variable TriggerBuilder
[ERROR] location: class org.apache.openmeetings.screenshare.CaptureScreen
[ERROR] <https://builds.apache.org/job/openmeetings/ws/openmeetings-screenshare/src/main/java/org/apache/openmeetings/screenshare/CaptureScreen.java>:[80,47]
cannot find symbol
[ERROR] symbol:   method simpleSchedule()
[ERROR] location: class org.apache.openmeetings.screenshare.CaptureScreen
[ERROR] <https://builds.apache.org/job/openmeetings/ws/openmeetings-screenshare/src/main/java/org/apache/openmeetings/screenshare/CaptureScreen.java>:[88,33]
cannot find symbol
[ERROR] symbol:   class SchedulerFactory
[ERROR] location: class org.apache.openmeetings.screenshare.CaptureScreen
[ERROR] <https://builds.apache.org/job/openmeetings/ws/openmeetings-screenshare/src/main/java/org/apache/openmeetings/screenshare/CaptureScreen.java>:[88,70]
cannot find symbol
[ERROR] symbol:   class StdSchedulerFactory
[ERROR] location: class org.apache.openmeetings.screenshare.CaptureScreen
[ERROR] <https://builds.apache.org/job/openmeetings/ws/openmeetings-screenshare/src/main/java/org/apache/openmeetings/screenshare/CaptureScreen.java>:[90,34]
cannot find symbol
[ERROR] symbol:   class SchedulerException
[ERROR] location: class org.apache.openmeetings.screenshare.CaptureScreen
[ERROR] <https://builds.apache.org/job/openmeetings/ws/openmeetings-screenshare/src/main/java/org/apache/openmeetings/screenshare/CaptureScreen.java>:[122,25]
cannot find symbol
[ERROR] symbol:   class JobDetail
[ERROR] location: class org.apache.openmeetings.screenshare.CaptureScreen
[ERROR] <https://builds.apache.org/job/openmeetings/ws/openmeetings-screenshare/src/main/java/org/apache/openmeetings/screenshare/CaptureScreen.java>:[122,47]
cannot find symbol
[ERROR] symbol:   variable JobBuilder
[ERROR] location: class org.apache.openmeetings.screenshare.CaptureScreen
[ERROR] <https://builds.apache.org/job/openmeetings/ws/openmeetings-screenshare/src/main/java/org/apache/openmeetings/screenshare/CaptureScreen.java>:[124,25]
cannot find symbol
[ERROR] symbol:   class Trigger
[ERROR] location: class org.apache.openmeetings.screenshare.CaptureScreen
[ERROR] <https://builds.apache.org/job/openmeetings/ws/openmeetings-screenshare/src/main/java/org/apache/openmeetings/screenshare/CaptureScreen.java>:[124,49]
cannot find symbol
[ERROR] symbol:   variable TriggerBuilder
[ERROR] location: class org.apache.openmeetings.screenshare.CaptureScreen
[ERROR] <https://builds.apache.org/job/openmeetings/ws/openmeetings-screenshare/src/main/java/org/apache/openmeetings/screenshare/CaptureScreen.java>:[126,55]
cannot find symbol
[ERROR] symbol:   method simpleSchedule()
[ERROR] location: class org.apache.openmeetings.screenshare.CaptureScreen
[ERROR] <https://builds.apache.org/job/openmeetings/ws/openmeetings-screenshare/src/main/java/org/apache/openmeetings/screenshare/CaptureScreen.java>:[128,25]
cannot find symbol
[ERROR] symbol:   class JobDetail
[ERROR] location: class org.apache.openmeetings.screenshare.CaptureScreen
[ERROR] <https://builds.apache.org/job/openmeetings/ws/openmeetings-screenshare/src/main/java/org/apache/openmeetings/screenshare/CaptureScreen.java>:[128,45]
cannot find symbol
[ERROR] symbol:   variable JobBuilder
[ERROR] location: class org.apache.openmeetings.screenshare.CaptureScreen
[ERROR] <https://builds.apache.org/job/openmeetings/ws/openmeetings-screenshare/src/main/java/org/apache/openmeetings/screenshare/CaptureScreen.java>:[129,25]
cannot find symbol
[ERROR] symbol:   class Trigger
[ERROR] location: class org.apache.openmeetings.screenshare.CaptureScreen
[ERROR] <https://builds.apache.org/job/openmeetings/ws/openmeetings-screenshare/src/main/java/org/apache/openmeetings/screenshare/CaptureScreen.java>:[129,47]
cannot find symbol
[ERROR] symbol:   variable TriggerBuilder
[ERROR] location: class org.apache.openmeetings.screenshare.CaptureScreen
[ERROR] <https://builds.apache.org/job/openmeetings/ws/openmeetings-screenshare/src/main/java/org/apache/openmeetings/screenshare/CaptureScreen.java>:[131,55]
cannot find symbol
[ERROR] symbol:   method simpleSchedule()
[ERROR] location: class org.apache.openmeetings.screenshare.CaptureScreen
[ERROR] <https://builds.apache.org/job/openmeetings/ws/openmeetings-screenshare/src/main/java/org/apache/openmeetings/screenshare/CaptureScreen.java>:[135,25]
cannot find symbol
[ERROR] symbol:   class Scheduler
[ERROR] location: class org.apache.openmeetings.screenshare.CaptureScreen
[ERROR] <https://builds.apache.org/job/openmeetings/ws/openmeetings-screenshare/src/main/java/org/apache/openmeetings/screenshare/CaptureScreen.java>:[216,25]
cannot find symbol
[ERROR] symbol:   class Scheduler
[ERROR] location: class org.apache.openmeetings.screenshare.CaptureScreen
[ERROR] <https://builds.apache.org/job/openmeetings/ws/openmeetings-screenshare/src/main/java/org/apache/openmeetings/screenshare/CaptureScreen.java>:[220,45]
cannot find symbol
[ERROR] symbol:   variable JobKey
[ERROR] location: class org.apache.openmeetings.screenshare.CaptureScreen
[ERROR] <https://builds.apache.org/job/openmeetings/ws/openmeetings-screenshare/src/main/java/org/apache/openmeetings/screenshare/CaptureScreen.java>:[222,26]
cannot find symbol
[ERROR] symbol:   class SchedulerException
[ERROR] location: class org.apache.openmeetings.screenshare.CaptureScreen
[ERROR] <https://builds.apache.org/job/openmeetings/ws/openmeetings-screenshare/src/main/java/org/apache/openmeetings/screenshare/job/CursorJob.java>:[32,9]
method does not override or implement a method from a supertype
[ERROR] <https://builds.apache.org/job/openmeetings/ws/openmeetings-screenshare/src/main/java/org/apache/openmeetings/screenshare/job/CursorJob.java>:[34,17]
cannot find symbol
[ERROR] symbol:   class JobDataMap
[ERROR] location: class org.apache.openmeetings.screenshare.job.CursorJob
[ERROR] <https://builds.apache.org/job/openmeetings/ws/openmeetings-screenshare/src/main/java/org/apache/openmeetings/screenshare/job/EncodeJob.java>:[55,9]
method does not override or implement a method from a supertype
[ERROR] <https://builds.apache.org/job/openmeetings/ws/openmeetings-screenshare/src/main/java/org/apache/openmeetings/screenshare/job/EncodeJob.java>:[57,17]
cannot find symbol
[ERROR] symbol:   class JobDataMap
[ERROR] location: class org.apache.openmeetings.screenshare.job.EncodeJob
[ERROR] <https://builds.apache.org/job/openmeetings/ws/openmeetings-screenshare/src/main/java/org/apache/openmeetings/screenshare/job/SendJob.java>:[35,9]
method does not override or implement a method from a supertype
[ERROR] <https://builds.apache.org/job/openmeetings/ws/openmeetings-screenshare/src/main/java/org/apache/openmeetings/screenshare/job/SendJob.java>:[37,17]
cannot find symbol
[ERROR] symbol:   class JobDataMap
[ERROR] location: class org.apache.openmeetings.screenshare.job.SendJob
[ERROR] <https://builds.apache.org/job/openmeetings/ws/openmeetings-screenshare/src/main/java/org/apache/openmeetings/screenshare/job/RemoteJob.java>:[65,9]
method does not override or implement a method from a supertype
[ERROR] -> [Help 1]
[ERROR] 
[ERROR] To see the full stack trace of the errors, re-run Maven with the -e switch.
[ERROR] Re-run Maven using the -X switch to enable full debug logging.
[ERROR] 
[ERROR] For more information about the errors and possible solutions, please read the following
articles:
[ERROR] [Help 1] http://cwiki.apache.org/confluence/display/MAVEN/MojoFailureException
[ERROR] 
[ERROR] After correcting the problems, you can resume the build with the command
[ERROR]   mvn <goals> -rf :openmeetings-screenshare
[JENKINS] Archiving <https://builds.apache.org/job/openmeetings/ws/openmeetings-server/pom.xml>
to org.apache.openmeetings/openmeetings-server/5.0.0-M2-SNAPSHOT/openmeetings-server-5.0.0-M2-SNAPSHOT.pom
[JENKINS] Archiving <https://builds.apache.org/job/openmeetings/ws/openmeetings-screenshare/pom.xml>
to org.apache.openmeetings/openmeetings-screenshare/5.0.0-M2-SNAPSHOT/openmeetings-screenshare-5.0.0-M2-SNAPSHOT.pom
[JENKINS] Archiving <https://builds.apache.org/job/openmeetings/ws/openmeetings-util/pom.xml>
to org.apache.openmeetings/openmeetings-util/5.0.0-M2-SNAPSHOT/openmeetings-util-5.0.0-M2-SNAPSHOT.pom
[JENKINS] Archiving <https://builds.apache.org/job/openmeetings/ws/openmeetings-util/target/openmeetings-util-5.0.0-M2-SNAPSHOT.jar>
to org.apache.openmeetings/openmeetings-util/5.0.0-M2-SNAPSHOT/openmeetings-util-5.0.0-M2-SNAPSHOT.jar
[JENKINS] Archiving <https://builds.apache.org/job/openmeetings/ws/openmeetings-util/target/openmeetings-util-5.0.0-M2-SNAPSHOT-tests.jar>
to org.apache.openmeetings/openmeetings-util/5.0.0-M2-SNAPSHOT/openmeetings-util-5.0.0-M2-SNAPSHOT-tests.jar
[JENKINS] Archiving <https://builds.apache.org/job/openmeetings/ws/openmeetings-install/pom.xml>
to org.apache.openmeetings/openmeetings-install/5.0.0-M2-SNAPSHOT/openmeetings-install-5.0.0-M2-SNAPSHOT.pom
[JENKINS] Archiving <https://builds.apache.org/job/openmeetings/ws/openmeetings-install/target/openmeetings-install-5.0.0-M2-SNAPSHOT.jar>
to org.apache.openmeetings/openmeetings-install/5.0.0-M2-SNAPSHOT/openmeetings-install-5.0.0-M2-SNAPSHOT.jar
[JENKINS] Archiving <https://builds.apache.org/job/openmeetings/ws/openmeetings-service/pom.xml>
to org.apache.openmeetings/openmeetings-service/5.0.0-M2-SNAPSHOT/openmeetings-service-5.0.0-M2-SNAPSHOT.pom
[JENKINS] Archiving <https://builds.apache.org/job/openmeetings/ws/openmeetings-service/target/openmeetings-service-5.0.0-M2-SNAPSHOT.jar>
to org.apache.openmeetings/openmeetings-service/5.0.0-M2-SNAPSHOT/openmeetings-service-5.0.0-M2-SNAPSHOT.jar
[JENKINS] Archiving <https://builds.apache.org/job/openmeetings/ws/pom.xml> to org.apache.openmeetings/openmeetings-parent/5.0.0-M2-SNAPSHOT/openmeetings-parent-5.0.0-M2-SNAPSHOT.pom
[JENKINS] Archiving <https://builds.apache.org/job/openmeetings/ws/target/openmeetings-parent-5.0.0-M2-SNAPSHOT-site.xml>
to org.apache.openmeetings/openmeetings-parent/5.0.0-M2-SNAPSHOT/openmeetings-parent-5.0.0-M2-SNAPSHOT-site.xml
[JENKINS] Archiving <https://builds.apache.org/job/openmeetings/ws/openmeetings-db/pom.xml>
to org.apache.openmeetings/openmeetings-db/5.0.0-M2-SNAPSHOT/openmeetings-db-5.0.0-M2-SNAPSHOT.pom
[JENKINS] Archiving <https://builds.apache.org/job/openmeetings/ws/openmeetings-db/target/openmeetings-db-5.0.0-M2-SNAPSHOT.jar>
to org.apache.openmeetings/openmeetings-db/5.0.0-M2-SNAPSHOT/openmeetings-db-5.0.0-M2-SNAPSHOT.jar
[JENKINS] Archiving <https://builds.apache.org/job/openmeetings/ws/openmeetings-web/pom.xml>
to org.apache.openmeetings/openmeetings-web/5.0.0-M2-SNAPSHOT/openmeetings-web-5.0.0-M2-SNAPSHOT.pom
[JENKINS] Archiving <https://builds.apache.org/job/openmeetings/ws/openmeetings-web/target/openmeetings-web-5.0.0-M2-SNAPSHOT.war>
to org.apache.openmeetings/openmeetings-web/5.0.0-M2-SNAPSHOT/openmeetings-web-5.0.0-M2-SNAPSHOT.war
[Fast Archiver] Compressed 129.47 MB of artifacts by 94.6% relative to #2820
[JENKINS] Archiving <https://builds.apache.org/job/openmeetings/ws/openmeetings-webservice/pom.xml>
to org.apache.openmeetings/openmeetings-webservice/5.0.0-M2-SNAPSHOT/openmeetings-webservice-5.0.0-M2-SNAPSHOT.pom
[JENKINS] Archiving <https://builds.apache.org/job/openmeetings/ws/openmeetings-webservice/target/openmeetings-webservice-5.0.0-M2-SNAPSHOT.jar>
to org.apache.openmeetings/openmeetings-webservice/5.0.0-M2-SNAPSHOT/openmeetings-webservice-5.0.0-M2-SNAPSHOT.jar
[JENKINS] Archiving <https://builds.apache.org/job/openmeetings/ws/openmeetings-core/pom.xml>
to org.apache.openmeetings/openmeetings-core/5.0.0-M2-SNAPSHOT/openmeetings-core-5.0.0-M2-SNAPSHOT.pom
[JENKINS] Archiving <https://builds.apache.org/job/openmeetings/ws/openmeetings-core/target/openmeetings-core-5.0.0-M2-SNAPSHOT.jar>
to org.apache.openmeetings/openmeetings-core/5.0.0-M2-SNAPSHOT/openmeetings-core-5.0.0-M2-SNAPSHOT.jar
[JENKINS] Archiving <https://builds.apache.org/job/openmeetings/ws/openmeetings-core/target/openmeetings-core-5.0.0-M2-SNAPSHOT-tests.jar>
to org.apache.openmeetings/openmeetings-core/5.0.0-M2-SNAPSHOT/openmeetings-core-5.0.0-M2-SNAPSHOT-tests.jar
Sending e-mails to: dev@openmeetings.apache.org
channel stopped
WARN: Unable to locate 'report-task.txt' in the workspace. Did the SonarScanner succedeed?
Archiving artifacts
Not sending mail to unregistered user solomax666@gmail.com

Mime
View raw message