openmeetings-dev mailing list archives

Site index · List index
Message view « Date » · « Thread »
Top « Date » · « Thread »
From Apache Jenkins Server <jenk...@builds.apache.org>
Subject Build failed in Jenkins: openmeetings #2667
Date Wed, 12 Dec 2018 09:25:12 GMT
See <https://builds.apache.org/job/openmeetings/2667/display/redirect?page=changes>

Changes:

[solomax666] [OPENMEETINGS-1971] second-level object is being found as expected

------------------------------------------
[...truncated 8.49 MB...]
[WARNING] Class not found: edu.umd.cs.findbugs.annotations.SuppressFBWarnings
[WARNING] Class not found: edu.umd.cs.findbugs.annotations.SuppressFBWarnings
[INFO] 72/230 files analyzed, current file: <https://builds.apache.org/job/openmeetings/ws/openmeetings-web/src/main/java/org/apache/openmeetings/web/common/tree/FileTreePanel.java>
[INFO] 99/230 files analyzed, current file: <https://builds.apache.org/job/openmeetings/ws/openmeetings-web/src/main/java/org/apache/openmeetings/web/room/EventDetailDialog.java>
[INFO] 168/230 files analyzed, current file: <https://builds.apache.org/job/openmeetings/ws/openmeetings-web/src/main/java/org/apache/openmeetings/web/user/dashboard/MyRoomsWidgetView.java>
[INFO] Java Main Files AST scan (done) | time=35954ms
[INFO] Java Test Files AST scan
[INFO] 230/230 source files have been analyzed
[INFO] 56 source files to be analyzed
[INFO] Java Test Files AST scan (done) | time=3938ms
[INFO] Sensor JavaSquidSensor (done) | time=39902ms
[INFO] Sensor SCM Sensor
[INFO] 56/56 source files have been analyzed
[INFO] Sensor SCM Sensor (done) | time=24ms
[INFO] Sensor Coverage Report Import
[INFO] Sensor Coverage Report Import (done) | time=0ms
[INFO] Sensor Coverage Report Import
[INFO] Sensor Coverage Report Import (done) | time=0ms
[INFO] Sensor Unit Test Results Import
[INFO] Sensor Unit Test Results Import (done) | time=0ms
[INFO] Sensor SurefireSensor
[INFO] parsing <https://builds.apache.org/job/openmeetings/ws/openmeetings-web/target/surefire-reports>
[INFO] Sensor SurefireSensor (done) | time=42ms
[INFO] Sensor JaCoCoSensor
[INFO] Analysing <https://builds.apache.org/job/openmeetings/ws/openmeetings-web/../target/jacoco.exec>
[INFO] No information about coverage per test.
[INFO] Sensor JaCoCoSensor (done) | time=400ms
[INFO] Sensor JaCoCoItSensor
[INFO] JaCoCoItSensor: JaCoCo IT report not found: <https://builds.apache.org/job/openmeetings/ws/openmeetings-web/target/jacoco-it.exec>
[INFO] Sensor JaCoCoItSensor (done) | time=0ms
[INFO] Sensor JaCoCoOverallSensor
[INFO] Analysing <https://builds.apache.org/job/openmeetings/ws/openmeetings-web/../target/jacoco.exec>
[INFO] Analysing <https://builds.apache.org/job/openmeetings/ws/openmeetings-web/target/sonar/jacoco-overall.exec>
[INFO] No information about coverage per test.
[INFO] Sensor JaCoCoOverallSensor (done) | time=919ms
[INFO] Sensor XmlFileSensor
[INFO] Sensor XmlFileSensor (done) | time=1ms
[INFO] Sensor JavaScript Squid Sensor
[INFO] 40 source files to be analyzed
[INFO] Unit Test Coverage Sensor is started
[INFO] 40/40 source files have been analyzed
[INFO] Integration Test Coverage Sensor is started
[INFO] Overall Coverage Sensor is started
[INFO] Sensor JavaScript Squid Sensor (done) | time=2474ms
[INFO] Sensor Zero Coverage Sensor
[INFO] Sensor Zero Coverage Sensor (done) | time=27ms
[INFO] Sensor Code Colorizer Sensor
[INFO] Sensor Code Colorizer Sensor (done) | time=2ms
[INFO] Sensor CPD Block Indexer
[INFO] JavaCpdBlockIndexer is used for java
[INFO] DefaultCpdBlockIndexer is used for js
[INFO] Sensor CPD Block Indexer (done) | time=168ms
[INFO] -------------  Scan Openmeetings Screen Sharing applet
[INFO] Base dir: <https://builds.apache.org/job/openmeetings/ws/openmeetings-screenshare>
[INFO] Working dir: <https://builds.apache.org/job/openmeetings/ws/openmeetings-screenshare/target/sonar>
[INFO] Source paths: pom.xml, src/main/java
[INFO] Binary dirs: target/classes
[INFO] Source encoding: UTF-8, default locale: en
[INFO] Index files
[INFO] Excluded sources: 
[INFO]   file:**/generated-sources/**
[INFO]   file:**/fabric.js
[INFO]   file:**/cssemoticons.js
[INFO]   file:**/kurento-utils.js
[INFO]   file:**/fileinput*.js
[INFO]   file:**/MathJax.js
[INFO]   file:**/network.js
[INFO]   file:**/jquery.dialogextend.js
[INFO] 30 files indexed
[INFO] 0 files ignored because of inclusion/exclusion patterns
[INFO] Quality profile for java: Sonar way
[INFO] Sensor Lines Sensor
[INFO] Sensor Lines Sensor (done) | time=1ms
[INFO] Sensor JavaSquidSensor
[INFO] Configured Java source version (sonar.java.source): 8
[INFO] JavaClasspath initialization
[INFO] JavaClasspath initialization (done) | time=1ms
[INFO] JavaTestClasspath initialization
[INFO] JavaTestClasspath initialization (done) | time=0ms
[INFO] Java Main Files AST scan
[INFO] 30 source files to be analyzed
[WARNING] Class not found: javax.annotation.Nonnull
[WARNING] Class not found: javax.annotation.meta.When
[WARNING] Class not found: javax.annotation.meta.TypeQualifierNickname
[INFO] Java Main Files AST scan (done) | time=2451ms
[INFO] Java Test Files AST scan
[INFO] 0 source files to be analyzed
[INFO] 30/30 source files have been analyzed
[INFO] Java Test Files AST scan (done) | time=0ms
[INFO] Sensor JavaSquidSensor (done) | time=2458ms
[INFO] Sensor SCM Sensor
[INFO] 0/0 source files have been analyzed
[INFO] Sensor SCM Sensor (done) | time=1ms
[INFO] Sensor Coverage Report Import
[INFO] Sensor Coverage Report Import (done) | time=0ms
[INFO] Sensor Coverage Report Import
[INFO] Sensor Coverage Report Import (done) | time=0ms
[INFO] Sensor Unit Test Results Import
[INFO] Sensor Unit Test Results Import (done) | time=0ms
[INFO] Sensor SurefireSensor
[INFO] parsing <https://builds.apache.org/job/openmeetings/ws/openmeetings-screenshare/target/surefire-reports>
[INFO] Sensor SurefireSensor (done) | time=0ms
[INFO] Sensor JaCoCoSensor
[INFO] Analysing <https://builds.apache.org/job/openmeetings/ws/openmeetings-screenshare/../target/jacoco.exec>
[INFO] No information about coverage per test.
[INFO] Sensor JaCoCoSensor (done) | time=282ms
[INFO] Sensor JaCoCoItSensor
[INFO] JaCoCoItSensor: JaCoCo IT report not found: <https://builds.apache.org/job/openmeetings/ws/openmeetings-screenshare/target/jacoco-it.exec>
[INFO] Sensor JaCoCoItSensor (done) | time=0ms
[INFO] Sensor JaCoCoOverallSensor
[INFO] Analysing <https://builds.apache.org/job/openmeetings/ws/openmeetings-screenshare/../target/jacoco.exec>
[INFO] Analysing <https://builds.apache.org/job/openmeetings/ws/openmeetings-screenshare/target/sonar/jacoco-overall.exec>
[INFO] No information about coverage per test.
[INFO] Sensor JaCoCoOverallSensor (done) | time=787ms
[INFO] Sensor XmlFileSensor
[INFO] Sensor XmlFileSensor (done) | time=0ms
[INFO] Sensor Zero Coverage Sensor
[INFO] Sensor Zero Coverage Sensor (done) | time=3ms
[INFO] Sensor Code Colorizer Sensor
[INFO] Sensor Code Colorizer Sensor (done) | time=1ms
[INFO] Sensor CPD Block Indexer
[INFO] JavaCpdBlockIndexer is used for java
[INFO] Sensor CPD Block Indexer (done) | time=19ms
[INFO] -------------  Scan Openmeetings Server
[INFO] Base dir: <https://builds.apache.org/job/openmeetings/ws/openmeetings-server>
[INFO] Working dir: <https://builds.apache.org/job/openmeetings/ws/openmeetings-server/target/sonar>
[INFO] Source paths: pom.xml
[INFO] Binary dirs: target/classes
[INFO] Source encoding: UTF-8, default locale: en
[INFO] Index files
[INFO] Excluded sources: 
[INFO]   file:**/generated-sources/**
[INFO]   file:**/fabric.js
[INFO]   file:**/cssemoticons.js
[INFO]   file:**/kurento-utils.js
[INFO]   file:**/fileinput*.js
[INFO]   file:**/MathJax.js
[INFO]   file:**/network.js
[INFO]   file:**/jquery.dialogextend.js
[INFO] 0 files indexed
[INFO] 0 files ignored because of inclusion/exclusion patterns
[INFO] Sensor Lines Sensor
[INFO] Sensor Lines Sensor (done) | time=0ms
[INFO] Sensor SCM Sensor
[INFO] Sensor SCM Sensor (done) | time=0ms
[INFO] Sensor Coverage Report Import
[INFO] Sensor Coverage Report Import (done) | time=0ms
[INFO] Sensor Coverage Report Import
[INFO] Sensor Coverage Report Import (done) | time=0ms
[INFO] Sensor Unit Test Results Import
[INFO] Sensor Unit Test Results Import (done) | time=0ms
[INFO] Sensor XmlFileSensor
[INFO] Sensor XmlFileSensor (done) | time=0ms
[INFO] Sensor Zero Coverage Sensor
[INFO] Sensor Zero Coverage Sensor (done) | time=0ms
[INFO] Sensor Code Colorizer Sensor
[INFO] Sensor Code Colorizer Sensor (done) | time=0ms
[INFO] Sensor CPD Block Indexer
[INFO] Sensor CPD Block Indexer (done) | time=0ms
[INFO] -------------  Scan Openmeetings
[INFO] Base dir: <https://builds.apache.org/job/openmeetings/ws/>
[INFO] Working dir: <https://builds.apache.org/job/openmeetings/ws/target/sonar>
[INFO] Source encoding: UTF-8, default locale: en
[INFO] Sensor Lines Sensor
[INFO] Sensor Lines Sensor (done) | time=0ms
[INFO] Sensor SCM Sensor
[INFO] Sensor SCM Sensor (done) | time=0ms
[INFO] Sensor Coverage Report Import
[INFO] Sensor Coverage Report Import (done) | time=0ms
[INFO] Sensor Coverage Report Import
[INFO] Sensor Coverage Report Import (done) | time=0ms
[INFO] Sensor Unit Test Results Import
[INFO] Sensor Unit Test Results Import (done) | time=0ms
[INFO] Sensor XmlFileSensor
[INFO] Sensor XmlFileSensor (done) | time=0ms
[INFO] Sensor Zero Coverage Sensor
[INFO] Sensor Zero Coverage Sensor (done) | time=0ms
[INFO] Sensor Code Colorizer Sensor
[INFO] Sensor Code Colorizer Sensor (done) | time=0ms
[INFO] Sensor CPD Block Indexer
[INFO] Sensor CPD Block Indexer (done) | time=0ms
[INFO] Calculating CPD for 472 files
[INFO] CPD calculation finished
[INFO] Analysis report generated in 715ms, dir size=6 MB
[INFO] Analysis reports compressed in 1121ms, zip size=2 MB
[INFO] ------------------------------------------------------------------------
[INFO] Reactor Summary:
[INFO] 
[INFO] Openmeetings 5.0.0-SNAPSHOT ........................ FAILURE [02:43 min]
[INFO] Openmeetings Util .................................. SUCCESS [03:58 min]
[INFO] Openmeetings DB .................................... SUCCESS [ 52.211 s]
[INFO] Openmeetings Core .................................. SUCCESS [ 52.434 s]
[INFO] Openmeetings Install ............................... SUCCESS [ 34.319 s]
[INFO] Openmeetings Service ............................... SUCCESS [ 30.900 s]
[INFO] Openmeetings Webservices ........................... SUCCESS [01:01 min]
[INFO] Openmeetings Web ................................... SUCCESS [19:24 min]
[INFO] Openmeetings Screen Sharing applet ................. SUCCESS [ 34.306 s]
[INFO] Openmeetings Server 5.0.0-SNAPSHOT ................. SUCCESS [01:00 min]
[INFO] ------------------------------------------------------------------------
[INFO] BUILD FAILURE
[INFO] ------------------------------------------------------------------------
[INFO] Total time: 35:22 min
[INFO] Finished at: 2018-12-12T09:21:58Z
[INFO] ------------------------------------------------------------------------
Waiting for Jenkins to finish collecting data
[ERROR] Failed to execute goal org.sonarsource.scanner.maven:sonar-maven-plugin:3.5.0.1254:sonar
(default-cli) on project openmeetings-parent: Fail to request https://builds.apache.org/analysis/api/ce/submit?projectKey=org.apache.openmeetings:openmeetings-parent&projectName=Openmeetings:
timeout: Socket closed -> [Help 1]
[ERROR] 
[ERROR] To see the full stack trace of the errors, re-run Maven with the -e switch.
[ERROR] Re-run Maven using the -X switch to enable full debug logging.
[ERROR] 
[ERROR] For more information about the errors and possible solutions, please read the following
articles:
[ERROR] [Help 1] http://cwiki.apache.org/confluence/display/MAVEN/MojoExecutionException
[JENKINS] Archiving <https://builds.apache.org/job/openmeetings/ws/openmeetings-server/pom.xml>
to org.apache.openmeetings/openmeetings-server/5.0.0-SNAPSHOT/openmeetings-server-5.0.0-SNAPSHOT.pom
[JENKINS] Archiving <https://builds.apache.org/job/openmeetings/ws/openmeetings-server/target/openmeetings-server-5.0.0-SNAPSHOT.jar>
to org.apache.openmeetings/openmeetings-server/5.0.0-SNAPSHOT/openmeetings-server-5.0.0-SNAPSHOT.jar
[JENKINS] Archiving <https://builds.apache.org/job/openmeetings/ws/openmeetings-server/target/apache-openmeetings-5.0.0-SNAPSHOT.tar.gz>
to org.apache.openmeetings/openmeetings-server/5.0.0-SNAPSHOT/openmeetings-server-5.0.0-SNAPSHOT.tar.gz
[JENKINS] Archiving <https://builds.apache.org/job/openmeetings/ws/openmeetings-server/target/apache-openmeetings-5.0.0-SNAPSHOT.zip>
to org.apache.openmeetings/openmeetings-server/5.0.0-SNAPSHOT/openmeetings-server-5.0.0-SNAPSHOT.zip
[JENKINS] Archiving <https://builds.apache.org/job/openmeetings/ws/openmeetings-server/target/apache-openmeetings-5.0.0-SNAPSHOT-src.tar.gz>
to org.apache.openmeetings/openmeetings-server/5.0.0-SNAPSHOT/openmeetings-server-5.0.0-SNAPSHOT-src.tar.gz
[JENKINS] Archiving <https://builds.apache.org/job/openmeetings/ws/openmeetings-server/target/apache-openmeetings-5.0.0-SNAPSHOT-src.zip>
to org.apache.openmeetings/openmeetings-server/5.0.0-SNAPSHOT/openmeetings-server-5.0.0-SNAPSHOT-src.zip
[Fast Archiver] Compressed 315.23 MB of artifacts by 40.8% relative to #2666
[JENKINS] Archiving <https://builds.apache.org/job/openmeetings/ws/openmeetings-screenshare/pom.xml>
to org.apache.openmeetings/openmeetings-screenshare/5.0.0-SNAPSHOT/openmeetings-screenshare-5.0.0-SNAPSHOT.pom
[JENKINS] Archiving <https://builds.apache.org/job/openmeetings/ws/openmeetings-screenshare/target/openmeetings-screenshare-5.0.0-SNAPSHOT.jar>
to org.apache.openmeetings/openmeetings-screenshare/5.0.0-SNAPSHOT/openmeetings-screenshare-5.0.0-SNAPSHOT.jar
[JENKINS] Archiving <https://builds.apache.org/job/openmeetings/ws/openmeetings-screenshare/target/jnlp/openmeetings-screenshare-5.0.0-SNAPSHOT-full.jar>
to org.apache.openmeetings/openmeetings-screenshare/5.0.0-SNAPSHOT/openmeetings-screenshare-5.0.0-SNAPSHOT-full.jar
[Fast Archiver] Compressed 10.82 MB of artifacts by 84.9% relative to #2666
[JENKINS] Archiving <https://builds.apache.org/job/openmeetings/ws/openmeetings-util/pom.xml>
to org.apache.openmeetings/openmeetings-util/5.0.0-SNAPSHOT/openmeetings-util-5.0.0-SNAPSHOT.pom
[JENKINS] Archiving <https://builds.apache.org/job/openmeetings/ws/openmeetings-util/target/openmeetings-util-5.0.0-SNAPSHOT.jar>
to org.apache.openmeetings/openmeetings-util/5.0.0-SNAPSHOT/openmeetings-util-5.0.0-SNAPSHOT.jar
[JENKINS] Archiving <https://builds.apache.org/job/openmeetings/ws/openmeetings-util/target/openmeetings-util-5.0.0-SNAPSHOT-tests.jar>
to org.apache.openmeetings/openmeetings-util/5.0.0-SNAPSHOT/openmeetings-util-5.0.0-SNAPSHOT-tests.jar
[JENKINS] Archiving <https://builds.apache.org/job/openmeetings/ws/openmeetings-install/pom.xml>
to org.apache.openmeetings/openmeetings-install/5.0.0-SNAPSHOT/openmeetings-install-5.0.0-SNAPSHOT.pom
[JENKINS] Archiving <https://builds.apache.org/job/openmeetings/ws/openmeetings-install/target/openmeetings-install-5.0.0-SNAPSHOT.jar>
to org.apache.openmeetings/openmeetings-install/5.0.0-SNAPSHOT/openmeetings-install-5.0.0-SNAPSHOT.jar
[JENKINS] Archiving <https://builds.apache.org/job/openmeetings/ws/openmeetings-service/pom.xml>
to org.apache.openmeetings/openmeetings-service/5.0.0-SNAPSHOT/openmeetings-service-5.0.0-SNAPSHOT.pom
[JENKINS] Archiving <https://builds.apache.org/job/openmeetings/ws/openmeetings-service/target/openmeetings-service-5.0.0-SNAPSHOT.jar>
to org.apache.openmeetings/openmeetings-service/5.0.0-SNAPSHOT/openmeetings-service-5.0.0-SNAPSHOT.jar
[JENKINS] Archiving <https://builds.apache.org/job/openmeetings/ws/pom.xml> to org.apache.openmeetings/openmeetings-parent/5.0.0-SNAPSHOT/openmeetings-parent-5.0.0-SNAPSHOT.pom
[JENKINS] Archiving <https://builds.apache.org/job/openmeetings/ws/target/openmeetings-parent-5.0.0-SNAPSHOT-site.xml>
to org.apache.openmeetings/openmeetings-parent/5.0.0-SNAPSHOT/openmeetings-parent-5.0.0-SNAPSHOT-site.xml
[Fast Archiver] Compressed 49.13 KB of artifacts by 65.1% relative to #2666
[JENKINS] Archiving <https://builds.apache.org/job/openmeetings/ws/openmeetings-db/pom.xml>
to org.apache.openmeetings/openmeetings-db/5.0.0-SNAPSHOT/openmeetings-db-5.0.0-SNAPSHOT.pom
[JENKINS] Archiving <https://builds.apache.org/job/openmeetings/ws/openmeetings-db/target/openmeetings-db-5.0.0-SNAPSHOT.jar>
to org.apache.openmeetings/openmeetings-db/5.0.0-SNAPSHOT/openmeetings-db-5.0.0-SNAPSHOT.jar
[JENKINS] Archiving <https://builds.apache.org/job/openmeetings/ws/openmeetings-web/pom.xml>
to org.apache.openmeetings/openmeetings-web/5.0.0-SNAPSHOT/openmeetings-web-5.0.0-SNAPSHOT.pom
[JENKINS] Archiving <https://builds.apache.org/job/openmeetings/ws/openmeetings-web/target/openmeetings-web-5.0.0-SNAPSHOT.war>
to org.apache.openmeetings/openmeetings-web/5.0.0-SNAPSHOT/openmeetings-web-5.0.0-SNAPSHOT.war
[Fast Archiver] Compressed 116.84 MB of artifacts by 91.7% relative to #2666
[JENKINS] Archiving <https://builds.apache.org/job/openmeetings/ws/openmeetings-webservice/pom.xml>
to org.apache.openmeetings/openmeetings-webservice/5.0.0-SNAPSHOT/openmeetings-webservice-5.0.0-SNAPSHOT.pom
[JENKINS] Archiving <https://builds.apache.org/job/openmeetings/ws/openmeetings-webservice/target/openmeetings-webservice-5.0.0-SNAPSHOT.jar>
to org.apache.openmeetings/openmeetings-webservice/5.0.0-SNAPSHOT/openmeetings-webservice-5.0.0-SNAPSHOT.jar
[JENKINS] Archiving <https://builds.apache.org/job/openmeetings/ws/openmeetings-core/pom.xml>
to org.apache.openmeetings/openmeetings-core/5.0.0-SNAPSHOT/openmeetings-core-5.0.0-SNAPSHOT.pom
[JENKINS] Archiving <https://builds.apache.org/job/openmeetings/ws/openmeetings-core/target/openmeetings-core-5.0.0-SNAPSHOT.jar>
to org.apache.openmeetings/openmeetings-core/5.0.0-SNAPSHOT/openmeetings-core-5.0.0-SNAPSHOT.jar
[JENKINS] Archiving <https://builds.apache.org/job/openmeetings/ws/openmeetings-core/target/openmeetings-core-5.0.0-SNAPSHOT-tests.jar>
to org.apache.openmeetings/openmeetings-core/5.0.0-SNAPSHOT/openmeetings-core-5.0.0-SNAPSHOT-tests.jar
Sending e-mails to: dev@openmeetings.apache.org
channel stopped
WARN: Unable to locate 'report-task.txt' in the workspace. Did the SonarScanner succedeed?
Archiving artifacts
[Fast Archiver] Compressed 315.20 MB of artifacts by 40.9% relative to #2666
Not sending mail to unregistered user solomax666@gmail.com

Mime
View raw message