openmeetings-dev mailing list archives

Site index · List index
Message view « Date » · « Thread »
Top « Date » · « Thread »
From Apache Jenkins Server <jenk...@builds.apache.org>
Subject Build failed in Jenkins: openmeetings #2617
Date Tue, 23 Oct 2018 08:29:48 GMT
See <https://builds.apache.org/job/openmeetings/2617/display/redirect?page=changes>

Changes:

[solomax666] [OPENMEETINGS-1934] delete icon is added

------------------------------------------
[...truncated 7.10 MB...]
    at org.apache.maven.lifecycle.internal.LifecycleModuleBuilder.buildProject (LifecycleModuleBuilder.java:81)
    at org.apache.maven.lifecycle.internal.builder.singlethreaded.SingleThreadedBuilder.build
(SingleThreadedBuilder.java:56)
    at org.apache.maven.lifecycle.internal.LifecycleStarter.execute (LifecycleStarter.java:128)
    at org.apache.maven.DefaultMaven.doExecute (DefaultMaven.java:305)
    at org.apache.maven.DefaultMaven.doExecute (DefaultMaven.java:192)
    at org.apache.maven.DefaultMaven.execute (DefaultMaven.java:105)
    at org.jvnet.hudson.maven3.launcher.Maven35Launcher.main (Maven35Launcher.java:130)
    at sun.reflect.NativeMethodAccessorImpl.invoke0 (Native Method)
    at sun.reflect.NativeMethodAccessorImpl.invoke (NativeMethodAccessorImpl.java:62)
    at sun.reflect.DelegatingMethodAccessorImpl.invoke (DelegatingMethodAccessorImpl.java:43)
    at java.lang.reflect.Method.invoke (Method.java:498)
    at org.codehaus.plexus.classworlds.launcher.Launcher.launchEnhanced (Launcher.java:289)
    at org.codehaus.plexus.classworlds.launcher.Launcher.launch (Launcher.java:229)
    at jenkins.maven3.agent.Maven35Main.launch (Maven35Main.java:176)
    at sun.reflect.NativeMethodAccessorImpl.invoke0 (Native Method)
    at sun.reflect.NativeMethodAccessorImpl.invoke (NativeMethodAccessorImpl.java:62)
    at sun.reflect.DelegatingMethodAccessorImpl.invoke (DelegatingMethodAccessorImpl.java:43)
    at java.lang.reflect.Method.invoke (Method.java:498)
    at hudson.maven.Maven3Builder.call (Maven3Builder.java:139)
    at hudson.maven.Maven3Builder.call (Maven3Builder.java:70)
    at hudson.remoting.UserRequest.perform (UserRequest.java:212)
    at hudson.remoting.UserRequest.perform (UserRequest.java:54)
    at hudson.remoting.Request$2.run (Request.java:369)
    at hudson.remoting.InterceptingExecutorService$1.call (InterceptingExecutorService.java:72)
    at java.util.concurrent.FutureTask.run (FutureTask.java:266)
    at java.util.concurrent.ThreadPoolExecutor.runWorker (ThreadPoolExecutor.java:1149)
    at java.util.concurrent.ThreadPoolExecutor$Worker.run (ThreadPoolExecutor.java:624)
    at java.lang.Thread.run (Thread.java:748)
[WARNING] Failure to transfer org.apache.wicket:wicket-parent:8.2.0-SNAPSHOT/maven-metadata.xml
from http://snapshots.repository.codehaus.org was cached in the local repository, resolution
will not be reattempted until the update interval of codehaus-snapshots has elapsed or updates
are forced. Original error: Could not transfer metadata org.apache.wicket:wicket-parent:8.2.0-SNAPSHOT/maven-metadata.xml
from/to codehaus-snapshots (http://nexus.codehaus.org/snapshots/): Error transferring file:
nexus.codehaus.org from http://nexus.codehaus.org/snapshots/org/apache/wicket/wicket-parent/8.2.0-SNAPSHOT/maven-metadata.xml
[WARNING] Failure to transfer org.apache.wicket:wicket-parent:8.2.0-SNAPSHOT/maven-metadata.xml
from https://artifacts.unidata.ucar.edu/content/repositories/unidata-3rdparty/ was cached
in the local repository, resolution will not be reattempted until the update interval of unidata-3rdparty
has elapsed or updates are forced. Original error: Could not transfer metadata org.apache.wicket:wicket-parent:8.2.0-SNAPSHOT/maven-metadata.xml
from/to unidata-3rdparty (https://artifacts.unidata.ucar.edu/content/repositories/unidata-3rdparty/):
Error transferring file: Server returned HTTP response code: 400 for URL: https://artifacts.unidata.ucar.edu/content/repositories/unidata-3rdparty/org/apache/wicket/wicket-parent/8.2.0-SNAPSHOT/maven-metadata.xml
from https://artifacts.unidata.ucar.edu/content/repositories/unidata-3rdparty/org/apache/wicket/wicket-parent/8.2.0-SNAPSHOT/maven-metadata.xml
[WARNING] Failure to transfer org.apache.wicket:wicket-parent:8.2.0-SNAPSHOT/maven-metadata.xml
from http://snapshots.repository.codehaus.org was cached in the local repository, resolution
will not be reattempted until the update interval of codehaus-snapshots has elapsed or updates
are forced. Original error: Could not transfer metadata org.apache.wicket:wicket-parent:8.2.0-SNAPSHOT/maven-metadata.xml
from/to codehaus-snapshots (http://nexus.codehaus.org/snapshots/): Error transferring file:
nexus.codehaus.org from http://nexus.codehaus.org/snapshots/org/apache/wicket/wicket-parent/8.2.0-SNAPSHOT/maven-metadata.xml
[WARNING] Failure to transfer org.apache.wicket:wicket-parent:8.2.0-SNAPSHOT/maven-metadata.xml
from https://artifacts.unidata.ucar.edu/content/repositories/unidata-3rdparty/ was cached
in the local repository, resolution will not be reattempted until the update interval of unidata-3rdparty
has elapsed or updates are forced. Original error: Could not transfer metadata org.apache.wicket:wicket-parent:8.2.0-SNAPSHOT/maven-metadata.xml
from/to unidata-3rdparty (https://artifacts.unidata.ucar.edu/content/repositories/unidata-3rdparty/):
Error transferring file: Server returned HTTP response code: 400 for URL: https://artifacts.unidata.ucar.edu/content/repositories/unidata-3rdparty/org/apache/wicket/wicket-parent/8.2.0-SNAPSHOT/maven-metadata.xml
from https://artifacts.unidata.ucar.edu/content/repositories/unidata-3rdparty/org/apache/wicket/wicket-parent/8.2.0-SNAPSHOT/maven-metadata.xml
[WARNING] The directive.evaluate.context.class property has been deprecated. It will be removed
in Velocity 2.0.  Instead, please use the automatically provided $evaluate namespace to get
and set local references (e.g. #set($evaluate.foo = 'bar') and $evaluate.foo).
[WARNING] The directive.evaluate.context.class property has been deprecated. It will be removed
in Velocity 2.0.  Instead, please use the automatically provided $evaluate namespace to get
and set local references (e.g. #set($evaluate.foo = 'bar') and $evaluate.foo).
[WARNING] The directive.evaluate.context.class property has been deprecated. It will be removed
in Velocity 2.0.  Instead, please use the automatically provided $evaluate namespace to get
and set local references (e.g. #set($evaluate.foo = 'bar') and $evaluate.foo).
[INFO] Generating "Dependency Convergence" report --- maven-project-info-reports-plugin:3.0.0:dependency-convergence
[WARNING] The directive.evaluate.context.class property has been deprecated. It will be removed
in Velocity 2.0.  Instead, please use the automatically provided $evaluate namespace to get
and set local references (e.g. #set($evaluate.foo = 'bar') and $evaluate.foo).
[WARNING] The directive.evaluate.context.class property has been deprecated. It will be removed
in Velocity 2.0.  Instead, please use the automatically provided $evaluate namespace to get
and set local references (e.g. #set($evaluate.foo = 'bar') and $evaluate.foo).
[WARNING] The directive.evaluate.context.class property has been deprecated. It will be removed
in Velocity 2.0.  Instead, please use the automatically provided $evaluate namespace to get
and set local references (e.g. #set($evaluate.foo = 'bar') and $evaluate.foo).
[INFO] Generating "Dependency Management" report --- maven-project-info-reports-plugin:3.0.0:dependency-management
[WARNING] The directive.evaluate.context.class property has been deprecated. It will be removed
in Velocity 2.0.  Instead, please use the automatically provided $evaluate namespace to get
and set local references (e.g. #set($evaluate.foo = 'bar') and $evaluate.foo).
[WARNING] The directive.evaluate.context.class property has been deprecated. It will be removed
in Velocity 2.0.  Instead, please use the automatically provided $evaluate namespace to get
and set local references (e.g. #set($evaluate.foo = 'bar') and $evaluate.foo).
[WARNING] The directive.evaluate.context.class property has been deprecated. It will be removed
in Velocity 2.0.  Instead, please use the automatically provided $evaluate namespace to get
and set local references (e.g. #set($evaluate.foo = 'bar') and $evaluate.foo).
[INFO] Generating "Distribution Management" report --- maven-project-info-reports-plugin:3.0.0:distribution-management
[WARNING] The directive.evaluate.context.class property has been deprecated. It will be removed
in Velocity 2.0.  Instead, please use the automatically provided $evaluate namespace to get
and set local references (e.g. #set($evaluate.foo = 'bar') and $evaluate.foo).
[WARNING] The directive.evaluate.context.class property has been deprecated. It will be removed
in Velocity 2.0.  Instead, please use the automatically provided $evaluate namespace to get
and set local references (e.g. #set($evaluate.foo = 'bar') and $evaluate.foo).
[WARNING] The directive.evaluate.context.class property has been deprecated. It will be removed
in Velocity 2.0.  Instead, please use the automatically provided $evaluate namespace to get
and set local references (e.g. #set($evaluate.foo = 'bar') and $evaluate.foo).
[INFO] Generating "Issue Management" report     --- maven-project-info-reports-plugin:3.0.0:issue-management
[WARNING] The directive.evaluate.context.class property has been deprecated. It will be removed
in Velocity 2.0.  Instead, please use the automatically provided $evaluate namespace to get
and set local references (e.g. #set($evaluate.foo = 'bar') and $evaluate.foo).
[WARNING] The directive.evaluate.context.class property has been deprecated. It will be removed
in Velocity 2.0.  Instead, please use the automatically provided $evaluate namespace to get
and set local references (e.g. #set($evaluate.foo = 'bar') and $evaluate.foo).
[WARNING] The directive.evaluate.context.class property has been deprecated. It will be removed
in Velocity 2.0.  Instead, please use the automatically provided $evaluate namespace to get
and set local references (e.g. #set($evaluate.foo = 'bar') and $evaluate.foo).
[INFO] Generating "Licenses" report             --- maven-project-info-reports-plugin:3.0.0:licenses
[WARNING] The directive.evaluate.context.class property has been deprecated. It will be removed
in Velocity 2.0.  Instead, please use the automatically provided $evaluate namespace to get
and set local references (e.g. #set($evaluate.foo = 'bar') and $evaluate.foo).
[WARNING] The directive.evaluate.context.class property has been deprecated. It will be removed
in Velocity 2.0.  Instead, please use the automatically provided $evaluate namespace to get
and set local references (e.g. #set($evaluate.foo = 'bar') and $evaluate.foo).
[WARNING] The directive.evaluate.context.class property has been deprecated. It will be removed
in Velocity 2.0.  Instead, please use the automatically provided $evaluate namespace to get
and set local references (e.g. #set($evaluate.foo = 'bar') and $evaluate.foo).
[INFO] Generating "Mailing Lists" report        --- maven-project-info-reports-plugin:3.0.0:mailing-lists
[WARNING] The directive.evaluate.context.class property has been deprecated. It will be removed
in Velocity 2.0.  Instead, please use the automatically provided $evaluate namespace to get
and set local references (e.g. #set($evaluate.foo = 'bar') and $evaluate.foo).
[WARNING] The directive.evaluate.context.class property has been deprecated. It will be removed
in Velocity 2.0.  Instead, please use the automatically provided $evaluate namespace to get
and set local references (e.g. #set($evaluate.foo = 'bar') and $evaluate.foo).
[WARNING] The directive.evaluate.context.class property has been deprecated. It will be removed
in Velocity 2.0.  Instead, please use the automatically provided $evaluate namespace to get
and set local references (e.g. #set($evaluate.foo = 'bar') and $evaluate.foo).
[INFO] Generating "Plugin Management" report    --- maven-project-info-reports-plugin:3.0.0:plugin-management
[WARNING] The directive.evaluate.context.class property has been deprecated. It will be removed
in Velocity 2.0.  Instead, please use the automatically provided $evaluate namespace to get
and set local references (e.g. #set($evaluate.foo = 'bar') and $evaluate.foo).
[WARNING] The directive.evaluate.context.class property has been deprecated. It will be removed
in Velocity 2.0.  Instead, please use the automatically provided $evaluate namespace to get
and set local references (e.g. #set($evaluate.foo = 'bar') and $evaluate.foo).
[WARNING] The directive.evaluate.context.class property has been deprecated. It will be removed
in Velocity 2.0.  Instead, please use the automatically provided $evaluate namespace to get
and set local references (e.g. #set($evaluate.foo = 'bar') and $evaluate.foo).
[INFO] Generating "Plugins" report              --- maven-project-info-reports-plugin:3.0.0:plugins
[WARNING] The directive.evaluate.context.class property has been deprecated. It will be removed
in Velocity 2.0.  Instead, please use the automatically provided $evaluate namespace to get
and set local references (e.g. #set($evaluate.foo = 'bar') and $evaluate.foo).
[WARNING] The directive.evaluate.context.class property has been deprecated. It will be removed
in Velocity 2.0.  Instead, please use the automatically provided $evaluate namespace to get
and set local references (e.g. #set($evaluate.foo = 'bar') and $evaluate.foo).
[WARNING] The directive.evaluate.context.class property has been deprecated. It will be removed
in Velocity 2.0.  Instead, please use the automatically provided $evaluate namespace to get
and set local references (e.g. #set($evaluate.foo = 'bar') and $evaluate.foo).
[INFO] Generating "Team" report                 --- maven-project-info-reports-plugin:3.0.0:team
[WARNING] The directive.evaluate.context.class property has been deprecated. It will be removed
in Velocity 2.0.  Instead, please use the automatically provided $evaluate namespace to get
and set local references (e.g. #set($evaluate.foo = 'bar') and $evaluate.foo).
[WARNING] The directive.evaluate.context.class property has been deprecated. It will be removed
in Velocity 2.0.  Instead, please use the automatically provided $evaluate namespace to get
and set local references (e.g. #set($evaluate.foo = 'bar') and $evaluate.foo).
[WARNING] The directive.evaluate.context.class property has been deprecated. It will be removed
in Velocity 2.0.  Instead, please use the automatically provided $evaluate namespace to get
and set local references (e.g. #set($evaluate.foo = 'bar') and $evaluate.foo).
[INFO] Generating "Source Code Management" report --- maven-project-info-reports-plugin:3.0.0:scm
[WARNING] The directive.evaluate.context.class property has been deprecated. It will be removed
in Velocity 2.0.  Instead, please use the automatically provided $evaluate namespace to get
and set local references (e.g. #set($evaluate.foo = 'bar') and $evaluate.foo).
[WARNING] The directive.evaluate.context.class property has been deprecated. It will be removed
in Velocity 2.0.  Instead, please use the automatically provided $evaluate namespace to get
and set local references (e.g. #set($evaluate.foo = 'bar') and $evaluate.foo).
[WARNING] The directive.evaluate.context.class property has been deprecated. It will be removed
in Velocity 2.0.  Instead, please use the automatically provided $evaluate namespace to get
and set local references (e.g. #set($evaluate.foo = 'bar') and $evaluate.foo).
[INFO] Generating "Summary" report              --- maven-project-info-reports-plugin:3.0.0:summary
[WARNING] The directive.evaluate.context.class property has been deprecated. It will be removed
in Velocity 2.0.  Instead, please use the automatically provided $evaluate namespace to get
and set local references (e.g. #set($evaluate.foo = 'bar') and $evaluate.foo).
[WARNING] The directive.evaluate.context.class property has been deprecated. It will be removed
in Velocity 2.0.  Instead, please use the automatically provided $evaluate namespace to get
and set local references (e.g. #set($evaluate.foo = 'bar') and $evaluate.foo).
[WARNING] The directive.evaluate.context.class property has been deprecated. It will be removed
in Velocity 2.0.  Instead, please use the automatically provided $evaluate namespace to get
and set local references (e.g. #set($evaluate.foo = 'bar') and $evaluate.foo).
[INFO] Generating "Surefire Report" report      --- maven-surefire-report-plugin:2.22.0:report-only
[WARNING] Unable to locate Test Source XRef to link to - DISABLED
[WARNING] The directive.evaluate.context.class property has been deprecated. It will be removed
in Velocity 2.0.  Instead, please use the automatically provided $evaluate namespace to get
and set local references (e.g. #set($evaluate.foo = 'bar') and $evaluate.foo).
[WARNING] The directive.evaluate.context.class property has been deprecated. It will be removed
in Velocity 2.0.  Instead, please use the automatically provided $evaluate namespace to get
and set local references (e.g. #set($evaluate.foo = 'bar') and $evaluate.foo).
[WARNING] The directive.evaluate.context.class property has been deprecated. It will be removed
in Velocity 2.0.  Instead, please use the automatically provided $evaluate namespace to get
and set local references (e.g. #set($evaluate.foo = 'bar') and $evaluate.foo).
[INFO] Generating "Rat Report" report           --- apache-rat-plugin:0.12:rat
[INFO] Added 1 additional default licenses.
[INFO] Enabled default license matchers.
[INFO] Added 1 custom approved licenses.
[INFO] Will parse SCM ignores for exclusions...
[INFO] Finished adding exclusions from SCM ignore files.
[INFO] 61 implicit excludes (use -debug for more details).
[INFO] Exclude: **/*.mp3
[INFO] Exclude: **/keystore
[INFO] 172 resources included (use -debug for more details)
[WARNING] The directive.evaluate.context.class property has been deprecated. It will be removed
in Velocity 2.0.  Instead, please use the automatically provided $evaluate namespace to get
and set local references (e.g. #set($evaluate.foo = 'bar') and $evaluate.foo).
[WARNING] The directive.evaluate.context.class property has been deprecated. It will be removed
in Velocity 2.0.  Instead, please use the automatically provided $evaluate namespace to get
and set local references (e.g. #set($evaluate.foo = 'bar') and $evaluate.foo).
[WARNING] The directive.evaluate.context.class property has been deprecated. It will be removed
in Velocity 2.0.  Instead, please use the automatically provided $evaluate namespace to get
and set local references (e.g. #set($evaluate.foo = 'bar') and $evaluate.foo).
[WARNING] The directive.evaluate.context.class property has been deprecated. It will be removed
in Velocity 2.0.  Instead, please use the automatically provided $evaluate namespace to get
and set local references (e.g. #set($evaluate.foo = 'bar') and $evaluate.foo).
[WARNING] The directive.evaluate.context.class property has been deprecated. It will be removed
in Velocity 2.0.  Instead, please use the automatically provided $evaluate namespace to get
and set local references (e.g. #set($evaluate.foo = 'bar') and $evaluate.foo).
[WARNING] The directive.evaluate.context.class property has been deprecated. It will be removed
in Velocity 2.0.  Instead, please use the automatically provided $evaluate namespace to get
and set local references (e.g. #set($evaluate.foo = 'bar') and $evaluate.foo).
[WARNING] The directive.evaluate.context.class property has been deprecated. It will be removed
in Velocity 2.0.  Instead, please use the automatically provided $evaluate namespace to get
and set local references (e.g. #set($evaluate.foo = 'bar') and $evaluate.foo).
[WARNING] The directive.evaluate.context.class property has been deprecated. It will be removed
in Velocity 2.0.  Instead, please use the automatically provided $evaluate namespace to get
and set local references (e.g. #set($evaluate.foo = 'bar') and $evaluate.foo).
[WARNING] The directive.evaluate.context.class property has been deprecated. It will be removed
in Velocity 2.0.  Instead, please use the automatically provided $evaluate namespace to get
and set local references (e.g. #set($evaluate.foo = 'bar') and $evaluate.foo).
[INFO] Rendering 2 generated Doxia documents: 2 xdoc
[JENKINS] Archiving site from <https://builds.apache.org/job/openmeetings/ws/openmeetings-server/target/site>
to /x1/jenkins/jenkins-home/jobs/openmeetings/site/openmeetings-server
[INFO] 
[INFO] --- maven-resources-plugin:3.1.0:resources (default-resources) @ openmeetings-server
---
[INFO] Using 'UTF-8' encoding to copy filtered resources.
[INFO] skip non existing resourceDirectory <https://builds.apache.org/job/openmeetings/ws/openmeetings-server/src/main/resources>
[INFO] Copying 3 resources
[INFO] 
[INFO] --- wagon-maven-plugin:2.0.0:download-single (download-web-server) @ openmeetings-server
---
[INFO] Downloading: http://archive.apache.org/dist/tomcat/tomcat-9/v9.0.12/bin/apache-tomcat-9.0.12.tar.gz
to <https://builds.apache.org/job/openmeetings/ws/openmeetings-server/web-server/apache-tomcat-9.0.12.tar.gz>
[INFO] 
[INFO] --- maven-compiler-plugin:3.8.0:compile (default-compile) @ openmeetings-server ---
[INFO] No sources to compile
[INFO] 
[INFO] --- maven-resources-plugin:3.1.0:testResources (default-testResources) @ openmeetings-server
---
[INFO] Using 'UTF-8' encoding to copy filtered resources.
[INFO] skip non existing resourceDirectory <https://builds.apache.org/job/openmeetings/ws/openmeetings-server/src/test/resources>
[INFO] Copying 3 resources
[INFO] 
[INFO] --- maven-compiler-plugin:3.8.0:testCompile (default-testCompile) @ openmeetings-server
---
[INFO] No sources to compile
[INFO] 
[INFO] --- maven-surefire-plugin:2.22.0:test (default-test) @ openmeetings-server ---
[JENKINS] Recording test results
[INFO] 
[INFO] --- maven-antrun-plugin:1.8:run (unpack-web-server) @ openmeetings-server ---
[INFO] Executing tasks

main:
    [untar] Expanding: <https://builds.apache.org/job/openmeetings/ws/openmeetings-server/web-server/apache-tomcat-9.0.12.tar.gz>
into <https://builds.apache.org/job/openmeetings/ws/openmeetings-server/target>
[INFO] Executed tasks
[INFO] 
[INFO] --- maven-jar-plugin:3.1.0:jar (default-jar) @ openmeetings-server ---
[INFO] Building jar: <https://builds.apache.org/job/openmeetings/ws/openmeetings-server/target/openmeetings-server-5.0.0-SNAPSHOT.jar>
[INFO] 
[INFO] --- maven-site-plugin:3.7.1:attach-descriptor (attach-descriptor) @ openmeetings-server
---
[INFO] Skipping because packaging 'jar' is not pom.
[INFO] 
[INFO] --- maven-assembly-plugin:3.1.0:single (prepare-site) @ openmeetings-server ---
[INFO] Reading assembly descriptor: <https://builds.apache.org/job/openmeetings/ws/openmeetings-server/src/main/assembly/site.xml>
[INFO] Copying files to <https://builds.apache.org/job/openmeetings/ws/openmeetings-server/target/site>
[WARNING] Assembly file: <https://builds.apache.org/job/openmeetings/ws/openmeetings-server/target/site>
is not a regular file (it may be a directory). It cannot be attached to the project build
for installation or deployment.
[INFO] 
[INFO] --- maven-assembly-plugin:3.1.0:single (make-assembly) @ openmeetings-server ---
[INFO] Reading assembly descriptor: <https://builds.apache.org/job/openmeetings/ws/openmeetings-server/src/main/assembly/server.xml>
[INFO] Building tar: <https://builds.apache.org/job/openmeetings/ws/openmeetings-server/target/apache-openmeetings-5.0.0-SNAPSHOT.tar.gz>
[INFO] Building zip: <https://builds.apache.org/job/openmeetings/ws/openmeetings-server/target/apache-openmeetings-5.0.0-SNAPSHOT.zip>
[INFO] 
[INFO] --- maven-assembly-plugin:3.1.0:single (make-src) @ openmeetings-server ---
[INFO] Reading assembly descriptor: <https://builds.apache.org/job/openmeetings/ws/openmeetings-server/src/main/assembly/src.xml>
[INFO] Building tar: <https://builds.apache.org/job/openmeetings/ws/openmeetings-server/target/apache-openmeetings-5.0.0-SNAPSHOT-src.tar.gz>
[INFO] Building zip: <https://builds.apache.org/job/openmeetings/ws/openmeetings-server/target/apache-openmeetings-5.0.0-SNAPSHOT-src.zip>
[INFO] 
[INFO] --- maven-antrun-plugin:1.8:run (copy-site) @ openmeetings-server ---
[INFO] Executing tasks

main:
     [copy] Copying 1237 files to <https://builds.apache.org/job/openmeetings/ws/target/site>
[INFO] Executed tasks
[INFO] 
[INFO] --- maven-install-plugin:2.5.2:install (default-install) @ openmeetings-server ---
[INFO] Installing <https://builds.apache.org/job/openmeetings/ws/openmeetings-server/target/openmeetings-server-5.0.0-SNAPSHOT.jar>
to /home/jenkins/jenkins-slave/maven-repositories/1/org/apache/openmeetings/openmeetings-server/5.0.0-SNAPSHOT/openmeetings-server-5.0.0-SNAPSHOT.jar
[INFO] Installing <https://builds.apache.org/job/openmeetings/ws/openmeetings-server/pom.xml>
to /home/jenkins/jenkins-slave/maven-repositories/1/org/apache/openmeetings/openmeetings-server/5.0.0-SNAPSHOT/openmeetings-server-5.0.0-SNAPSHOT.pom
[INFO] Installing <https://builds.apache.org/job/openmeetings/ws/openmeetings-server/target/apache-openmeetings-5.0.0-SNAPSHOT.tar.gz>
to /home/jenkins/jenkins-slave/maven-repositories/1/org/apache/openmeetings/openmeetings-server/5.0.0-SNAPSHOT/openmeetings-server-5.0.0-SNAPSHOT.tar.gz
[INFO] Installing <https://builds.apache.org/job/openmeetings/ws/openmeetings-server/target/apache-openmeetings-5.0.0-SNAPSHOT.zip>
to /home/jenkins/jenkins-slave/maven-repositories/1/org/apache/openmeetings/openmeetings-server/5.0.0-SNAPSHOT/openmeetings-server-5.0.0-SNAPSHOT.zip
[INFO] Installing <https://builds.apache.org/job/openmeetings/ws/openmeetings-server/target/apache-openmeetings-5.0.0-SNAPSHOT-src.tar.gz>
to /home/jenkins/jenkins-slave/maven-repositories/1/org/apache/openmeetings/openmeetings-server/5.0.0-SNAPSHOT/openmeetings-server-5.0.0-SNAPSHOT-src.tar.gz
[INFO] Installing <https://builds.apache.org/job/openmeetings/ws/openmeetings-server/target/apache-openmeetings-5.0.0-SNAPSHOT-src.zip>
to /home/jenkins/jenkins-slave/maven-repositories/1/org/apache/openmeetings/openmeetings-server/5.0.0-SNAPSHOT/openmeetings-server-5.0.0-SNAPSHOT-src.zip
[INFO] 
[INFO] ------------< org.apache.openmeetings:openmeetings-parent >-------------
[INFO] Building Openmeetings 5.0.0-SNAPSHOT                             [11/10]
[INFO] --------------------------------[ pom ]---------------------------------
[INFO] 
[INFO] --- sonar-maven-plugin:3.5.0.1254:sonar (default-cli) @ openmeetings-parent ---
[INFO] User cache: /home/jenkins/.sonar/cache
[INFO] SonarQube version: 5.6.3
[INFO] Default locale: "en", source code encoding: "UTF-8"
[INFO] Load global repositories
[INFO] ------------------------------------------------------------------------
[INFO] Reactor Summary:
[INFO] 
[INFO] Openmeetings 5.0.0-SNAPSHOT ........................ FAILURE [  2.996 s]
[INFO] Openmeetings Util .................................. SUCCESS [03:49 min]
[INFO] Openmeetings DB .................................... SUCCESS [ 46.428 s]
[INFO] Openmeetings Core .................................. SUCCESS [ 45.440 s]
[INFO] Openmeetings Install ............................... SUCCESS [ 27.553 s]
[INFO] Openmeetings Service ............................... SUCCESS [ 25.993 s]
[INFO] Openmeetings Webservices ........................... SUCCESS [ 59.388 s]
[INFO] Openmeetings Web ................................... SUCCESS [30:19 min]
[INFO] Openmeetings Screen Sharing applet ................. SUCCESS [ 29.759 s]
[INFO] Openmeetings Server 5.0.0-SNAPSHOT ................. SUCCESS [ 57.286 s]
[INFO] ------------------------------------------------------------------------
[INFO] BUILD FAILURE
[INFO] ------------------------------------------------------------------------
[INFO] Total time: 40:58 min
[INFO] Finished at: 2018-10-23T08:27:14Z
[INFO] ------------------------------------------------------------------------
Waiting for Jenkins to finish collecting data
[ERROR] Failed to execute goal org.sonarsource.scanner.maven:sonar-maven-plugin:3.5.0.1254:sonar
(default-cli) on project openmeetings-parent: You're not authorized to execute any SonarQube
analysis. Please contact your SonarQube administrator. -> [Help 1]
[ERROR] 
[ERROR] To see the full stack trace of the errors, re-run Maven with the -e switch.
[ERROR] Re-run Maven using the -X switch to enable full debug logging.
[ERROR] 
[ERROR] For more information about the errors and possible solutions, please read the following
articles:
[ERROR] [Help 1] http://cwiki.apache.org/confluence/display/MAVEN/MojoExecutionException
[JENKINS] Archiving <https://builds.apache.org/job/openmeetings/ws/openmeetings-server/pom.xml>
to org.apache.openmeetings/openmeetings-server/5.0.0-SNAPSHOT/openmeetings-server-5.0.0-SNAPSHOT.pom
[JENKINS] Archiving <https://builds.apache.org/job/openmeetings/ws/openmeetings-server/target/openmeetings-server-5.0.0-SNAPSHOT.jar>
to org.apache.openmeetings/openmeetings-server/5.0.0-SNAPSHOT/openmeetings-server-5.0.0-SNAPSHOT.jar
[JENKINS] Archiving <https://builds.apache.org/job/openmeetings/ws/openmeetings-server/target/apache-openmeetings-5.0.0-SNAPSHOT.tar.gz>
to org.apache.openmeetings/openmeetings-server/5.0.0-SNAPSHOT/openmeetings-server-5.0.0-SNAPSHOT.tar.gz
[JENKINS] Archiving <https://builds.apache.org/job/openmeetings/ws/openmeetings-server/target/apache-openmeetings-5.0.0-SNAPSHOT.zip>
to org.apache.openmeetings/openmeetings-server/5.0.0-SNAPSHOT/openmeetings-server-5.0.0-SNAPSHOT.zip
[JENKINS] Archiving <https://builds.apache.org/job/openmeetings/ws/openmeetings-server/target/apache-openmeetings-5.0.0-SNAPSHOT-src.tar.gz>
to org.apache.openmeetings/openmeetings-server/5.0.0-SNAPSHOT/openmeetings-server-5.0.0-SNAPSHOT-src.tar.gz
[JENKINS] Archiving <https://builds.apache.org/job/openmeetings/ws/openmeetings-server/target/apache-openmeetings-5.0.0-SNAPSHOT-src.zip>
to org.apache.openmeetings/openmeetings-server/5.0.0-SNAPSHOT/openmeetings-server-5.0.0-SNAPSHOT-src.zip
[Fast Archiver] Compressed 314.74 MB of artifacts by 39.2% relative to #2615
[JENKINS] Archiving <https://builds.apache.org/job/openmeetings/ws/openmeetings-screenshare/pom.xml>
to org.apache.openmeetings/openmeetings-screenshare/5.0.0-SNAPSHOT/openmeetings-screenshare-5.0.0-SNAPSHOT.pom
[JENKINS] Archiving <https://builds.apache.org/job/openmeetings/ws/openmeetings-screenshare/target/openmeetings-screenshare-5.0.0-SNAPSHOT.jar>
to org.apache.openmeetings/openmeetings-screenshare/5.0.0-SNAPSHOT/openmeetings-screenshare-5.0.0-SNAPSHOT.jar
[JENKINS] Archiving <https://builds.apache.org/job/openmeetings/ws/openmeetings-screenshare/target/jnlp/openmeetings-screenshare-5.0.0-SNAPSHOT-full.jar>
to org.apache.openmeetings/openmeetings-screenshare/5.0.0-SNAPSHOT/openmeetings-screenshare-5.0.0-SNAPSHOT-full.jar
[Fast Archiver] Compressed 10.81 MB of artifacts by 84.7% relative to #2615
[JENKINS] Archiving <https://builds.apache.org/job/openmeetings/ws/openmeetings-util/pom.xml>
to org.apache.openmeetings/openmeetings-util/5.0.0-SNAPSHOT/openmeetings-util-5.0.0-SNAPSHOT.pom
[JENKINS] Archiving <https://builds.apache.org/job/openmeetings/ws/openmeetings-util/target/openmeetings-util-5.0.0-SNAPSHOT.jar>
to org.apache.openmeetings/openmeetings-util/5.0.0-SNAPSHOT/openmeetings-util-5.0.0-SNAPSHOT.jar
[JENKINS] Archiving <https://builds.apache.org/job/openmeetings/ws/openmeetings-util/target/openmeetings-util-5.0.0-SNAPSHOT-tests.jar>
to org.apache.openmeetings/openmeetings-util/5.0.0-SNAPSHOT/openmeetings-util-5.0.0-SNAPSHOT-tests.jar
[Fast Archiver] No artifacts from openmeetings » Openmeetings Util #2616 to compare, so performing
full copy of artifacts
[JENKINS] Archiving <https://builds.apache.org/job/openmeetings/ws/openmeetings-install/pom.xml>
to org.apache.openmeetings/openmeetings-install/5.0.0-SNAPSHOT/openmeetings-install-5.0.0-SNAPSHOT.pom
[JENKINS] Archiving <https://builds.apache.org/job/openmeetings/ws/openmeetings-install/target/openmeetings-install-5.0.0-SNAPSHOT.jar>
to org.apache.openmeetings/openmeetings-install/5.0.0-SNAPSHOT/openmeetings-install-5.0.0-SNAPSHOT.jar
[Fast Archiver] No artifacts from openmeetings » Openmeetings Install #2616 to compare, so
performing full copy of artifacts
[JENKINS] Archiving <https://builds.apache.org/job/openmeetings/ws/openmeetings-service/pom.xml>
to org.apache.openmeetings/openmeetings-service/5.0.0-SNAPSHOT/openmeetings-service-5.0.0-SNAPSHOT.pom
[JENKINS] Archiving <https://builds.apache.org/job/openmeetings/ws/openmeetings-service/target/openmeetings-service-5.0.0-SNAPSHOT.jar>
to org.apache.openmeetings/openmeetings-service/5.0.0-SNAPSHOT/openmeetings-service-5.0.0-SNAPSHOT.jar
[Fast Archiver] No artifacts from openmeetings » Openmeetings Service #2616 to compare, so
performing full copy of artifacts
[JENKINS] Archiving <https://builds.apache.org/job/openmeetings/ws/pom.xml> to org.apache.openmeetings/openmeetings-parent/5.0.0-SNAPSHOT/openmeetings-parent-5.0.0-SNAPSHOT.pom
[JENKINS] Archiving <https://builds.apache.org/job/openmeetings/ws/target/openmeetings-parent-5.0.0-SNAPSHOT-site.xml>
to org.apache.openmeetings/openmeetings-parent/5.0.0-SNAPSHOT/openmeetings-parent-5.0.0-SNAPSHOT-site.xml
[Fast Archiver] No artifacts from openmeetings » Openmeetings #2616 to compare, so performing
full copy of artifacts
[JENKINS] Archiving <https://builds.apache.org/job/openmeetings/ws/openmeetings-db/pom.xml>
to org.apache.openmeetings/openmeetings-db/5.0.0-SNAPSHOT/openmeetings-db-5.0.0-SNAPSHOT.pom
[JENKINS] Archiving <https://builds.apache.org/job/openmeetings/ws/openmeetings-db/target/openmeetings-db-5.0.0-SNAPSHOT.jar>
to org.apache.openmeetings/openmeetings-db/5.0.0-SNAPSHOT/openmeetings-db-5.0.0-SNAPSHOT.jar
[Fast Archiver] No artifacts from openmeetings » Openmeetings DB #2616 to compare, so performing
full copy of artifacts
[JENKINS] Archiving <https://builds.apache.org/job/openmeetings/ws/openmeetings-web/pom.xml>
to org.apache.openmeetings/openmeetings-web/5.0.0-SNAPSHOT/openmeetings-web-5.0.0-SNAPSHOT.pom
[JENKINS] Archiving <https://builds.apache.org/job/openmeetings/ws/openmeetings-web/target/openmeetings-web-5.0.0-SNAPSHOT.war>
to org.apache.openmeetings/openmeetings-web/5.0.0-SNAPSHOT/openmeetings-web-5.0.0-SNAPSHOT.war
[Fast Archiver] Compressed 116.73 MB of artifacts by 89.5% relative to #2615
[JENKINS] Archiving <https://builds.apache.org/job/openmeetings/ws/openmeetings-webservice/pom.xml>
to org.apache.openmeetings/openmeetings-webservice/5.0.0-SNAPSHOT/openmeetings-webservice-5.0.0-SNAPSHOT.pom
[JENKINS] Archiving <https://builds.apache.org/job/openmeetings/ws/openmeetings-webservice/target/openmeetings-webservice-5.0.0-SNAPSHOT.jar>
to org.apache.openmeetings/openmeetings-webservice/5.0.0-SNAPSHOT/openmeetings-webservice-5.0.0-SNAPSHOT.jar
[Fast Archiver] No artifacts from openmeetings » Openmeetings Webservices #2616 to compare,
so performing full copy of artifacts
[JENKINS] Archiving <https://builds.apache.org/job/openmeetings/ws/openmeetings-core/pom.xml>
to org.apache.openmeetings/openmeetings-core/5.0.0-SNAPSHOT/openmeetings-core-5.0.0-SNAPSHOT.pom
[JENKINS] Archiving <https://builds.apache.org/job/openmeetings/ws/openmeetings-core/target/openmeetings-core-5.0.0-SNAPSHOT.jar>
to org.apache.openmeetings/openmeetings-core/5.0.0-SNAPSHOT/openmeetings-core-5.0.0-SNAPSHOT.jar
[JENKINS] Archiving <https://builds.apache.org/job/openmeetings/ws/openmeetings-core/target/openmeetings-core-5.0.0-SNAPSHOT-tests.jar>
to org.apache.openmeetings/openmeetings-core/5.0.0-SNAPSHOT/openmeetings-core-5.0.0-SNAPSHOT-tests.jar
[Fast Archiver] No artifacts from openmeetings » Openmeetings Core #2616 to compare, so performing
full copy of artifacts
Sending e-mails to: dev@openmeetings.apache.org
channel stopped
Archiving artifacts
[Fast Archiver] Compressed 314.72 MB of artifacts by 39.0% relative to #2609
Not sending mail to unregistered user solomax666@gmail.com

Mime
View raw message