openmeetings-dev mailing list archives

Site index · List index
Message view « Date » · « Thread »
Top « Date » · « Thread »
From Apache Jenkins Server <jenk...@builds.apache.org>
Subject Build failed in Jenkins: openmeetings » Openmeetings Server #2606
Date Fri, 19 Oct 2018 09:19:47 GMT
See <https://builds.apache.org/job/openmeetings/org.apache.openmeetings$openmeetings-server/2606/display/redirect>

------------------------------------------
[...truncated 13.27 KB...]
    at org.apache.maven.plugins.site.render.SiteMojo.execute (SiteMojo.java:147)
    at org.apache.maven.plugin.DefaultBuildPluginManager.executeMojo (DefaultBuildPluginManager.java:137)
    at org.apache.maven.lifecycle.internal.MojoExecutor.execute (MojoExecutor.java:208)
    at org.apache.maven.lifecycle.internal.MojoExecutor.execute (MojoExecutor.java:154)
    at org.apache.maven.lifecycle.internal.MojoExecutor.execute (MojoExecutor.java:146)
    at org.apache.maven.lifecycle.internal.LifecycleModuleBuilder.buildProject (LifecycleModuleBuilder.java:117)
    at org.apache.maven.lifecycle.internal.LifecycleModuleBuilder.buildProject (LifecycleModuleBuilder.java:81)
    at org.apache.maven.lifecycle.internal.builder.singlethreaded.SingleThreadedBuilder.build
(SingleThreadedBuilder.java:56)
    at org.apache.maven.lifecycle.internal.LifecycleStarter.execute (LifecycleStarter.java:128)
    at org.apache.maven.DefaultMaven.doExecute (DefaultMaven.java:305)
    at org.apache.maven.DefaultMaven.doExecute (DefaultMaven.java:192)
    at org.apache.maven.DefaultMaven.execute (DefaultMaven.java:105)
    at org.jvnet.hudson.maven3.launcher.Maven35Launcher.main (Maven35Launcher.java:130)
    at sun.reflect.NativeMethodAccessorImpl.invoke0 (Native Method)
    at sun.reflect.NativeMethodAccessorImpl.invoke (NativeMethodAccessorImpl.java:62)
    at sun.reflect.DelegatingMethodAccessorImpl.invoke (DelegatingMethodAccessorImpl.java:43)
    at java.lang.reflect.Method.invoke (Method.java:498)
    at org.codehaus.plexus.classworlds.launcher.Launcher.launchEnhanced (Launcher.java:289)
    at org.codehaus.plexus.classworlds.launcher.Launcher.launch (Launcher.java:229)
    at jenkins.maven3.agent.Maven35Main.launch (Maven35Main.java:176)
    at sun.reflect.NativeMethodAccessorImpl.invoke0 (Native Method)
    at sun.reflect.NativeMethodAccessorImpl.invoke (NativeMethodAccessorImpl.java:62)
    at sun.reflect.DelegatingMethodAccessorImpl.invoke (DelegatingMethodAccessorImpl.java:43)
    at java.lang.reflect.Method.invoke (Method.java:498)
    at hudson.maven.Maven3Builder.call (Maven3Builder.java:139)
    at hudson.maven.Maven3Builder.call (Maven3Builder.java:70)
    at hudson.remoting.UserRequest.perform (UserRequest.java:212)
    at hudson.remoting.UserRequest.perform (UserRequest.java:54)
    at hudson.remoting.Request$2.run (Request.java:369)
    at hudson.remoting.InterceptingExecutorService$1.call (InterceptingExecutorService.java:72)
    at java.util.concurrent.FutureTask.run (FutureTask.java:266)
    at java.util.concurrent.ThreadPoolExecutor.runWorker (ThreadPoolExecutor.java:1149)
    at java.util.concurrent.ThreadPoolExecutor$Worker.run (ThreadPoolExecutor.java:624)
    at java.lang.Thread.run (Thread.java:748)
Caused by: org.apache.maven.model.building.ModelBuildingException: 1 problem was encountered
while building the effective model for org.postgresql:postgresql:42.2.5
[ERROR] Unknown packaging: bundle @ line 11, column 14

    at org.apache.maven.model.building.DefaultModelProblemCollector.newModelBuildingException
(DefaultModelProblemCollector.java:197)
    at org.apache.maven.model.building.DefaultModelBuilder.build (DefaultModelBuilder.java:482)
    at org.apache.maven.model.building.DefaultModelBuilder.build (DefaultModelBuilder.java:424)
    at org.apache.maven.model.building.DefaultModelBuilder.build (DefaultModelBuilder.java:414)
    at org.apache.maven.project.DefaultProjectBuilder.build (DefaultProjectBuilder.java:158)
    at org.apache.maven.project.DefaultProjectBuilder.build (DefaultProjectBuilder.java:327)
    at org.apache.maven.report.projectinfo.dependencies.RepositoryUtils.getMavenProjectFromRepository
(RepositoryUtils.java:125)
    at org.apache.maven.report.projectinfo.dependencies.renderer.DependenciesRenderer.renderArtifactRow
(DependenciesRenderer.java:799)
    at org.apache.maven.report.projectinfo.dependencies.renderer.DependenciesRenderer.renderDependenciesForScope
(DependenciesRenderer.java:749)
    at org.apache.maven.report.projectinfo.dependencies.renderer.DependenciesRenderer.renderDependenciesForAllScopes
(DependenciesRenderer.java:415)
    at org.apache.maven.report.projectinfo.dependencies.renderer.DependenciesRenderer.renderSectionProjectTransitiveDependencies
(DependenciesRenderer.java:438)
    at org.apache.maven.report.projectinfo.dependencies.renderer.DependenciesRenderer.renderBody
(DependenciesRenderer.java:219)
    at org.apache.maven.reporting.AbstractMavenReportRenderer.render (AbstractMavenReportRenderer.java:80)
    at org.apache.maven.report.projectinfo.DependenciesReport.executeReport (DependenciesReport.java:162)
    at org.apache.maven.reporting.AbstractMavenReport.generate (AbstractMavenReport.java:251)
    at org.apache.maven.plugins.site.render.ReportDocumentRenderer.renderDocument (ReportDocumentRenderer.java:230)
    at org.apache.maven.doxia.siterenderer.DefaultSiteRenderer.render (DefaultSiteRenderer.java:349)
    at org.apache.maven.plugins.site.render.SiteMojo.renderLocale (SiteMojo.java:198)
    at org.apache.maven.plugins.site.render.SiteMojo.execute (SiteMojo.java:147)
    at org.apache.maven.plugin.DefaultBuildPluginManager.executeMojo (DefaultBuildPluginManager.java:137)
    at org.apache.maven.lifecycle.internal.MojoExecutor.execute (MojoExecutor.java:208)
    at org.apache.maven.lifecycle.internal.MojoExecutor.execute (MojoExecutor.java:154)
    at org.apache.maven.lifecycle.internal.MojoExecutor.execute (MojoExecutor.java:146)
    at org.apache.maven.lifecycle.internal.LifecycleModuleBuilder.buildProject (LifecycleModuleBuilder.java:117)
    at org.apache.maven.lifecycle.internal.LifecycleModuleBuilder.buildProject (LifecycleModuleBuilder.java:81)
    at org.apache.maven.lifecycle.internal.builder.singlethreaded.SingleThreadedBuilder.build
(SingleThreadedBuilder.java:56)
    at org.apache.maven.lifecycle.internal.LifecycleStarter.execute (LifecycleStarter.java:128)
    at org.apache.maven.DefaultMaven.doExecute (DefaultMaven.java:305)
    at org.apache.maven.DefaultMaven.doExecute (DefaultMaven.java:192)
    at org.apache.maven.DefaultMaven.execute (DefaultMaven.java:105)
    at org.jvnet.hudson.maven3.launcher.Maven35Launcher.main (Maven35Launcher.java:130)
    at sun.reflect.NativeMethodAccessorImpl.invoke0 (Native Method)
    at sun.reflect.NativeMethodAccessorImpl.invoke (NativeMethodAccessorImpl.java:62)
    at sun.reflect.DelegatingMethodAccessorImpl.invoke (DelegatingMethodAccessorImpl.java:43)
    at java.lang.reflect.Method.invoke (Method.java:498)
    at org.codehaus.plexus.classworlds.launcher.Launcher.launchEnhanced (Launcher.java:289)
    at org.codehaus.plexus.classworlds.launcher.Launcher.launch (Launcher.java:229)
    at jenkins.maven3.agent.Maven35Main.launch (Maven35Main.java:176)
    at sun.reflect.NativeMethodAccessorImpl.invoke0 (Native Method)
    at sun.reflect.NativeMethodAccessorImpl.invoke (NativeMethodAccessorImpl.java:62)
    at sun.reflect.DelegatingMethodAccessorImpl.invoke (DelegatingMethodAccessorImpl.java:43)
    at java.lang.reflect.Method.invoke (Method.java:498)
    at hudson.maven.Maven3Builder.call (Maven3Builder.java:139)
    at hudson.maven.Maven3Builder.call (Maven3Builder.java:70)
    at hudson.remoting.UserRequest.perform (UserRequest.java:212)
    at hudson.remoting.UserRequest.perform (UserRequest.java:54)
    at hudson.remoting.Request$2.run (Request.java:369)
    at hudson.remoting.InterceptingExecutorService$1.call (InterceptingExecutorService.java:72)
    at java.util.concurrent.FutureTask.run (FutureTask.java:266)
    at java.util.concurrent.ThreadPoolExecutor.runWorker (ThreadPoolExecutor.java:1149)
    at java.util.concurrent.ThreadPoolExecutor$Worker.run (ThreadPoolExecutor.java:624)
    at java.lang.Thread.run (Thread.java:748)
[WARNING] Failure to transfer org.apache.wicket:wicket-parent:8.2.0-SNAPSHOT/maven-metadata.xml
from http://snapshots.repository.codehaus.org was cached in the local repository, resolution
will not be reattempted until the update interval of codehaus-snapshots has elapsed or updates
are forced. Original error: Could not transfer metadata org.apache.wicket:wicket-parent:8.2.0-SNAPSHOT/maven-metadata.xml
from/to codehaus-snapshots (http://nexus.codehaus.org/snapshots/): Error transferring file:
nexus.codehaus.org from http://nexus.codehaus.org/snapshots/org/apache/wicket/wicket-parent/8.2.0-SNAPSHOT/maven-metadata.xml
[WARNING] Failure to transfer org.apache.wicket:wicket-parent:8.2.0-SNAPSHOT/maven-metadata.xml
from https://artifacts.unidata.ucar.edu/content/repositories/unidata-3rdparty/ was cached
in the local repository, resolution will not be reattempted until the update interval of unidata-3rdparty
has elapsed or updates are forced. Original error: Could not transfer metadata org.apache.wicket:wicket-parent:8.2.0-SNAPSHOT/maven-metadata.xml
from/to unidata-3rdparty (https://artifacts.unidata.ucar.edu/content/repositories/unidata-3rdparty/):
Error transferring file: Server returned HTTP response code: 400 for URL: https://artifacts.unidata.ucar.edu/content/repositories/unidata-3rdparty/org/apache/wicket/wicket-parent/8.2.0-SNAPSHOT/maven-metadata.xml
from https://artifacts.unidata.ucar.edu/content/repositories/unidata-3rdparty/org/apache/wicket/wicket-parent/8.2.0-SNAPSHOT/maven-metadata.xml
[WARNING] Failure to transfer org.apache.wicket:wicket-native-websocket:8.2.0-SNAPSHOT/maven-metadata.xml
from http://snapshots.repository.codehaus.org was cached in the local repository, resolution
will not be reattempted until the update interval of codehaus-snapshots has elapsed or updates
are forced. Original error: Could not transfer metadata org.apache.wicket:wicket-native-websocket:8.2.0-SNAPSHOT/maven-metadata.xml
from/to codehaus-snapshots (http://nexus.codehaus.org/snapshots/): Error transferring file:
nexus.codehaus.org from http://nexus.codehaus.org/snapshots/org/apache/wicket/wicket-native-websocket/8.2.0-SNAPSHOT/maven-metadata.xml
[WARNING] Failure to transfer org.apache.wicket:wicket-native-websocket:8.2.0-SNAPSHOT/maven-metadata.xml
from https://artifacts.unidata.ucar.edu/content/repositories/unidata-3rdparty/ was cached
in the local repository, resolution will not be reattempted until the update interval of unidata-3rdparty
has elapsed or updates are forced. Original error: Could not transfer metadata org.apache.wicket:wicket-native-websocket:8.2.0-SNAPSHOT/maven-metadata.xml
from/to unidata-3rdparty (https://artifacts.unidata.ucar.edu/content/repositories/unidata-3rdparty/):
Error transferring file: Server returned HTTP response code: 400 for URL: https://artifacts.unidata.ucar.edu/content/repositories/unidata-3rdparty/org/apache/wicket/wicket-native-websocket/8.2.0-SNAPSHOT/maven-metadata.xml
from https://artifacts.unidata.ucar.edu/content/repositories/unidata-3rdparty/org/apache/wicket/wicket-native-websocket/8.2.0-SNAPSHOT/maven-metadata.xml
[WARNING] Failure to transfer org.apache.openjpa:openjpa-parent:3.0.1-SNAPSHOT/maven-metadata.xml
from https://artifacts.unidata.ucar.edu/content/repositories/unidata-3rdparty/ was cached
in the local repository, resolution will not be reattempted until the update interval of unidata-3rdparty
has elapsed or updates are forced. Original error: Could not transfer metadata org.apache.openjpa:openjpa-parent:3.0.1-SNAPSHOT/maven-metadata.xml
from/to unidata-3rdparty (https://artifacts.unidata.ucar.edu/content/repositories/unidata-3rdparty/):
Error transferring file: Server returned HTTP response code: 400 for URL: https://artifacts.unidata.ucar.edu/content/repositories/unidata-3rdparty/org/apache/openjpa/openjpa-parent/3.0.1-SNAPSHOT/maven-metadata.xml
from https://artifacts.unidata.ucar.edu/content/repositories/unidata-3rdparty/org/apache/openjpa/openjpa-parent/3.0.1-SNAPSHOT/maven-metadata.xml
[WARNING] Failure to transfer org.apache.openjpa:openjpa-parent:3.0.1-SNAPSHOT/maven-metadata.xml
from http://snapshots.repository.codehaus.org was cached in the local repository, resolution
will not be reattempted until the update interval of codehaus-snapshots has elapsed or updates
are forced. Original error: Could not transfer metadata org.apache.openjpa:openjpa-parent:3.0.1-SNAPSHOT/maven-metadata.xml
from/to codehaus-snapshots (http://nexus.codehaus.org/snapshots/): Error transferring file:
nexus.codehaus.org from http://nexus.codehaus.org/snapshots/org/apache/openjpa/openjpa-parent/3.0.1-SNAPSHOT/maven-metadata.xml
[WARNING] Failure to transfer org.apache.openjpa:openjpa-parent:3.0.1-SNAPSHOT/maven-metadata.xml
from https://artifacts.unidata.ucar.edu/content/repositories/unidata-3rdparty/ was cached
in the local repository, resolution will not be reattempted until the update interval of unidata-3rdparty
has elapsed or updates are forced. Original error: Could not transfer metadata org.apache.openjpa:openjpa-parent:3.0.1-SNAPSHOT/maven-metadata.xml
from/to unidata-3rdparty (https://artifacts.unidata.ucar.edu/content/repositories/unidata-3rdparty/):
Error transferring file: Server returned HTTP response code: 400 for URL: https://artifacts.unidata.ucar.edu/content/repositories/unidata-3rdparty/org/apache/openjpa/openjpa-parent/3.0.1-SNAPSHOT/maven-metadata.xml
from https://artifacts.unidata.ucar.edu/content/repositories/unidata-3rdparty/org/apache/openjpa/openjpa-parent/3.0.1-SNAPSHOT/maven-metadata.xml
[WARNING] Failure to transfer org.apache.openjpa:openjpa-parent:3.0.1-SNAPSHOT/maven-metadata.xml
from http://snapshots.repository.codehaus.org was cached in the local repository, resolution
will not be reattempted until the update interval of codehaus-snapshots has elapsed or updates
are forced. Original error: Could not transfer metadata org.apache.openjpa:openjpa-parent:3.0.1-SNAPSHOT/maven-metadata.xml
from/to codehaus-snapshots (http://nexus.codehaus.org/snapshots/): Error transferring file:
nexus.codehaus.org from http://nexus.codehaus.org/snapshots/org/apache/openjpa/openjpa-parent/3.0.1-SNAPSHOT/maven-metadata.xml
[WARNING] Unable to create Maven project from repository for artifact org.postgresql:postgresql:jar:42.2.5
org.apache.maven.project.ProjectBuildingException: Some problems were encountered while processing
the POMs:
[ERROR] Unknown packaging: bundle @ line 11, column 14

    at org.apache.maven.project.DefaultProjectBuilder.build (DefaultProjectBuilder.java:192)
    at org.apache.maven.project.DefaultProjectBuilder.build (DefaultProjectBuilder.java:327)
    at org.apache.maven.report.projectinfo.dependencies.RepositoryUtils.getMavenProjectFromRepository
(RepositoryUtils.java:125)
    at org.apache.maven.report.projectinfo.dependencies.renderer.DependenciesRenderer.printDescriptionsAndURLs
(DependenciesRenderer.java:890)
    at org.apache.maven.report.projectinfo.dependencies.renderer.DependenciesRenderer.printDependencyListing
(DependenciesRenderer.java:847)
    at org.apache.maven.report.projectinfo.dependencies.renderer.DependenciesRenderer.printDependencyListing
(DependenciesRenderer.java:867)
    at org.apache.maven.report.projectinfo.dependencies.renderer.DependenciesRenderer.printDependencyListing
(DependenciesRenderer.java:867)
    at org.apache.maven.report.projectinfo.dependencies.renderer.DependenciesRenderer.printDependencyListing
(DependenciesRenderer.java:867)
    at org.apache.maven.report.projectinfo.dependencies.renderer.DependenciesRenderer.printDependencyListing
(DependenciesRenderer.java:867)
    at org.apache.maven.report.projectinfo.dependencies.renderer.DependenciesRenderer.renderSectionDependencyTree
(DependenciesRenderer.java:486)
    at org.apache.maven.report.projectinfo.dependencies.renderer.DependenciesRenderer.renderSectionProjectDependencyGraph
(DependenciesRenderer.java:449)
    at org.apache.maven.report.projectinfo.dependencies.renderer.DependenciesRenderer.renderBody
(DependenciesRenderer.java:222)
    at org.apache.maven.reporting.AbstractMavenReportRenderer.render (AbstractMavenReportRenderer.java:80)
    at org.apache.maven.report.projectinfo.DependenciesReport.executeReport (DependenciesReport.java:162)
    at org.apache.maven.reporting.AbstractMavenReport.generate (AbstractMavenReport.java:251)
    at org.apache.maven.plugins.site.render.ReportDocumentRenderer.renderDocument (ReportDocumentRenderer.java:230)
    at org.apache.maven.doxia.siterenderer.DefaultSiteRenderer.render (DefaultSiteRenderer.java:349)
    at org.apache.maven.plugins.site.render.SiteMojo.renderLocale (SiteMojo.java:198)
    at org.apache.maven.plugins.site.render.SiteMojo.execute (SiteMojo.java:147)
    at org.apache.maven.plugin.DefaultBuildPluginManager.executeMojo (DefaultBuildPluginManager.java:137)
    at org.apache.maven.lifecycle.internal.MojoExecutor.execute (MojoExecutor.java:208)
    at org.apache.maven.lifecycle.internal.MojoExecutor.execute (MojoExecutor.java:154)
    at org.apache.maven.lifecycle.internal.MojoExecutor.execute (MojoExecutor.java:146)
    at org.apache.maven.lifecycle.internal.LifecycleModuleBuilder.buildProject (LifecycleModuleBuilder.java:117)
    at org.apache.maven.lifecycle.internal.LifecycleModuleBuilder.buildProject (LifecycleModuleBuilder.java:81)
    at org.apache.maven.lifecycle.internal.builder.singlethreaded.SingleThreadedBuilder.build
(SingleThreadedBuilder.java:56)
    at org.apache.maven.lifecycle.internal.LifecycleStarter.execute (LifecycleStarter.java:128)
    at org.apache.maven.DefaultMaven.doExecute (DefaultMaven.java:305)
    at org.apache.maven.DefaultMaven.doExecute (DefaultMaven.java:192)
    at org.apache.maven.DefaultMaven.execute (DefaultMaven.java:105)
    at org.jvnet.hudson.maven3.launcher.Maven35Launcher.main (Maven35Launcher.java:130)
    at sun.reflect.NativeMethodAccessorImpl.invoke0 (Native Method)
    at sun.reflect.NativeMethodAccessorImpl.invoke (NativeMethodAccessorImpl.java:62)
    at sun.reflect.DelegatingMethodAccessorImpl.invoke (DelegatingMethodAccessorImpl.java:43)
    at java.lang.reflect.Method.invoke (Method.java:498)
    at org.codehaus.plexus.classworlds.launcher.Launcher.launchEnhanced (Launcher.java:289)
    at org.codehaus.plexus.classworlds.launcher.Launcher.launch (Launcher.java:229)
    at jenkins.maven3.agent.Maven35Main.launch (Maven35Main.java:176)
    at sun.reflect.NativeMethodAccessorImpl.invoke0 (Native Method)
    at sun.reflect.NativeMethodAccessorImpl.invoke (NativeMethodAccessorImpl.java:62)
    at sun.reflect.DelegatingMethodAccessorImpl.invoke (DelegatingMethodAccessorImpl.java:43)
    at java.lang.reflect.Method.invoke (Method.java:498)
    at hudson.maven.Maven3Builder.call (Maven3Builder.java:139)
    at hudson.maven.Maven3Builder.call (Maven3Builder.java:70)
    at hudson.remoting.UserRequest.perform (UserRequest.java:212)
    at hudson.remoting.UserRequest.perform (UserRequest.java:54)
    at hudson.remoting.Request$2.run (Request.java:369)
    at hudson.remoting.InterceptingExecutorService$1.call (InterceptingExecutorService.java:72)
    at java.util.concurrent.FutureTask.run (FutureTask.java:266)
    at java.util.concurrent.ThreadPoolExecutor.runWorker (ThreadPoolExecutor.java:1149)
    at java.util.concurrent.ThreadPoolExecutor$Worker.run (ThreadPoolExecutor.java:624)
    at java.lang.Thread.run (Thread.java:748)
Caused by: org.apache.maven.model.building.ModelBuildingException: 1 problem was encountered
while building the effective model for org.postgresql:postgresql:42.2.5
[ERROR] Unknown packaging: bundle @ line 11, column 14

    at org.apache.maven.model.building.DefaultModelProblemCollector.newModelBuildingException
(DefaultModelProblemCollector.java:197)
    at org.apache.maven.model.building.DefaultModelBuilder.build (DefaultModelBuilder.java:482)
    at org.apache.maven.model.building.DefaultModelBuilder.build (DefaultModelBuilder.java:424)
    at org.apache.maven.model.building.DefaultModelBuilder.build (DefaultModelBuilder.java:414)
    at org.apache.maven.project.DefaultProjectBuilder.build (DefaultProjectBuilder.java:158)
    at org.apache.maven.project.DefaultProjectBuilder.build (DefaultProjectBuilder.java:327)
    at org.apache.maven.report.projectinfo.dependencies.RepositoryUtils.getMavenProjectFromRepository
(RepositoryUtils.java:125)
    at org.apache.maven.report.projectinfo.dependencies.renderer.DependenciesRenderer.printDescriptionsAndURLs
(DependenciesRenderer.java:890)
    at org.apache.maven.report.projectinfo.dependencies.renderer.DependenciesRenderer.printDependencyListing
(DependenciesRenderer.java:847)
    at org.apache.maven.report.projectinfo.dependencies.renderer.DependenciesRenderer.printDependencyListing
(DependenciesRenderer.java:867)
    at org.apache.maven.report.projectinfo.dependencies.renderer.DependenciesRenderer.printDependencyListing
(DependenciesRenderer.java:867)
    at org.apache.maven.report.projectinfo.dependencies.renderer.DependenciesRenderer.printDependencyListing
(DependenciesRenderer.java:867)
    at org.apache.maven.report.projectinfo.dependencies.renderer.DependenciesRenderer.printDependencyListing
(DependenciesRenderer.java:867)
    at org.apache.maven.report.projectinfo.dependencies.renderer.DependenciesRenderer.renderSectionDependencyTree
(DependenciesRenderer.java:486)
    at org.apache.maven.report.projectinfo.dependencies.renderer.DependenciesRenderer.renderSectionProjectDependencyGraph
(DependenciesRenderer.java:449)
    at org.apache.maven.report.projectinfo.dependencies.renderer.DependenciesRenderer.renderBody
(DependenciesRenderer.java:222)
    at org.apache.maven.reporting.AbstractMavenReportRenderer.render (AbstractMavenReportRenderer.java:80)
    at org.apache.maven.report.projectinfo.DependenciesReport.executeReport (DependenciesReport.java:162)
    at org.apache.maven.reporting.AbstractMavenReport.generate (AbstractMavenReport.java:251)
    at org.apache.maven.plugins.site.render.ReportDocumentRenderer.renderDocument (ReportDocumentRenderer.java:230)
    at org.apache.maven.doxia.siterenderer.DefaultSiteRenderer.render (DefaultSiteRenderer.java:349)
    at org.apache.maven.plugins.site.render.SiteMojo.renderLocale (SiteMojo.java:198)
    at org.apache.maven.plugins.site.render.SiteMojo.execute (SiteMojo.java:147)
    at org.apache.maven.plugin.DefaultBuildPluginManager.executeMojo (DefaultBuildPluginManager.java:137)
    at org.apache.maven.lifecycle.internal.MojoExecutor.execute (MojoExecutor.java:208)
    at org.apache.maven.lifecycle.internal.MojoExecutor.execute (MojoExecutor.java:154)
    at org.apache.maven.lifecycle.internal.MojoExecutor.execute (MojoExecutor.java:146)
    at org.apache.maven.lifecycle.internal.LifecycleModuleBuilder.buildProject (LifecycleModuleBuilder.java:117)
    at org.apache.maven.lifecycle.internal.LifecycleModuleBuilder.buildProject (LifecycleModuleBuilder.java:81)
    at org.apache.maven.lifecycle.internal.builder.singlethreaded.SingleThreadedBuilder.build
(SingleThreadedBuilder.java:56)
    at org.apache.maven.lifecycle.internal.LifecycleStarter.execute (LifecycleStarter.java:128)
    at org.apache.maven.DefaultMaven.doExecute (DefaultMaven.java:305)
    at org.apache.maven.DefaultMaven.doExecute (DefaultMaven.java:192)
    at org.apache.maven.DefaultMaven.execute (DefaultMaven.java:105)
    at org.jvnet.hudson.maven3.launcher.Maven35Launcher.main (Maven35Launcher.java:130)
    at sun.reflect.NativeMethodAccessorImpl.invoke0 (Native Method)
    at sun.reflect.NativeMethodAccessorImpl.invoke (NativeMethodAccessorImpl.java:62)
    at sun.reflect.DelegatingMethodAccessorImpl.invoke (DelegatingMethodAccessorImpl.java:43)
    at java.lang.reflect.Method.invoke (Method.java:498)
    at org.codehaus.plexus.classworlds.launcher.Launcher.launchEnhanced (Launcher.java:289)
    at org.codehaus.plexus.classworlds.launcher.Launcher.launch (Launcher.java:229)
    at jenkins.maven3.agent.Maven35Main.launch (Maven35Main.java:176)
    at sun.reflect.NativeMethodAccessorImpl.invoke0 (Native Method)
    at sun.reflect.NativeMethodAccessorImpl.invoke (NativeMethodAccessorImpl.java:62)
    at sun.reflect.DelegatingMethodAccessorImpl.invoke (DelegatingMethodAccessorImpl.java:43)
    at java.lang.reflect.Method.invoke (Method.java:498)
    at hudson.maven.Maven3Builder.call (Maven3Builder.java:139)
    at hudson.maven.Maven3Builder.call (Maven3Builder.java:70)
    at hudson.remoting.UserRequest.perform (UserRequest.java:212)
    at hudson.remoting.UserRequest.perform (UserRequest.java:54)
    at hudson.remoting.Request$2.run (Request.java:369)
    at hudson.remoting.InterceptingExecutorService$1.call (InterceptingExecutorService.java:72)
    at java.util.concurrent.FutureTask.run (FutureTask.java:266)
    at java.util.concurrent.ThreadPoolExecutor.runWorker (ThreadPoolExecutor.java:1149)
    at java.util.concurrent.ThreadPoolExecutor$Worker.run (ThreadPoolExecutor.java:624)
    at java.lang.Thread.run (Thread.java:748)
[WARNING] Failure to transfer org.apache.wicket:wicket-parent:8.2.0-SNAPSHOT/maven-metadata.xml
from http://snapshots.repository.codehaus.org was cached in the local repository, resolution
will not be reattempted until the update interval of codehaus-snapshots has elapsed or updates
are forced. Original error: Could not transfer metadata org.apache.wicket:wicket-parent:8.2.0-SNAPSHOT/maven-metadata.xml
from/to codehaus-snapshots (http://nexus.codehaus.org/snapshots/): Error transferring file:
nexus.codehaus.org from http://nexus.codehaus.org/snapshots/org/apache/wicket/wicket-parent/8.2.0-SNAPSHOT/maven-metadata.xml
[WARNING] Failure to transfer org.apache.wicket:wicket-parent:8.2.0-SNAPSHOT/maven-metadata.xml
from https://artifacts.unidata.ucar.edu/content/repositories/unidata-3rdparty/ was cached
in the local repository, resolution will not be reattempted until the update interval of unidata-3rdparty
has elapsed or updates are forced. Original error: Could not transfer metadata org.apache.wicket:wicket-parent:8.2.0-SNAPSHOT/maven-metadata.xml
from/to unidata-3rdparty (https://artifacts.unidata.ucar.edu/content/repositories/unidata-3rdparty/):
Error transferring file: Server returned HTTP response code: 400 for URL: https://artifacts.unidata.ucar.edu/content/repositories/unidata-3rdparty/org/apache/wicket/wicket-parent/8.2.0-SNAPSHOT/maven-metadata.xml
from https://artifacts.unidata.ucar.edu/content/repositories/unidata-3rdparty/org/apache/wicket/wicket-parent/8.2.0-SNAPSHOT/maven-metadata.xml
[WARNING] Failure to transfer org.apache.wicket:wicket-parent:8.2.0-SNAPSHOT/maven-metadata.xml
from http://snapshots.repository.codehaus.org was cached in the local repository, resolution
will not be reattempted until the update interval of codehaus-snapshots has elapsed or updates
are forced. Original error: Could not transfer metadata org.apache.wicket:wicket-parent:8.2.0-SNAPSHOT/maven-metadata.xml
from/to codehaus-snapshots (http://nexus.codehaus.org/snapshots/): Error transferring file:
nexus.codehaus.org from http://nexus.codehaus.org/snapshots/org/apache/wicket/wicket-parent/8.2.0-SNAPSHOT/maven-metadata.xml
[WARNING] Failure to transfer org.apache.wicket:wicket-parent:8.2.0-SNAPSHOT/maven-metadata.xml
from https://artifacts.unidata.ucar.edu/content/repositories/unidata-3rdparty/ was cached
in the local repository, resolution will not be reattempted until the update interval of unidata-3rdparty
has elapsed or updates are forced. Original error: Could not transfer metadata org.apache.wicket:wicket-parent:8.2.0-SNAPSHOT/maven-metadata.xml
from/to unidata-3rdparty (https://artifacts.unidata.ucar.edu/content/repositories/unidata-3rdparty/):
Error transferring file: Server returned HTTP response code: 400 for URL: https://artifacts.unidata.ucar.edu/content/repositories/unidata-3rdparty/org/apache/wicket/wicket-parent/8.2.0-SNAPSHOT/maven-metadata.xml
from https://artifacts.unidata.ucar.edu/content/repositories/unidata-3rdparty/org/apache/wicket/wicket-parent/8.2.0-SNAPSHOT/maven-metadata.xml
[INFO] Generating "Dependency Convergence" report --- maven-project-info-reports-plugin:3.0.0:dependency-convergence
[INFO] Generating "Dependency Management" report --- maven-project-info-reports-plugin:3.0.0:dependency-management
[INFO] Generating "Distribution Management" report --- maven-project-info-reports-plugin:3.0.0:distribution-management
[INFO] Generating "Issue Management" report     --- maven-project-info-reports-plugin:3.0.0:issue-management
[INFO] Generating "Licenses" report             --- maven-project-info-reports-plugin:3.0.0:licenses
[INFO] Generating "Mailing Lists" report        --- maven-project-info-reports-plugin:3.0.0:mailing-lists
[INFO] Generating "Plugin Management" report    --- maven-project-info-reports-plugin:3.0.0:plugin-management
[INFO] Generating "Plugins" report              --- maven-project-info-reports-plugin:3.0.0:plugins
[INFO] Generating "Team" report                 --- maven-project-info-reports-plugin:3.0.0:team
[INFO] Generating "Source Code Management" report --- maven-project-info-reports-plugin:3.0.0:scm
[INFO] Generating "Summary" report              --- maven-project-info-reports-plugin:3.0.0:summary
[INFO] Generating "Surefire Report" report      --- maven-surefire-report-plugin:2.22.0:report-only
[WARNING] Unable to locate Test Source XRef to link to - DISABLED
[INFO] Generating "Rat Report" report           --- apache-rat-plugin:0.12:rat
[INFO] Added 1 additional default licenses.
[INFO] Enabled default license matchers.
[INFO] Added 1 custom approved licenses.
[INFO] Will parse SCM ignores for exclusions...
[INFO] Finished adding exclusions from SCM ignore files.
[INFO] 61 implicit excludes (use -debug for more details).
[INFO] Exclude: **/*.mp3
[INFO] Exclude: **/keystore
[INFO] 179 resources included (use -debug for more details)
[INFO] Rendering 2 generated Doxia documents: 2 xdoc
[JENKINS] Archiving site from <https://builds.apache.org/job/openmeetings/org.apache.openmeetings$openmeetings-server/ws/target/site>
to /x1/jenkins/jenkins-home/jobs/openmeetings/site/openmeetings-server
[INFO] 
[INFO] --- maven-resources-plugin:3.1.0:resources (default-resources) @ openmeetings-server
---
[INFO] Using 'UTF-8' encoding to copy filtered resources.
[INFO] skip non existing resourceDirectory <https://builds.apache.org/job/openmeetings/org.apache.openmeetings$openmeetings-server/ws/src/main/resources>
[INFO] Copying 3 resources
[INFO] 
[INFO] --- wagon-maven-plugin:2.0.0:download-single (download-web-server) @ openmeetings-server
---
[INFO] Downloading: http://archive.apache.org/dist/tomcat/tomcat-9/v9.0.12/bin/apache-tomcat-9.0.12.tar.gz
to <https://builds.apache.org/job/openmeetings/org.apache.openmeetings$openmeetings-server/ws/web-server/apache-tomcat-9.0.12.tar.gz>

Mime
View raw message