openmeetings-dev mailing list archives

Site index · List index
Message view « Date » · « Thread »
Top « Date » · « Thread »
From Apache Jenkins Server <jenk...@builds.apache.org>
Subject Build failed in Jenkins: OpenMeetings 4.0.x #468
Date Sat, 13 Oct 2018 17:22:22 GMT
See <https://builds.apache.org/job/OpenMeetings%204.0.x/468/display/redirect?page=changes>

Changes:

[solomax666] no jira: switching to the next dev version

------------------------------------------
[...truncated 822.36 KB...]
     * @param {Number} [options.saturate=0] Value to saturate the image (-1...1)
                       ^

[WARNING] wb.js:23595: WARNING - Parse error. invalid param name "options.imageData"
     * @param {ImageData} options.imageData The Uint8ClampedArray to be filtered.
                          ^

[WARNING] wb.js:23937: WARNING - Parse error. invalid param name "options.imageData"
     * @param {ImageData} options.imageData The Uint8Array to be filtered.
                          ^

[WARNING] wb.js:24037: WARNING - Parse error. invalid param name "options.passes"
     * @param {Number} options.passes The number of filters remaining to be applied.
                       ^

[WARNING] wb.js:24160: WARNING - Parse error. invalid param name "options.passes"
     * @param {Number} options.passes The number of filters remaining to be executed
                       ^

[WARNING] wb.js:24161: WARNING - Parse error. invalid param name "options.webgl"
     * @param {Boolean} options.webgl Whether to use webgl to render the filter.
                        ^

[WARNING] wb.js:24162: WARNING - Parse error. invalid param name "options.sourceTexture"
     * @param {WebGLTexture} options.sourceTexture The texture setup as the source to be filtered.
                             ^

[WARNING] wb.js:24163: WARNING - Parse error. invalid param name "options.targetTexture"
     * @param {WebGLTexture} options.targetTexture The texture where filtered output should
be drawn.
                             ^

[WARNING] wb.js:24164: WARNING - Parse error. invalid param name "options.context"
     * @param {WebGLRenderingContext} options.context The GL context used for rendering.
                                      ^

[WARNING] wb.js:24165: WARNING - Parse error. invalid param name "options.programCache"
     * @param {Object} options.programCache A map of compiled shader programs, keyed by filter
type.
                       ^

[WARNING] wb.js:24617: WARNING - Parse error. invalid param name "dim.x"
     * @param {Object} dim.x width of object to be cached
                       ^

[WARNING] wb.js:24618: WARNING - Parse error. invalid param name "dim.y"
     * @param {Object} dim.y height of object to be cached
                       ^

[WARNING] wb.js:24665: WARNING - Parse error. invalid param name "charStyle.fontFamily"
     * @param {String} [charStyle.fontFamily] Font Family
                       ^

[WARNING] wb.js:24666: WARNING - Parse error. invalid param name "charStyle.fontSize"
     * @param {Number} [charStyle.fontSize] Font size in pixels. ( without px suffix )
                       ^

[WARNING] wb.js:24667: WARNING - Parse error. invalid param name "charStyle.fontWeight"
     * @param {String} [charStyle.fontWeight] Font weight
                       ^

[WARNING] wb.js:24668: WARNING - Parse error. invalid param name "charStyle.fontStyle"
     * @param {String} [charStyle.fontStyle] Font style (italic|normal)
                       ^

[WARNING] wb.js:24772: WARNING - Parse error. invalid param name "decl.fontFamily"
     * @param {String} decl.fontFamily fontFamily
                       ^

[WARNING] wb.js:24773: WARNING - Parse error. invalid param name "decl.fontStyle"
     * @param {String} decl.fontStyle fontStyle
                       ^

[WARNING] wb.js:24774: WARNING - Parse error. invalid param name "decl.fontWeight"
     * @param {String} decl.fontWeight fontWeight
                       ^

[WARNING] wb.js:25158: WARNING - Parse error. illegal use of unknown JSDoc tag "chainable";
ignoring it
     * @chainable
       ^

[WARNING] wb.js:25169: WARNING - Parse error. illegal use of unknown JSDoc tag "chainable";
ignoring it
     * @chainable
       ^

[WARNING] wb.js:25182: WARNING - Parse error. illegal use of unknown JSDoc tag "chainable";
ignoring it
     * @chainable
       ^

[WARNING] wb.js:25472: WARNING - Parse error. illegal use of unknown JSDoc tag "chainable";
ignoring it
     * @chainable
       ^

[WARNING] wb.js:25851: WARNING - Parse error. illegal use of unknown JSDoc tag "chainable";
ignoring it
     * @chainable
       ^

[WARNING] wb.js:26636: WARNING - Parse error. illegal use of unknown JSDoc tag "chainable";
ignoring it
     * @chainable
       ^

[WARNING] wb.js:26773: WARNING - Parse error. illegal use of unknown JSDoc tag "chainable";
ignoring it
     * @chainable
       ^

[WARNING] wb.js:26790: WARNING - Parse error. illegal use of unknown JSDoc tag "chainable";
ignoring it
     * @chainable
       ^

[WARNING] wb.js:27059: WARNING - Parse error. illegal use of unknown JSDoc tag "chainable";
ignoring it
     * @chainable
       ^

[WARNING] wb.js:29069: WARNING - "arguments.callee" cannot be used in ES5 strict mode
    return function () {return arguments.callee.Init.call(this,arguments)};
                               ^

[WARNING] wb.js:29228: WARNING - "arguments.callee" cannot be used in ES5 strict mode
    var cb = function () {return arguments.callee.execute.apply(arguments.callee,arguments)};
                                 ^

[WARNING] wb.js:29228: WARNING - "arguments.callee" cannot be used in ES5 strict mode
    var cb = function () {return arguments.callee.execute.apply(arguments.callee,arguments)};
                                                                ^

[WARNING] wb.js:31161: WARNING - "arguments.callee" cannot be used in ES5 strict mode
    if (arguments.callee.disabled) return;
        ^

[WARNING] 0 error(s), 295 warning(s)
[INFO] Uncompressed size: 2005188 bytes.
[INFO] Compressed size: 983009 bytes minified (327248 bytes gzipped).
[INFO] 
[INFO] 
[INFO] --- minify-maven-plugin:1.7.6:minify (fileinput-js) @ openmeetings-web ---
[INFO] Starting CSS task:
[INFO] Processing source file [fileinput.css].
[INFO] Creating the merged file [omfileinput.css].
[INFO] Creating the minified file [omfileinput.min.css].
[INFO] Uncompressed size: 5016 bytes.
[INFO] Compressed size: 4228 bytes minified (1148 bytes gzipped).
[INFO] 
[INFO] Starting JavaScript task:
[INFO] Processing source file [fileinput.js].
[INFO] Creating the merged file [omfileinput.js].
[INFO] Creating the minified file [omfileinput.min.js].
[INFO] Uncompressed size: 6567 bytes.
[INFO] Compressed size: 3875 bytes minified (1246 bytes gzipped).
[INFO] 
[INFO] 
[INFO] --- minify-maven-plugin:1.7.6:minify (room-js) @ openmeetings-web ---
[INFO] Starting CSS task:
[INFO] Starting JavaScript task:
[INFO] Processing source file [jquery.dialogextend.js].
[INFO] Processing source file [raw-video-util.js].
[INFO] Processing source file [raw-video.js].
[INFO] Processing source file [raw-video-manager.js].
[INFO] Processing source file [raw-room.js].
[INFO] Creating the merged file [room.js].
[INFO] Creating the minified file [room.min.js].
[INFO] Uncompressed size: 38456 bytes.
[INFO] Compressed size: 24861 bytes minified (7576 bytes gzipped).
[INFO] 
[INFO] 
[INFO] --- minify-maven-plugin:1.7.6:minify (settings-js) @ openmeetings-web ---
[INFO] Starting JavaScript task:
[INFO] Processing source file [raw-settings.js].
[INFO] Creating the merged file [settings.js].
[INFO] Creating the minified file [settings.min.js].
[INFO] Uncompressed size: 6912 bytes.
[INFO] Compressed size: 4478 bytes minified (1734 bytes gzipped).
[INFO] 
[INFO] Starting CSS task:
[INFO] 
[INFO] --- minify-maven-plugin:1.7.6:minify (chat-js) @ openmeetings-web ---
[INFO] Starting CSS task:
[INFO] Starting JavaScript task:
[INFO] Processing source file [raw-cssemoticons.js].
[INFO] Processing source file [raw-chat.js].
[INFO] Creating the merged file [chat.js].
[INFO] Creating the minified file [chat.min.js].
[INFO] Uncompressed size: 18001 bytes.
[INFO] Compressed size: 10533 bytes minified (3894 bytes gzipped).
[INFO] 
[INFO] 
[INFO] --- maven-compiler-plugin:3.8.0:compile (default-compile) @ openmeetings-web ---
[INFO] Changes detected - recompiling the module!
[INFO] Compiling 229 source files to <https://builds.apache.org/job/OpenMeetings%204.0.x/ws/openmeetings-web/target/classes>
[INFO] 
[INFO] --- maven-dependency-plugin:3.1.1:copy (copy-test-backups) @ openmeetings-web ---
[INFO] Configured Artifact: org.apache.openmeetings:test-backup:1.4:zip
[INFO] Downloading from openmeetings-bintray: https://dl.bintray.com/openmeetings/maven/org/apache/openmeetings/test-backup/1.4/test-backup-1.4.pom
[INFO] Downloading from jpresso: http://repository.jspresso.org/maven2/org/apache/openmeetings/test-backup/1.4/test-backup-1.4.pom
[INFO] Downloading from tudelft: http://simulation.tudelft.nl/maven/org/apache/openmeetings/test-backup/1.4/test-backup-1.4.pom
[INFO] Downloading from central: https://repo.maven.apache.org/maven2/org/apache/openmeetings/test-backup/1.4/test-backup-1.4.pom
[INFO] ------------------------------------------------------------------------
[INFO] Reactor Summary:
[INFO] 
[INFO] Openmeetings 4.0.7-SNAPSHOT ........................ SUCCESS [ 54.461 s]
[INFO] Openmeetings Util .................................. SUCCESS [03:35 min]
[INFO] Openmeetings DB .................................... SUCCESS [ 28.978 s]
[INFO] Openmeetings Core .................................. SUCCESS [ 35.920 s]
[INFO] Openmeetings Install ............................... SUCCESS [ 26.827 s]
[INFO] Openmeetings Service ............................... SUCCESS [ 24.388 s]
[INFO] Openmeetings Webservices ........................... SUCCESS [01:00 min]
[INFO] Openmeetings Web ................................... FAILURE [ 50.168 s]
[INFO] Openmeetings Flash ................................. SKIPPED
[INFO] Openmeetings Screen Sharing applet ................. SKIPPED
[INFO] Openmeetings Server 4.0.7-SNAPSHOT ................. SKIPPED
[INFO] ------------------------------------------------------------------------
[INFO] BUILD FAILURE
[INFO] ------------------------------------------------------------------------
[INFO] Total time: 08:51 min
[INFO] Finished at: 2018-10-13T17:22:02Z
[INFO] ------------------------------------------------------------------------
Waiting for Jenkins to finish collecting data
[ERROR] Failed to execute goal org.apache.maven.plugins:maven-dependency-plugin:3.1.1:copy
(copy-test-backups) on project openmeetings-web: Unable to find/resolve artifact. Failed to
read artifact descriptor for org.apache.openmeetings:test-backup:zip:1.4: Could not transfer
artifact org.apache.openmeetings:test-backup:pom:1.4 from/to tudelft (http://simulation.tudelft.nl/maven/):
simulation.tudelft.nl: Name or service not known: Unknown host simulation.tudelft.nl: Name
or service not known -> [Help 1]
[ERROR] 
[ERROR] To see the full stack trace of the errors, re-run Maven with the -e switch.
[ERROR] Re-run Maven using the -X switch to enable full debug logging.
[ERROR] 
[ERROR] For more information about the errors and possible solutions, please read the following
articles:
[ERROR] [Help 1] http://cwiki.apache.org/confluence/display/MAVEN/MojoExecutionException
[ERROR] 
[ERROR] After correcting the problems, you can resume the build with the command
[ERROR]   mvn <goals> -rf :openmeetings-web
[JENKINS] Archiving <https://builds.apache.org/job/OpenMeetings%204.0.x/ws/openmeetings-server/pom.xml>
to org.apache.openmeetings/openmeetings-server/4.0.7-SNAPSHOT/openmeetings-server-4.0.7-SNAPSHOT.pom
[JENKINS] Archiving <https://builds.apache.org/job/OpenMeetings%204.0.x/ws/openmeetings-screenshare/pom.xml>
to org.apache.openmeetings/openmeetings-screenshare/4.0.7-SNAPSHOT/openmeetings-screenshare-4.0.7-SNAPSHOT.pom
[JENKINS] Archiving <https://builds.apache.org/job/OpenMeetings%204.0.x/ws/openmeetings-util/pom.xml>
to org.apache.openmeetings/openmeetings-util/4.0.7-SNAPSHOT/openmeetings-util-4.0.7-SNAPSHOT.pom
[JENKINS] Archiving <https://builds.apache.org/job/OpenMeetings%204.0.x/ws/openmeetings-util/target/openmeetings-util-4.0.7-SNAPSHOT.jar>
to org.apache.openmeetings/openmeetings-util/4.0.7-SNAPSHOT/openmeetings-util-4.0.7-SNAPSHOT.jar
[JENKINS] Archiving <https://builds.apache.org/job/OpenMeetings%204.0.x/ws/openmeetings-util/target/openmeetings-util-4.0.7-SNAPSHOT-tests.jar>
to org.apache.openmeetings/openmeetings-util/4.0.7-SNAPSHOT/openmeetings-util-4.0.7-SNAPSHOT-tests.jar
[JENKINS] Archiving <https://builds.apache.org/job/OpenMeetings%204.0.x/ws/openmeetings-install/pom.xml>
to org.apache.openmeetings/openmeetings-install/4.0.7-SNAPSHOT/openmeetings-install-4.0.7-SNAPSHOT.pom
[JENKINS] Archiving <https://builds.apache.org/job/OpenMeetings%204.0.x/ws/openmeetings-install/target/openmeetings-install-4.0.7-SNAPSHOT.jar>
to org.apache.openmeetings/openmeetings-install/4.0.7-SNAPSHOT/openmeetings-install-4.0.7-SNAPSHOT.jar
[JENKINS] Archiving <https://builds.apache.org/job/OpenMeetings%204.0.x/ws/openmeetings-service/pom.xml>
to org.apache.openmeetings/openmeetings-service/4.0.7-SNAPSHOT/openmeetings-service-4.0.7-SNAPSHOT.pom
[JENKINS] Archiving <https://builds.apache.org/job/OpenMeetings%204.0.x/ws/openmeetings-service/target/openmeetings-service-4.0.7-SNAPSHOT.jar>
to org.apache.openmeetings/openmeetings-service/4.0.7-SNAPSHOT/openmeetings-service-4.0.7-SNAPSHOT.jar
[JENKINS] Archiving <https://builds.apache.org/job/OpenMeetings%204.0.x/ws/pom.xml>
to org.apache.openmeetings/openmeetings-parent/4.0.7-SNAPSHOT/openmeetings-parent-4.0.7-SNAPSHOT.pom
[JENKINS] Archiving <https://builds.apache.org/job/OpenMeetings%204.0.x/ws/target/openmeetings-parent-4.0.7-SNAPSHOT-site.xml>
to org.apache.openmeetings/openmeetings-parent/4.0.7-SNAPSHOT/openmeetings-parent-4.0.7-SNAPSHOT-site.xml
[JENKINS] Archiving <https://builds.apache.org/job/OpenMeetings%204.0.x/ws/openmeetings-db/pom.xml>
to org.apache.openmeetings/openmeetings-db/4.0.7-SNAPSHOT/openmeetings-db-4.0.7-SNAPSHOT.pom
[JENKINS] Archiving <https://builds.apache.org/job/OpenMeetings%204.0.x/ws/openmeetings-db/target/openmeetings-db-4.0.7-SNAPSHOT.jar>
to org.apache.openmeetings/openmeetings-db/4.0.7-SNAPSHOT/openmeetings-db-4.0.7-SNAPSHOT.jar
[JENKINS] Archiving <https://builds.apache.org/job/OpenMeetings%204.0.x/ws/openmeetings-web/pom.xml>
to org.apache.openmeetings/openmeetings-web/4.0.7-SNAPSHOT/openmeetings-web-4.0.7-SNAPSHOT.pom
[JENKINS] Archiving <https://builds.apache.org/job/OpenMeetings%204.0.x/ws/openmeetings-webservice/pom.xml>
to org.apache.openmeetings/openmeetings-webservice/4.0.7-SNAPSHOT/openmeetings-webservice-4.0.7-SNAPSHOT.pom
[JENKINS] Archiving <https://builds.apache.org/job/OpenMeetings%204.0.x/ws/openmeetings-webservice/target/openmeetings-webservice-4.0.7-SNAPSHOT.jar>
to org.apache.openmeetings/openmeetings-webservice/4.0.7-SNAPSHOT/openmeetings-webservice-4.0.7-SNAPSHOT.jar
[JENKINS] Archiving <https://builds.apache.org/job/OpenMeetings%204.0.x/ws/openmeetings-core/pom.xml>
to org.apache.openmeetings/openmeetings-core/4.0.7-SNAPSHOT/openmeetings-core-4.0.7-SNAPSHOT.pom
[JENKINS] Archiving <https://builds.apache.org/job/OpenMeetings%204.0.x/ws/openmeetings-core/target/openmeetings-core-4.0.7-SNAPSHOT.jar>
to org.apache.openmeetings/openmeetings-core/4.0.7-SNAPSHOT/openmeetings-core-4.0.7-SNAPSHOT.jar
[JENKINS] Archiving <https://builds.apache.org/job/OpenMeetings%204.0.x/ws/openmeetings-core/target/openmeetings-core-4.0.7-SNAPSHOT-tests.jar>
to org.apache.openmeetings/openmeetings-core/4.0.7-SNAPSHOT/openmeetings-core-4.0.7-SNAPSHOT-tests.jar
[JENKINS] Archiving <https://builds.apache.org/job/OpenMeetings%204.0.x/ws/openmeetings-flash/pom.xml>
to org.apache.openmeetings/openmeetings-flash/4.0.7-SNAPSHOT/openmeetings-flash-4.0.7-SNAPSHOT.pom
Not sending mail to unregistered user solomax666@gmail.com
Sending e-mails to: dev@openmeetings.apache.org
channel stopped
Archiving artifacts
Not sending mail to unregistered user solomax666@gmail.com

Mime
View raw message